[
  {
    "id": "1",
    "name": "Trip 1",
    "price": "$100",
    "img": "./img/image1_250.png",
    "article": "1121212",
    "color": "red"
  },
  {
    "id": "2",
    "name": "Trip 2",
    "price": "$130",
    "img": "./img/image2_250.png",
    "article": "114343412",
    "color": "orange"
  },
  {
    "id": "3",
    "name": "Trip 3",
    "price": "$140",
    "img": "./img/image3_250.png",
    "article": "1134341212",
    "color": "blue"
  },
  {
    "id": "4",
    "name": "Trip 4",
    "price": "$120",
    "img": "./img/image4_250.png",
    "article": "1341212",
    "color": "pink"
  },
  {
    "id": "5",
    "name": "Trip 5",
    "price": "$150",
    "img": "./img/image5_250.png",
    "article": "1331212",
    "color": "yellow"
  },
  {
    "id": "6",
    "name": "Trip 6",
    "price": "$180",
    "img": "./img/image6_250.png",
    "article": "11244412",
    "color": "gold"
  },
  {
    "id": "7",
    "name": "Trip 7",
    "price": "$1000",
    "img": "./img/image7_250.png",
    "article": "1128812",
    "color": "green"
  },
  {
    "id": "8",
    "name": "Trip 8",
    "price": "$1787",
    "img": "./img/image8_250.png",
    "article": "14441212",
    "color": "brown"
  },
  {
    "id": "9",
    "name": "Trip 9",
    "price": "$1099",
    "img": "./img/image9_250.png",
    "article": "12221212",
    "color": "violet"
  },
  {
    "id": "10",
    "name": "Trip 10",
    "price": "$17878",
    "img": "./img/image10_250.png",
    "article": "1133412",
    "color": "red"
  }
]