module gitlab.com/d.koshlyakov/clean_architecture

go 1.20

require (
	github.com/gorilla/mux v1.8.0
	github.com/jackc/pgx/v5 v5.4.3
	github.com/stretchr/testify v1.8.4
	gorm.io/gorm v1.25.4
)

require (
	github.com/davecgh/go-spew v1.1.1 // indirect
	github.com/jinzhu/inflection v1.0.0 // indirect
	github.com/jinzhu/now v1.1.5 // indirect
	github.com/kr/text v0.2.0 // indirect
	github.com/pmezard/go-difflib v1.0.0 // indirect
	github.com/rogpeppe/go-internal v1.11.0 // indirect
	gopkg.in/yaml.v3 v3.0.1 // indirect
)
