{
    "id": "core/fine/tall",
    "basic_name": "fine",
    "shape": "tall",
    "offset": -4,
    "att_ac_modifier": 8,
    "special_att_modifier": -16,
    "hide_modifier": 16,
    "space": 0.5,
    "reach": 0
}