{
    "id": "core/medium/long",
    "basic_name": "medium",
    "shape": "long",
    "offset": 0,
    "att_ac_modifier": 0,
    "special_att_modifier": 0,
    "hide_modifier": 0,
    "space": 5.0,
    "reach": 5
}