{
    "id": "core/large/tall",
    "basic_name": "large",
    "shape": "tall",
    "offset": 1,
    "att_ac_modifier": -1,
    "special_att_modifier": 4,
    "hide_modifier": -4,
    "space": 10.0,
    "reach": 10
}