{
  "modelPackage" : "it.list.poll.clientsdk.model",
  "apiPackage"   : "it.list.poll.clientsdk.api",
  "invokerPackage" : "it.list.poll.clientsdk.client",
  "groupId" : "it.list.poll",
  "artifactId"  : "clientsdk",
  "fullJavaUtil" : true,
  "dateLibrary" : "java8"
}  