// Jest Snapshot v1, https://goo.gl/fbAQLP

exports[`EditText renders correctly and onPress 1`] = `
<View
  style={
    Object {
      "paddingVertical": 8,
    }
  }
>
  <Text
    style={
      Object {
        "color": "#2C315D",
        "fontFamily": "TTProstoSans-Light",
        "fontSize": 25,
        "marginBottom": 5,
      }
    }
  >
    Edit text
  </Text>
  <View
    style={
      Object {
        "alignItems": "center",
        "justifyContent": "flex-end",
      }
    }
  >
    <View
      style={
        Object {
          "alignItems": "stretch",
          "borderColor": "#39414d",
          "borderRadius": 4,
          "borderWidth": 1,
          "flex": 1,
          "flexDirection": "row",
          "justifyContent": "space-between",
          "paddingLeft": 0,
          "paddingRight": 8,
          "paddingVertical": 8,
        }
      }
    >
      <TextInput
        autoCompleteType="off"
        autoFocus={false}
        multiline={false}
        numberOfLines={1}
        onChangeText={[Function]}
        placeholder="Enter text"
        placeholderTextColor="#39414d"
        style={
          Object {
            "alignContent": "flex-start",
            "backgroundColor": "transparent",
            "color": "#39414d",
            "flex": 1,
            "fontFamily": "TTProstoSans-Light",
            "fontSize": 14,
            "justifyContent": "center",
            "paddingBottom": 2,
            "paddingHorizontal": 16,
            "paddingTop": 0,
            "textAlignVertical": "center",
          }
        }
        underlineColorAndroid="transparent"
        value="Enter text"
      />
      <View />
    </View>
  </View>
</View>
`;
