{
  "localizationUrl": "http://138.68.108.105/uploads/Localization",
  "environment": "stage",
  "baseUrl": "http://datachains.world:9047/api",
  "locationSelectorDebounce": 200,
  "blocksTimeout": 30000,
  "pollTimeout": 120,
  "confirmMode": 0,
  "defaultSecretKey": "",
  "defaultSendAddress": "",
  "defaultSendAmount": "",
  "defaultSendMessage": "",
  "defaultSendHead": "",
  "hockeyAppId": "a95bb67870e94c71bf923bb1d8e16226",
  "licenseUrl": "http://138.68.108.105/uploads/License/Get",
  "networkPort": 9046,
  "tipsUrl": "http://138.68.108.105",
  "invoiceExpire": 86400,
  "genesisTimestamp": 1487844793333,
  "blockTimestamp": 120,
  "backupFileName": "safepay"
}
