// Jest Snapshot v1, https://goo.gl/fbAQLP

exports[`CopySecretKey renders correctly and onPress 1`] = `
<View>
  <View
    style={
      Object {
        "marginHorizontal": 16,
      }
    }
  >
    <View
      accessible={true}
      isTVSelectable={true}
      onResponderGrant={[Function]}
      onResponderMove={[Function]}
      onResponderRelease={[Function]}
      onResponderTerminate={[Function]}
      onResponderTerminationRequest={[Function]}
      onStartShouldSetResponder={[Function]}
      style={
        Object {
          "alignItems": "center",
          "backgroundColor": "#6E5EA3",
          "borderColor": "#39414d",
          "borderRadius": 4,
          "borderWidth": 0,
          "flexDirection": "row",
          "height": 100,
          "justifyContent": "center",
          "opacity": 1,
          "paddingHorizontal": 16,
          "paddingTop": 4,
        }
      }
    >
      <Text
        numberOfLines={1}
        style={
          Object {
            "color": "#fff",
            "flex": 1,
            "fontFamily": "TTProstoSans-Light",
            "fontSize": 29,
            "lineHeight": 45,
            "textAlign": "center",
            "textAlignVertical": "center",
          }
        }
      >
        Copy to clipboard 
      </Text>
    </View>
  </View>
  <View>
    <Text
      style={
        Object {
          "backgroundColor": "transparent",
          "color": "#39414d",
          "fontFamily": "TTProstoSans",
          "fontSize": 14,
          "lineHeight": 16,
          "paddingVertical": 24,
          "textAlign": "center",
        }
      }
    >
      Insert secret key to the next field
    </Text>
  </View>
  <View
    style={
      Object {
        "alignItems": "stretch",
        "borderColor": "#39414d",
        "borderRadius": 4,
        "borderWidth": 1,
        "flex": 1,
        "flexDirection": "row",
        "justifyContent": "space-between",
        "paddingLeft": 0,
        "paddingRight": 8,
        "paddingVertical": 8,
      }
    }
  >
    <TextInput
      autoFocus={false}
      editable={false}
      placeholderTextColor="#39414d"
      style={
        Object {
          "alignContent": "flex-start",
          "backgroundColor": "transparent",
          "color": "#39414d",
          "flex": 1,
          "fontFamily": "TTProstoSans-Light",
          "fontSize": 14,
          "justifyContent": "center",
          "paddingBottom": 2,
          "paddingHorizontal": 16,
          "paddingTop": 0,
          "textAlignVertical": "center",
        }
      }
      underlineColorAndroid="transparent"
      value="..."
    />
    <View
      accessible={true}
      isTVSelectable={true}
      onResponderGrant={[Function]}
      onResponderMove={[Function]}
      onResponderRelease={[Function]}
      onResponderTerminate={[Function]}
      onResponderTerminationRequest={[Function]}
      onStartShouldSetResponder={[Function]}
      style={
        Object {
          "opacity": 1,
        }
      }
    >
      <Image
        source={
          Object {
            "testUri": "../../../app/resources/images/icon_insert.png",
          }
        }
        style={
          Object {
            "height": 30,
            "width": 28,
          }
        }
      />
    </View>
  </View>
</View>
`;
