{
  "localizationUrl": "http://era.dextechnology.com:8000/uploads/Localization",
  "baseUrl": "http://89.235.184.229:9067/api",
  "dexBaseUrl":"http://sc.dextechnology.com:9067/api",
  "standardBaseUrl": "http://datachains.world:9067/api",
  "blocksPerRequest": 30,
  "blocksTimeout": 10000,
  "pollTimeout": 120,
  "confirmMode": 0,
  "build": 0,
  "defaultPin": "1111",
  "defaultPublicKey": "2M9WSqXrpmRzaQkxjcWKnrABabbwqjPbJktBDbPswgL7",
  "defaultSecretKey": "2HSpQKb7VLhmFMkW33qgEQDsEMQhTzMMAyn18XjPKhUsGT4qMUrfsiXUWDyB9D41A4L5sy2cAi8UCdh1nwkjqDwH",
  "defaultSendAddress": "7Dpv5Gi8HjCBgtDN1P1niuPJQCBQ5H8Zob",
  "defaultSendAmount": "0.01",
  "defaultSendMessage": "Test Send Message",
  "defaultSendHead": "Test Send Head",
  "environment": "development",
  "locationSelectorDebounce": 0,
  "jpegQuality": 80,
  "licenseUrl": "http://era.dextechnology.com:8000/uploads/License/Get",
  "maxImageSize": 20000,
  "minImageSize": 15000,
  "networkPort": 9066,
  "version": "",
  "tipsUrl": "http://era.dextechnology.com:8000",
  "invoiceExpire": 86400,
  "genesisTimestamp": 1511164500000,
  "blockTimestamp": 120,
  "backupFileName": "safepay"
}
