[
    {
      "name": "Австралийский доллар",
      "code": "AUD",
      "curr": 36
    },
    {
      "name": "Алжирский динар",
      "code": "DZD",
      "curr": 12
    },
    {
      "name": "Аргентинское песо",
      "code": "ARS",
      "curr": 32
    },
    {
      "name": "Армянский драм",
      "code": "AMD",
      "curr": 51
    },
    {
      "name": "Арубанский флорин",
      "code": "AWG",
      "curr": 533
    },
    {
      "name": "Афгани",
      "code": "AFN",
      "curr": 971
    },
    {
      "name": "Багамский доллар",
      "code": "BSD",
      "curr": 44
    },
    {
      "name": "Бальбоа",
      "code": "PAB",
      "curr": 590
    },
    {
      "name": "Барбадосский доллар",
      "code": "BBD",
      "curr": 52
    },
    {
      "name": "Бат",
      "code": "THB",
      "curr": 764
    },
    {
      "name": "Бахрейнский динар",
      "code": "BHD",
      "curr": 48
    },
    {
      "name": "Белизский доллар",
      "code": "BZD",
      "curr": 84
    },
    {
      "name": "Белорусский рубль",
      "code": "BYN",
      "curr": 933
    },
    {
      "name": "Белорусский рубль",
      "code": "BYR",
      "curr": 974
    },
    {
      "name": "Бермудский доллар",
      "code": "BMD",
      "curr": 60
    },
    {
      "name": "Болгарский лев",
      "code": "BGN",
      "curr": 975
    },
    {
      "name": "Боливар Соберано",
      "code": "VES",
      "curr": 928
    },
    {
      "name": "Боливиано",
      "code": "BOB",
      "curr": 68
    },
    {
      "name": "Бразильский реал",
      "code": "BRL",
      "curr": 986
    },
    {
      "name": "Брунейский доллар",
      "code": "BND",
      "curr": 96
    },
    {
      "name": "Бурундийский франк",
      "code": "BIF",
      "curr": 108
    },
    {
      "name": "Вату",
      "code": "VUV",
      "curr": 548
    },
    {
      "name": "Вона",
      "code": "KRW",
      "curr": 410
    },
    {
      "name": "Восточно-карибский доллар",
      "code": "XCD",
      "curr": 951
    },
    {
      "name": "Гайанский доллар",
      "code": "GYD",
      "curr": 328
    },
    {
      "name": "Ганский седи",
      "code": "GHS",
      "curr": 936
    },
    {
      "name": "Гвинейский франк",
      "code": "GNF",
      "curr": 324
    },
    {
      "name": "Гибралтарский фунт",
      "code": "GIP",
      "curr": 292
    },
    {
      "name": "Гонконгский доллар",
      "code": "HKD",
      "curr": 344
    },
    {
      "name": "Гривна",
      "code": "UAH",
      "curr": 980
    },
    {
      "name": "Гуарани",
      "code": "PYG",
      "curr": 600
    },
    {
      "name": "Гурд",
      "code": "HTG",
      "curr": 332
    },
    {
      "name": "Даласи",
      "code": "GMD",
      "curr": 270
    },
    {
      "name": "Датская крона",
      "code": "DKK",
      "curr": 208
    },
    {
      "name": "Денар",
      "code": "MKD",
      "curr": 807
    },
    {
      "name": "Дирхам (ОАЭ)",
      "code": "AED",
      "curr": 784
    },
    {
      "name": "Добра",
      "code": "STN",
      "curr": 930
    },
    {
      "name": "Доллар Зимбабве",
      "code": "ZWL",
      "curr": 932
    },
    {
      "name": "Доллар Намибии",
      "code": "NAD",
      "curr": 516
    },
    {
      "name": "Доллар Островов Кайман",
      "code": "KYD",
      "curr": 136
    },
    {
      "name": "Доллар США",
      "code": "USD",
      "curr": 840
    },
    {
      "name": "Доллар Соломоновых Островов",
      "code": "SBD",
      "curr": 90
    },
    {
      "name": "Доллар Тринидада и Тобаго",
      "code": "TTD",
      "curr": 780
    },
    {
      "name": "Доллар Фиджи",
      "code": "FJD",
      "curr": 242
    },
    {
      "name": "Доминиканское песо",
      "code": "DOP",
      "curr": 214
    },
    {
      "name": "Донг",
      "code": "VND",
      "curr": 704
    },
    {
      "name": "Евро",
      "code": "EUR",
      "curr": 978
    },
    {
      "name": "Египетский фунт",
      "code": "EGP",
      "curr": 818
    },
    {
      "name": "Единица реальной стоимости",
      "code": "COU",
      "curr": 970
    },
    {
      "name": "Замбийская квача",
      "code": "ZMW",
      "curr": 967
    },
    {
      "name": "Злотый",
      "code": "PLN",
      "curr": 985
    },
    {
      "name": "Золотая кордоба",
      "code": "NIO",
      "curr": 558
    },
    {
      "name": "Иена",
      "code": "JPY",
      "curr": 392
    },
    {
      "name": "Индийская рупия",
      "code": "INR",
      "curr": 356
    },
    {
      "name": "Иорданский динар",
      "code": "JOD",
      "curr": 400
    },
    {
      "name": "Иракский динар",
      "code": "IQD",
      "curr": 368
    },
    {
      "name": "Иранский риал",
      "code": "IRR",
      "curr": 364
    },
    {
      "name": "Исландская крона",
      "code": "ISK",
      "curr": 352
    },
    {
      "name": "Йеменский риал",
      "code": "YER",
      "curr": 886
    },
    {
      "name": "Канадский доллар",
      "code": "CAD",
      "curr": 124
    },
    {
      "name": "Катарский риал",
      "code": "QAR",
      "curr": 634
    },
    {
      "name": "Кванза",
      "code": "AOA",
      "curr": 973
    },
    {
      "name": "Кенийский шиллинг",
      "code": "KES",
      "curr": 404
    },
    {
      "name": "Кетсаль",
      "code": "GTQ",
      "curr": 320
    },
    {
      "name": "Кина",
      "code": "PGK",
      "curr": 598
    },
    {
      "name": "Колумбийское песо",
      "code": "COP",
      "curr": 170
    },
    {
      "name": "Коморский франк",
      "code": "KMF",
      "curr": 174
    },
    {
      "name": "Конвертируемая марка",
      "code": "ВАМ",
      "curr": 977
    },
    {
      "name": "Конвертируемое песо",
      "code": "CUC",
      "curr": 931
    },
    {
      "name": "Конголезский франк",
      "code": "CDF",
      "curr": 976
    },
    {
      "name": "Коста-риканский колон",
      "code": "CRC",
      "curr": 188
    },
    {
      "name": "Кубинское песо",
      "code": "CUP",
      "curr": 192
    },
    {
      "name": "Кувейтский динар",
      "code": "KWD",
      "curr": 414
    },
    {
      "name": "Куна",
      "code": "HRK",
      "curr": 191
    },
    {
      "name": "Кьят",
      "code": "MMK",
      "curr": 104
    },
    {
      "name": "Лаосский кип",
      "code": "LAK",
      "curr": 418
    },
    {
      "name": "Лари",
      "code": "GEL",
      "curr": 981
    },
    {
      "name": "Лек",
      "code": "ALL",
      "curr": 8
    },
    {
      "name": "Леоне",
      "code": "SLL",
      "curr": 694
    },
    {
      "name": "Либерийский доллар",
      "code": "LRD",
      "curr": 430
    },
    {
      "name": "Ливанский фунт",
      "code": "LBP",
      "curr": 422
    },
    {
      "name": "Ливийский динар",
      "code": "LYD",
      "curr": 434
    },
    {
      "name": "Лилангени",
      "code": "SZL",
      "curr": 748
    },
    {
      "name": "Лоти",
      "code": "LSL",
      "curr": 426
    },
    {
      "name": "Маврикийская рупия",
      "code": "MUR",
      "curr": 480
    },
    {
      "name": "Малавийская квача",
      "code": "MWK",
      "curr": 454
    },
    {
      "name": "Малагасийский ариари",
      "code": "MGA",
      "curr": 969
    },
    {
      "name": "Малайзийский ринггит",
      "code": "MYR",
      "curr": 458
    },
    {
      "name": "Марокканский дирхам",
      "code": "MAD",
      "curr": 504
    },
    {
      "name": "Мексиканское песо",
      "code": "MXN",
      "curr": 484
    },
    {
      "name": "Мозамбикский метикал",
      "code": "MZN",
      "curr": 943
    },
    {
      "name": "Молдавский лей",
      "code": "MDL",
      "curr": 498
    },
    {
      "name": "Найра",
      "code": "NGN",
      "curr": 566
    },
    {
      "name": "Накфа",
      "code": "ERN",
      "curr": 232
    },
    {
      "name": "Нгултрум",
      "code": "BTN",
      "curr": 64
    },
    {
      "name": "Непальская рупия",
      "code": "NPR",
      "curr": 524
    },
    {
      "name": "Нидерландский антильский гульден",
      "code": "ANG",
      "curr": 532
    },
    {
      "name": "Новозеландский доллар",
      "code": "NZD",
      "curr": 554
    },
    {
      "name": "Новый израильский шекель",
      "code": "ILS",
      "curr": 376
    },
    {
      "name": "Новый тайваньский доллар",
      "code": "TWD",
      "curr": 901
    },
    {
      "name": "Новый туркменский манат",
      "code": "TMT",
      "curr": 934
    },
    {
      "name": "Норвежская крона",
      "code": "NOK",
      "curr": 578
    },
    {
      "name": "Оманский риал",
      "code": "OMR",
      "curr": 512
    },
    {
      "name": "Паанга",
      "code": "ТОР",
      "curr": 776
    },
    {
      "name": "Пакистанская рупия",
      "code": "PKR",
      "curr": 586
    },
    {
      "name": "Патака",
      "code": "МОР",
      "curr": 446
    },
    {
      "name": "Пула",
      "code": "BWP",
      "curr": 72
    },
    {
      "name": "Риель",
      "code": "KHR",
      "curr": 116
    },
    {
      "name": "Российский рубль",
      "code": "RUB",
      "curr": 643
    },
    {
      "name": "Румынский лей",
      "code": "RON",
      "curr": 946
    },
    {
      "name": "Рупия",
      "code": "IDR",
      "curr": 360
    },
    {
      "name": "Руфия",
      "code": "MVR",
      "curr": 462
    },
    {
      "name": "Рэнд",
      "code": "ZAR",
      "curr": 710
    },
    {
      "name": "СДР (специальные права заимствования)",
      "code": "XDR",
      "curr": 960
    },
    {
      "name": "Сальвадорский колон",
      "code": "SVC",
      "curr": 222
    },
    {
      "name": "Саудовский риял",
      "code": "SAR",
      "curr": 682
    },
    {
      "name": "Северокорейская вона",
      "code": "KPW",
      "curr": 408
    },
    {
      "name": "Сейшельская рупия",
      "code": "SCR",
      "curr": 690
    },
    {
      "name": "Сербский динар",
      "code": "RSD",
      "curr": 941
    },
    {
      "name": "Сингапурский доллар",
      "code": "SGD",
      "curr": 702
    },
    {
      "name": "Сирийский фунт",
      "code": "SYP",
      "curr": 760
    },
    {
      "name": "Соль\nПояснение: изменение наименования действует с 15 декабря 2015 г.",
      "code": "PEN",
      "curr": 604
    },
    {
      "name": "Сом",
      "code": "KGS",
      "curr": 417
    },
    {
      "name": "Сомалийский шиллинг",
      "code": "SOS",
      "curr": 706
    },
    {
      "name": "Сомони",
      "code": "TJS",
      "curr": 972
    },
    {
      "name": "Суданский фунт",
      "code": "SDG",
      "curr": 938
    },
    {
      "name": "Суринамский доллар",
      "code": "SRD",
      "curr": 968
    },
    {
      "name": "Така",
      "code": "BDT",
      "curr": 50
    },
    {
      "name": "Тала",
      "code": "WST",
      "curr": 882
    },
    {
      "name": "Танзанийский шиллинг",
      "code": "TZS",
      "curr": 834
    },
    {
      "name": "Тенге",
      "code": "KZT",
      "curr": 398
    },
    {
      "name": "Тугрик",
      "code": "MNT",
      "curr": 496
    },
    {
      "name": "Тунисский динар",
      "code": "TND",
      "curr": 788
    },
    {
      "name": "Турецкая лира",
      "code": "TRY",
      "curr": 949
    },
    {
      "name": "Угандийский шиллинг",
      "code": "UGX",
      "curr": 800
    },
    {
      "name": "Угия",
      "code": "MRU",
      "curr": 929
    },
    {
      "name": "Узбекский сум",
      "code": "UZS",
      "curr": 860
    },
    {
      "name": "Уругвайское песо",
      "code": "UYU",
      "curr": 858
    },
    {
      "name": "Уругвайское песо в индексированных единицах",
      "code": "UYI",
      "curr": 940
    },
    {
      "name": "Филиппинское песо",
      "code": "PHP",
      "curr": 608
    },
    {
      "name": "Форинт",
      "code": "HUF",
      "curr": 348
    },
    {
      "name": "Франк Джибути",
      "code": "DJF",
      "curr": 262
    },
    {
      "name": "Франк КФА ВЕАС",
      "code": "XAF",
      "curr": 950
    },
    {
      "name": "Франк КФА ВСЕАО",
      "code": "XOF",
      "curr": 952
    },
    {
      "name": "Франк КФП",
      "code": "XPF",
      "curr": 953
    },
    {
      "name": "Франк Руанды",
      "code": "RWF",
      "curr": 646
    },
    {
      "name": "Фунт Святой Елены",
      "code": "SHP",
      "curr": 654
    },
    {
      "name": "Фунт Фолклендских островов",
      "code": "FKP",
      "curr": 238
    },
    {
      "name": "Фунт стерлингов",
      "code": "GBP",
      "curr": 826
    },
    {
      "name": "Чешская крона",
      "code": "CZK",
      "curr": 203
    },
    {
      "name": "Чилийское песо",
      "code": "CLP",
      "curr": 152
    },
    {
      "name": "Шведская крона",
      "code": "SEK",
      "curr": 752
    },
    {
      "name": "Швейцарский франк",
      "code": "CHF",
      "curr": 756
    },
    {
      "name": "Шри-ланкийская рупия",
      "code": "LKR",
      "curr": 144
    },
    {
      "name": "Эскудо Кабо-Верде",
      "code": "CVE",
      "curr": 132
    },
    {
      "name": "Эфиопский быр",
      "code": "ETB",
      "curr": 230
    },
    {
      "name": "Юань",
      "code": "CNY",
      "curr": 156
    },
    {
      "name": "Южносуданский фунт",
      "code": "SSP",
      "curr": 728
    },
    {
      "name": "Ямайский доллар",
      "code": "JMD",
      "curr": 388
    }
]