// Jest Snapshot v1, https://goo.gl/fbAQLP

exports[`Btn renders correctly and onPress 1`] = `
<View
  accessible={true}
  isTVSelectable={true}
  onResponderGrant={[Function]}
  onResponderMove={[Function]}
  onResponderRelease={[Function]}
  onResponderTerminate={[Function]}
  onResponderTerminationRequest={[Function]}
  onStartShouldSetResponder={[Function]}
  style={
    Object {
      "alignItems": "center",
      "backgroundColor": "#6E5EA3",
      "borderColor": "#39414d",
      "borderRadius": 4,
      "borderWidth": 0,
      "flexDirection": "row",
      "height": 100,
      "justifyContent": "center",
      "marginBottom": 60,
      "opacity": 1,
      "paddingHorizontal": 16,
      "paddingTop": 4,
      "width": 300,
    }
  }
>
  <Text
    numberOfLines={1}
    style={
      Object {
        "color": "#fff",
        "flex": 1,
        "fontFamily": "TTProstoSans-Light",
        "fontSize": 29,
        "lineHeight": 45,
        "textAlign": "center",
        "textAlignVertical": "center",
      }
    }
  >
    Next 
  </Text>
</View>
`;
