// Jest Snapshot v1, https://goo.gl/fbAQLP

exports[`InfoItem renders correctly and onPress 1`] = `
<View
  style={
    Object {
      "alignItems": "flex-start",
      "justifyContent": "space-around",
      "paddingVertical": 24,
    }
  }
>
  <Text
    multiline={false}
    numberOfLines={1}
    style={
      Object {
        "alignSelf": "stretch",
        "backgroundColor": "transparent",
        "color": "#39414d",
        "fontFamily": "TTProstoSans-Light",
        "fontSize": 35,
      }
    }
  >
    title
  </Text>
  <View
    style={
      Object {
        "alignItems": "center",
        "alignSelf": "stretch",
        "flexDirection": "row",
        "justifyContent": "space-between",
      }
    }
  >
    <Text
      multiline={false}
      numberOfLines={1}
      style={
        Object {
          "backgroundColor": "transparent",
          "color": "#39414d",
          "flex": 10,
          "fontFamily": "TTProstoSans-Light",
          "fontSize": 25,
        }
      }
    >
      value
    </Text>
    <View
      accessible={true}
      isTVSelectable={true}
      onResponderGrant={[Function]}
      onResponderMove={[Function]}
      onResponderRelease={[Function]}
      onResponderTerminate={[Function]}
      onResponderTerminationRequest={[Function]}
      onStartShouldSetResponder={[Function]}
      style={
        Object {
          "flex": 1,
          "height": 30,
          "opacity": 1,
          "width": 30,
        }
      }
    >
      <Image
        source={
          Object {
            "testUri": "../../../app/resources/images/icon_copy.png",
          }
        }
        style={
          Object {
            "flex": 1,
            "height": 30,
            "width": 30,
          }
        }
      />
    </View>
  </View>
</View>
`;
