{
   "1001407065815272462": {
      "message": "No se pudieron agregar elementos a $2​Mi unidad$1​"
   },
   "1013939682284715002": {
      "message": "Organizar"
   },
   "1029576232144989689": {
      "message": "También puedes guardar vínculos para usarlos más adelante con la&nbsp;$2​extensión de Google Keep para Chrome$1​."
   },
   "1039394921418415681": {
      "message": "Acceder"
   },
   "1040405721361467195": {
      "message": "Usa las teclas de flecha para seleccionar el texto donde deseas agregar comentarios. Mantén presionada la tecla Mayús mientras presionas las teclas de flecha para expandir la selección. Presiona Intro para crear un comentario o Escape para cancelar."
   },
   "1061011362310586469": {
      "message": "Uso compartido"
   },
   "1083918249169198626": {
      "message": "Las combinaciones de teclas para acceso directo están inhabilitadas."
   },
   "1101371910696766077": {
      "message": "Hacer una copia"
   },
   "1105774658609209931": {
      "message": "Extensión de Chrome"
   },
   "1122146167985532789": {
      "message": "ayer"
   },
   "1127320433256851404": {
      "message": "Reproductor de video"
   },
   "1131044617724567645": {
      "message": "Los comentarios en documentos PDF se guardan en el archivo y pueden verse con otras apps"
   },
   "1137446830169628669": {
      "message": "Se aplicó sangría al elemento."
   },
   "1158660505977623040": {
      "message": "Borrar definitivamente"
   },
   "1162642135048988280": {
      "message": "Cambiar nombre del documento"
   },
   "1163324543881570799": {
      "message": "Documentos de Google"
   },
   "1166244120191806795": {
      "message": "Enviar comentarios"
   },
   "1177768120450365955": {
      "message": "Mover los elementos marcados al final"
   },
   "1179891706526242218": {
      "message": "Siguiente"
   },
   "1185164838496022543": {
      "message": "Haz clic aquí para volver a cargar la página."
   },
   "1213005208968286932": {
      "message": "Marcado como resuelto"
   },
   "124010372300613445": {
      "message": "{numNotes,plural, =1{Se creó una copia de la nota archivada}other{Se crearon copias de las # notas archivadas}}"
   },
   "124900027451629830": {
      "message": "Reproducir"
   },
   "125608713654167241": {
      "message": "Verde azulado"
   },
   "1256362146573583104": {
      "message": "Extraer"
   },
   "1259492729704800881": {
      "message": "Archivar nota"
   },
   "1263685395252160366": {
      "message": "LaTeX"
   },
   "1271038294394884640": {
      "message": "Cancelar"
   },
   "12768758038718216": {
      "message": "Fijar nota archivada"
   },
   "1280430284217153733": {
      "message": "Agregar una hora"
   },
   "1330083198022464084": {
      "message": "Crear nota"
   },
   "1333255388111908292": {
      "message": "Comestibles"
   },
   "1335763707789999819": {
      "message": "{NUM_ITEMS,plural, =1{No tienes permiso para mover este elemento de las carpetas actuales. En su lugar, agrega el elemento a {START_SPAN_1}{NAME}{END_SPAN}.}other{No tienes permiso para mover estos elementos de las carpetas actuales. En su lugar, agrega los elementos a {START_SPAN_2}{NAME}{END_SPAN}.}}"
   },
   "1338300799355131761": {
      "message": "Nota sin título"
   },
   "1349697396109290623": {
      "message": "Mostrando mayor resolución de $1​"
   },
   "1359937199332190522": {
      "message": "{NUM_ITEMS_1,plural, =0{unused plural form}=1{Se agregó {NUM_ITEMS_2} archivo a {XXX_1}.}other{Se agregaron {NUM_ITEMS_2} archivos a {XXX_2}.}}"
   },
   "136335357683289450": {
      "message": "Cerrar"
   },
   "1368808491835583439": {
      "message": "Púrpura oscuro"
   },
   "1379850360723600538": {
      "message": "No se admiten archivos protegidos por contraseña."
   },
   "1397887822627488928": {
      "message": "Persona o dirección de correo electrónico con la que se va a compartir"
   },
   "139942704574044780": {
      "message": "Aceptar"
   },
   "1419896259743862406": {
      "message": "Abrir con"
   },
   "1432850707344442376": {
      "message": "Crear etiqueta $1​"
   },
   "1434081385486479995": {
      "message": "El uso compartido no está disponible en este momento"
   },
   "1439211265324766071": {
      "message": "Nota en la papelera"
   },
   "1441487391064925653": {
      "message": "Ver todos los accesos directos en el Centro de ayuda"
   },
   "1441712877952841568": {
      "message": "Última fecha de edición: $1​"
   },
   "1442722292947881614": {
      "message": "Tipos"
   },
   "1446829548948002072": {
      "message": "coma"
   },
   "1453330983536591773": {
      "message": "Gris claro"
   },
   "1463389029497634261": {
      "message": "Bajar volumen"
   },
   "1465828580966685215": {
      "message": "Borrar notas de la cuenta"
   },
   "1466663154000252842": {
      "message": "Algunas personas podrían perder el acceso"
   },
   "1467797923781828000": {
      "message": "Se agregaron $1​ elementos a $2​."
   },
   "1473312930157933007": {
      "message": "No se puede compartir con los siguientes usuarios porque tu administrador inhabilitó la posibilidad de compartir elementos fuera de tu dominio."
   },
   "1475258635371833968": {
      "message": "$2​, $1​"
   },
   "1475261522522402536": {
      "message": "Elegir un lugar"
   },
   "1478393252643397554": {
      "message": "Naranja"
   },
   "1482452362096735080": {
      "message": "Ocurre {numOccurrences} veces."
   },
   "1499433769420882987": {
      "message": "Mostrando $1​"
   },
   "1505876360160857231": {
      "message": "$1​ TB"
   },
   "1507063529674142853": {
      "message": "El último día del mes"
   },
   "1507445189431379166": {
      "message": "Eliminar"
   },
   "1512114410402431831": {
      "message": "Actualizar"
   },
   "1512454807955173272": {
      "message": "Keep se actualizará cuando esté en línea"
   },
   "1513178578981188988": {
      "message": "Edge"
   },
   "1532717559893630620": {
      "message": "La etiqueta $1​ se combinó con $2​."
   },
   "1536051766421561160": {
      "message": "igual"
   },
   "153659275234722804": {
      "message": "Ignorar"
   },
   "1543499632005215694": {
      "message": "{NUM_ITEMS,plural, =0{forma plural no utilizada}=1{El archivo que se está moviendo a \"{ADDED_PARENT_NAME}\" activó las detecciones de PPD. Es posible que incluya información confidencial.}other{Algunos de los archivos que se están moviendo a \"{ADDED_PARENT_NAME}\" activaron las detecciones de PPD. Es posible que incluyan información confidencial.}}"
   },
   "1568379678795589771": {
      "message": "Cuadrado"
   },
   "1586968957182554447": {
      "message": "Inhabilitar"
   },
   "1588268697057804046": {
      "message": "Hace $1​ horas."
   },
   "1606998668553414638": {
      "message": "Solicitar acceso"
   },
   "1612117309990202511": {
      "message": "Puntos"
   },
   "1623657263486883050": {
      "message": "cm"
   },
   "1633798963327779260": {
      "message": "Mañana"
   },
   "1655692513689044870": {
      "message": "Saliste de la cuenta."
   },
   "1656911987308166143": {
      "message": "Eliminar"
   },
   "1661251023749398110": {
      "message": "Descargar audio"
   },
   "1665821947855814052": {
      "message": "Tamaño"
   },
   "1675900304699098572": {
      "message": "{count,plural, =1{Se dejó de fijar la nota}other{Se dejaron de fijar # notas}}"
   },
   "1680617124502957636": {
      "message": "No se puede establecer la conexión en este momento. Vuelve a intentarlo más tarde."
   },
   "1680818623013843452": {
      "message": "Lucidchart"
   },
   "1683762293389974494": {
      "message": "Borrar"
   },
   "1694896269813520248": {
      "message": "Agregar un dibujo"
   },
   "1697160643589236962": {
      "message": "$1​ PB"
   },
   "1703175513040690135": {
      "message": "Cualquier usuario de $1​"
   },
   "1704004075228783011": {
      "message": "{every,plural, =1{Se repite mensualmente el último día del mes.}other{Se repite cada # meses el último día del mes.}}"
   },
   "1711424025297585662": {
      "message": "un|una|el|la|los|las"
   },
   "171683163267149669": {
      "message": "$1​ GB"
   },
   "1730171019350750807": {
      "message": "Negro"
   },
   "1737240194537729525": {
      "message": "Semanal"
   },
   "1738407623218213194": {
      "message": "anónimo"
   },
   "1739900012825270238": {
      "message": "Ir al elemento anterior"
   },
   "1740371341228065086": {
      "message": "Volver a cargar"
   },
   "1745782414562966515": {
      "message": "¿Quieres combinar la etiqueta \"$1​\" con la etiqueta \"$2​\"? Todas las notas con la etiqueta \"$1​\" ahora tendrán la etiqueta \"$2​\", y se eliminará la etiqueta \"$1​\"."
   },
   "1746512984326924716": {
      "message": "No se puede deshacer esta acción."
   },
   "1783719421893050637": {
      "message": "Dimensiones"
   },
   "178927681797742562": {
      "message": "Acceder"
   },
   "1791115075948268631": {
      "message": "Abrir ayuda de las combinaciones de teclas para acceso directo"
   },
   "179545118447015250": {
      "message": "Vista de cuadrícula"
   },
   "1803966010993357655": {
      "message": "Otras"
   },
   "1808245543551507519": {
      "message": "Audio"
   },
   "1808500458645743749": {
      "message": "Las notas de la pantalla bloqueada se guardan de manera automática en Google Keep. Tu nota más reciente permanecerá en la pantalla bloqueada."
   },
   "1810354345035313773": {
      "message": "Abrir el selector de color y tamaño para la herramienta de marcador"
   },
   "1819225489062185613": {
      "message": "Otras"
   },
   "1823222042913714987": {
      "message": "Enviar contraseña"
   },
   "1829174126565818591": {
      "message": "Firefox"
   },
   "1830157062072535681": {
      "message": "Mostrando $1​"
   },
   "1852745815330163711": {
      "message": "Dibujos de Google"
   },
   "1857224091554117760": {
      "message": "Rojo"
   },
   "1870691479127746185": {
      "message": "derecha"
   },
   "187077078156858455": {
      "message": "Nota de audio"
   },
   "189303170370862360": {
      "message": "$1​ de $2​ elementos"
   },
   "1900571668686750716": {
      "message": "vCard"
   },
   "1901215424950227523": {
      "message": "La etiqueta $1​ no existe"
   },
   "1918176455405610789": {
      "message": "Listo"
   },
   "1936219394601788126": {
      "message": "superior"
   },
   "1938115711058331119": {
      "message": "Mostrar la columna de comentarios"
   },
   "195154114623528341": {
      "message": "Agregar ubicación"
   },
   "1956794332842050061": {
      "message": "Página siguiente"
   },
   "1965626377712226216": {
      "message": "Keynote"
   },
   "1967536906522187719": {
      "message": "Se produjo un problema al obtener la vista previa de esta hoja de cálculo."
   },
   "1968405748623909021": {
      "message": "Intenta abrir o editar el elemento con una de estas aplicaciones"
   },
   "1969531182936822963": {
      "message": "Acción deshecha"
   },
   "1973454937875679500": {
      "message": "Ingresar el nombre de la etiqueta"
   },
   "1975630610063119352": {
      "message": "{charsRemaining,plural, =1{# carácter disponible}other{# caracteres disponibles}}"
   },
   "1980209166254310911": {
      "message": "Día"
   },
   "1988244842147989817": {
      "message": "Las notas de la Papelera se eliminan después de siete días."
   },
   "200005227964332868": {
      "message": "MÁS"
   },
   "2003845117979929469": {
      "message": "Detalles"
   },
   "200488920523496447": {
      "message": "Se hizo zoom en el elemento."
   },
   "2039757863628752523": {
      "message": "Opciones de frecuencia"
   },
   "205876860571942679": {
      "message": "Google My Maps"
   },
   "2059084517358086391": {
      "message": "Cerrar la barra de búsqueda"
   },
   "2061440050632248160": {
      "message": "Archivar"
   },
   "2068023589621557589": {
      "message": "Fuente TrueType"
   },
   "2073322475696388995": {
      "message": "Saltar hacia adelante"
   },
   "2074454463201225704": {
      "message": "Restablecer el zoom"
   },
   "207810168108507460": {
      "message": "Hace $1​ hora."
   },
   "2085048987351765091": {
      "message": "ENTENDIDO"
   },
   "2091811447965921066": {
      "message": "Eliminarlos"
   },
   "2107379241532042955": {
      "message": "Ubicación"
   },
   "2107589831642088814": {
      "message": "Crear \"$3​$2​$1​\""
   },
   "2109979457438465538": {
      "message": "Se abrió el menú del selector de etiquetas"
   },
   "2113092209746357267": {
      "message": "Chrome"
   },
   "2118635459760443566": {
      "message": "Siguiente"
   },
   "2119255452378336327": {
      "message": "Se revirtió la viñeta a $1​"
   },
   "212796670323571824": {
      "message": "Aceptar"
   },
   "213665695896111861": {
      "message": "Notas"
   },
   "2138593281154109183": {
      "message": "Archivo"
   },
   "214517458278879973": {
      "message": "Acceder como $1​"
   },
   "2147952938331523160": {
      "message": "Cambiar nombre…"
   },
   "2154372123324862271": {
      "message": "barra"
   },
   "2166966123760559393": {
      "message": "Crear etiqueta nueva"
   },
   "2168461275182666804": {
      "message": "Editar"
   },
   "2181197458532159304": {
      "message": "{numberOfNotes,plural, =1{Se envió la nota a la papelera}other{Se enviaron # notas a la papelera}}"
   },
   "2184278444368405837": {
      "message": "$1​ elementos"
   },
   "2187239650627580457": {
      "message": "Enviar"
   },
   "2189621188983913867": {
      "message": "Conectar más apps"
   },
   "2190049738646901760": {
      "message": "{count,plural, =1{¿Quieres borrar la nota?}other{¿Quieres borrar las notas?}}"
   },
   "2195440644060728966": {
      "message": "{NUM_ITEMS,plural, =1{Moverás una carpeta ubicada en una carpeta}other{Moverás carpetas ubicadas en una carpeta}}"
   },
   "2198096971937872560": {
      "message": "Recordatorio:"
   },
   "220168959069469607": {
      "message": "Más acciones"
   },
   "2202265279234683999": {
      "message": "Combinaciones de teclas"
   },
   "2203926649090909861": {
      "message": "El elemento de la lista se movió al índice $1​"
   },
   "2215890921415017560": {
      "message": "Modo de pantalla completa"
   },
   "2216904725760458480": {
      "message": "Diaria"
   },
   "221715292685577880": {
      "message": "Sí"
   },
   "2226562046914098941": {
      "message": "Este archivo es demasiado grande para obtener una vista previa"
   },
   "2226937423434054727": {
      "message": "Se seleccionó de $1​ ($2​) a $3​ ($4​)"
   },
   "223198388381606871": {
      "message": "Lavanda"
   },
   "2264311811697505466": {
      "message": "Actualizar"
   },
   "2270469222412517777": {
      "message": "No se puede reconocer el texto"
   },
   "2270633624888102832": {
      "message": "No fijar nota"
   },
   "2280650195464600721": {
      "message": "Navegación"
   },
   "2282423663539387332": {
      "message": "Próximos"
   },
   "2285069188138705005": {
      "message": "Aplicaciones conectadas"
   },
   "2286685488296851497": {
      "message": "{NUM_ITEMS_1,plural, =0{unused plural form}=1{Quitarás un elemento de la carpeta compartida \"{SHARED_FOLDER_NAME}\", por lo que las personas perderán el acceso a él.}other{Quitarás {NUM_ITEMS_2} elementos de la carpeta compartida \"{SHARED_FOLDER_NAME}\", por lo que las personas perderán el acceso a ellos.}}"
   },
   "228741435562395266": {
      "message": "La impresión aún no está disponible."
   },
   "2289534534793293486": {
      "message": "Eliminar del archivo"
   },
   "2289812403593835836": {
      "message": "Pages"
   },
   "229177484946387188": {
      "message": "Google Earth"
   },
   "2292696732672795285": {
      "message": "Subir volumen"
   },
   "2299671629154778581": {
      "message": "se dejaron de fijar y se archivaron las notas"
   },
   "2308018963132768704": {
      "message": "Tamaño 4"
   },
   "2310145944356900158": {
      "message": "Marcados"
   },
   "2311880726221661199": {
      "message": "Cargando resoluciones más altas"
   },
   "2324955914430674498": {
      "message": "No se encontraron resultados de la búsqueda para \"$1​\""
   },
   "2329167963662998826": {
      "message": "Google Keep quiere usar tu ubicación para mejorar las sugerencias de lugares de los recordatorios según la ubicación."
   },
   "2346361265476305332": {
      "message": "El propietario no permite la descarga de este archivo de audio."
   },
   "2357623745116912085": {
      "message": "{NUM_ITEMS,plural, =0{unused plural form}=1{Los miembros de \"{TEAM_DRIVE_NAME}\" perderán el acceso, a menos que este elemento se comparta con ellos.}other{Los miembros de \"{TEAM_DRIVE_NAME}\" perderán el acceso, a menos que estos elementos se compartan con ellos.}}"
   },
   "2357761837816388330": {
      "message": "Sin conexión"
   },
   "2359614137862708172": {
      "message": "Mayús"
   },
   "2364374826543847335": {
      "message": "Quitar fuente"
   },
   "236689092839978781": {
      "message": "Sin repetición"
   },
   "2370656573843123707": {
      "message": "corchete de cierre"
   },
   "2373760032138505521": {
      "message": "La etiqueta ya existe"
   },
   "2386536768112358461": {
      "message": "Av Pág"
   },
   "2396804279177914769": {
      "message": "¿Quieres transferir la propiedad a la unidad de equipo?"
   },
   "2405795704816921421": {
      "message": "Archivo $1​"
   },
   "2408383448126741628": {
      "message": "Duración"
   },
   "2408933271548524782": {
      "message": "Bloqueado"
   },
   "2423877407428530040": {
      "message": "El archivo tiene demasiados gráficos."
   },
   "2433429041384246549": {
      "message": "Silenciar"
   },
   "2444198666025646119": {
      "message": "Violeta"
   },
   "2449254824382583885": {
      "message": "Ventana emergente"
   },
   "2452145367257933677": {
      "message": "Deshacer"
   },
   "2452522051596946166": {
      "message": "Se produjo un error al obtener la vista previa de $1​. Volviendo a intentar."
   },
   "2454642351139428112": {
      "message": "Deshacer"
   },
   "2466251465475184755": {
      "message": "¿Quieres vaciar la Papelera? Todas las notas de la Papelera se eliminarán de forma permanente."
   },
   "2475181823688399272": {
      "message": "Siguiente"
   },
   "2478862372619762755": {
      "message": "Destaca un área para agregar comentarios"
   },
   "2483363439634684283": {
      "message": "Tamaño 20"
   },
   "2504232652631703202": {
      "message": "Conectada"
   },
   "251025074207413762": {
      "message": "Agregar descripción"
   },
   "2525633490863427854": {
      "message": "Rehacer"
   },
   "2527534830196374788": {
      "message": "Ctrl"
   },
   "2532280782491328445": {
      "message": "Buscar anterior"
   },
   "2555961950726197809": {
      "message": "Se está mostrando el lector."
   },
   "2562881166530755046": {
      "message": "Dibujos"
   },
   "257317112834806705": {
      "message": "Alternar entre vistas de lista y de cuadrícula"
   },
   "2579261044590673579": {
      "message": "Mi unidad"
   },
   "2579679351920691492": {
      "message": "Saltar hacia atrás"
   },
   "2581526424350930407": {
      "message": "Editar"
   },
   "2584557103820423944": {
      "message": "Agregar o quitar sangría al elemento de la lista"
   },
   "2600731575260427177": {
      "message": "El archivo no existe, y es posible que se haya eliminado. Vuelve a intentar cargarlo."
   },
   "2601304136110057215": {
      "message": "Nuevo dibujo"
   },
   "2604527707881848686": {
      "message": "Ya no se puede quitar sangría al elemento."
   },
   "2609409316752026806": {
      "message": "PDF"
   },
   "2609767652209789035": {
      "message": "Etiquetas"
   },
   "2623861453769098676": {
      "message": "Se produjo un error al obtener la vista previa de este documento."
   },
   "2626653026098396543": {
      "message": "{NUM_ITEMS,plural, =0{Unused}=1{Si mueves este elemento, se compartirá con todas las personas que pueden ver la carpeta compartida \"{SHARED_FOLDER_NAME}\".}other{Si mueves estos elementos, se compartirán con todas las personas que pueden ver la carpeta compartida \"{SHARED_FOLDER_NAME}\".}}"
   },
   "2630254198275172065": {
      "message": "Mover a…"
   },
   "2632263751512428257": {
      "message": "Anual"
   },
   "2645469029410848421": {
      "message": "{noteCount,plural, =1{Etiquetar nota}other{Etiquetar notas}}"
   },
   "2661850177130037208": {
      "message": "Abrir elemento"
   },
   "2680303811435018716": {
      "message": "No se pueden agregar más elementos"
   },
   "2681830832355823748": {
      "message": "Buscar todas las combinaciones de teclas"
   },
   "268402507078609011": {
      "message": "{imagesAdded,plural, =1{Imagen agregada}other{# imágenes agregadas}}"
   },
   "2702485557996900362": {
      "message": "Arreglar ediciones en conflicto"
   },
   "2704959686524436777": {
      "message": "Cargando"
   },
   "2715199780155065699": {
      "message": "El archivo tiene demasiados dibujos, formas o cuadros de texto."
   },
   "2716433087531258659": {
      "message": "Re Pág"
   },
   "2719125961689709460": {
      "message": "Nota"
   },
   "2742719907061406418": {
      "message": "XML"
   },
   "2758125083752925237": {
      "message": "(Propietario)"
   },
   "2760106082595028595": {
      "message": "La nota es demasiado larga."
   },
   "277430914014962533": {
      "message": "Se produjo un error al obtener la vista previa de $1​."
   },
   "2777453609143551768": {
      "message": "Control de volumen"
   },
   "2793841261389879255": {
      "message": "Página anterior"
   },
   "2794676336056877832": {
      "message": "{every,plural, =1{Se repite mensualmente el mismo día todos los meses.}other{Se repite cada # meses el mismo día todos los meses.}}"
   },
   "2798322202738486782": {
      "message": "{HOURS,plural, =0{0 horas }=1{1 hora }other{# horas }}{MINUTES,plural, =0{0 minutos }=1{1 minuto }other{# minutos }}{SECONDS,plural, =0{0 segundos}=1{1 segundo}other{# segundos}}"
   },
   "2803553109654833664": {
      "message": "Rosa"
   },
   "2818020101821669029": {
      "message": "Creado"
   },
   "2820045170951016567": {
      "message": "Recordatorios"
   },
   "2823533464825550362": {
      "message": "Controles del documento"
   },
   "2827039933590757722": {
      "message": "Acceso directo de Windows"
   },
   "2828060233316503200": {
      "message": "{NUM_ITEMS_1,plural, =0{unused plural form}=1{Se movió {NUM_ITEMS_2} elemento de {XXX_1} a {XXX_2}.}other{Se movieron {NUM_ITEMS_2} elementos de {XXX_3} a {XXX_4}.}}"
   },
   "2829226075651806940": {
      "message": "Acercar"
   },
   "2842462703735289745": {
      "message": "Los usuarios que puedan ver la carpeta compartida \"$1​\" obtendrán acceso."
   },
   "2853036885874864031": {
      "message": "La propiedad se transferirá a $1​."
   },
   "2854717396594966319": {
      "message": "OpenOffice Writer"
   },
   "2858566870229558873": {
      "message": "$2​Condiciones del servicio$1​"
   },
   "2862675909830094845": {
      "message": "Crear etiqueta nueva"
   },
   "2873089307546162154": {
      "message": "Aceptar"
   },
   "2877285560485318801": {
      "message": "Pausa"
   },
   "2879276552944958066": {
      "message": "Volver a la carpeta $1​"
   },
   "2886313667612471214": {
      "message": "Debes actualizar la nota. Puede tardar varios minutos."
   },
   "2893055432094515558": {
      "message": "Se muestran las casillas de verificación"
   },
   "289798573180023043": {
      "message": "Aceptar"
   },
   "2901360496423912565": {
      "message": "Denunciar"
   },
   "2902570047322934912": {
      "message": "Habilitar el uso compartido"
   },
   "2908917161758545146": {
      "message": "{count,plural, =1{Se dejó de fijar y se archivó la nota}other{Se dejaron de fijar y se archivaron # notas}}"
   },
   "292972929665636688": {
      "message": "Ahora puedes usar el Asistente de Google para crear notas y listas de tareas en Keep."
   },
   "2935193106137642160": {
      "message": "El zoom no está disponible"
   },
   "2942094715879803305": {
      "message": "Eliminar elementos marcados"
   },
   "295331174171409695": {
      "message": "Se produjo un error al actualizar el permiso de descarga de \"$1​\"."
   },
   "2960516445247616550": {
      "message": "Impresión no disponible"
   },
   "296391753033307868": {
      "message": "Se creó la etiqueta $1​ y se agregó a la nota."
   },
   "2964778642459027786": {
      "message": "No hay notas en la Papelera."
   },
   "2971623719720688041": {
      "message": "Se deshizo la acción"
   },
   "2971780287153684447": {
      "message": "Dispositivos Android"
   },
   "2973306402585941108": {
      "message": "Por la mañana"
   },
   "298817883481775869": {
      "message": "Cargando…"
   },
   "2990497076082409431": {
      "message": "Se movió \"$1​\" a $2​."
   },
   "2993901764282547916": {
      "message": "App Maker"
   },
   "3005058076425755361": {
      "message": "Retroceso"
   },
   "3018905429279095639": {
      "message": "{NUM_ITEMS,plural, =1{No tienes permiso para mover esta carpeta de las carpetas actuales. En su lugar, agrégala a {START_SPAN_1}{NAME}{END_SPAN}.}other{No tienes permiso para mover estas carpetas de las carpetas actuales. En su lugar, agrégalas a {START_SPAN_2}{NAME}{END_SPAN}.}}"
   },
   "3043961722025425136": {
      "message": "Descripción"
   },
   "3045997283325725532": {
      "message": "Novedades en Google Keep"
   },
   "306516303501625305": {
      "message": "Error de autenticación"
   },
   "3108098439469164127": {
      "message": "Se abrió un nuevo dibujo"
   },
   "3109321241584918345": {
      "message": "Conectar más aplicaciones"
   },
   "3121560585545725724": {
      "message": "$1​, $2​"
   },
   "3140236589681731084": {
      "message": "en $1​ horas"
   },
   "3147722095652727387": {
      "message": "No se puede compartir con los siguientes usuarios porque su administrador inhabilitó la posibilidad de compartir elementos con su dominio o tu administrador inhabilitó la posibilidad de compartir elementos fuera de tu dominio."
   },
   "3149135495425830054": {
      "message": "Las funciones \"Sugerencias\" y \"Autocompletar\" están disponibles después de acceder"
   },
   "3150651996344750990": {
      "message": "{count,plural, =1{Nota eliminada del archivo}other{# notas eliminadas del archivo}}"
   },
   "3167198321908629554": {
      "message": "Actualizando y volviendo a cargar tus notas…"
   },
   "3176246635438298155": {
      "message": "Supr"
   },
   "3187117482772485385": {
      "message": "Creando una miniatura…"
   },
   "3189854932778515441": {
      "message": "Nota archivada"
   },
   "3190546672187601036": {
      "message": "Por la noche"
   },
   "3195812604657128345": {
      "message": "Elige una carpeta de Drive para extraer el contenido."
   },
   "32059145043728507": {
      "message": "{numberOfNotes,plural, =1{Se restauró la nota}other{Se restauraron # notas}}"
   },
   "3207650089232728475": {
      "message": "Cambiar etiquetas"
   },
   "3211163842850942567": {
      "message": "Acercar"
   },
   "3217354672216773127": {
      "message": "Se activó el $1​"
   },
   "3220641589840600333": {
      "message": "Se cambió a la vista $1​"
   },
   "3241696131593027453": {
      "message": "Seleccionar nota"
   },
   "3243916603465112517": {
      "message": "MENOS"
   },
   "3249966726137025950": {
      "message": "Grupo familiar del colaborador"
   },
   "3250489229749307913": {
      "message": "Electronic Publication"
   },
   "3258100527833044153": {
      "message": "Se descartó el dibujo en blanco"
   },
   "3261131345401321392": {
      "message": "Puedes comentar"
   },
   "3266448715145955862": {
      "message": "Se extrajeron del archivo y se fijaron las notas"
   },
   "3268028083415317236": {
      "message": "No, gracias"
   },
   "3272496516667407797": {
      "message": "Se produjo un error al cargar los detalles."
   },
   "3278046126264096288": {
      "message": "Semana"
   },
   "3281684668260174833": {
      "message": "{numberOfNotes,plural, =1{La nota se dejó de fijar y se envió a la papelera}other{Se dejaron de fijar y se enviaron a la papelera # notas}}"
   },
   "3288498486633948368": {
      "message": "\"$1​\" se agregó a Google Drive."
   },
   "330603631583186798": {
      "message": "Word"
   },
   "3308935528045767909": {
      "message": "Nueva nota con dibujo"
   },
   "3312545971976531405": {
      "message": "Mensaje"
   },
   "3326410145104517459": {
      "message": "Captura tus ideas $1​ en cualquier dispositivo"
   },
   "3345567742278474807": {
      "message": "Esta nota se marcó como inapropiada y no se puede compartir."
   },
   "3348057264663626000": {
      "message": "Se movió la selección hacia arriba."
   },
   "3354260708176476985": {
      "message": "Cargando&hellip;"
   },
   "3362903141674317449": {
      "message": "Colaborador"
   },
   "336772567640975291": {
      "message": "Semana siguiente"
   },
   "3371033609268806242": {
      "message": "La etiqueta $1​ se borró."
   },
   "3381619429606029445": {
      "message": "Visio"
   },
   "3382236845597426718": {
      "message": "Abrir"
   },
   "3385831848537487538": {
      "message": "Viajes"
   },
   "3409257542937182842": {
      "message": "Volviendo a intentar…"
   },
   "3409483962000136213": {
      "message": "Reproducir/pausar"
   },
   "3418767079436101103": {
      "message": "Se produjo un error al cargar la página."
   },
   "3419821606494999471": {
      "message": "Administrar notificaciones sobre comentarios"
   },
   "3435089737264042207": {
      "message": "Activar"
   },
   "3447704623213039325": {
      "message": "Elemento de tienda de comestibles"
   },
   "3448234415275521882": {
      "message": "Información general"
   },
   "3451851833460018584": {
      "message": "{NUM_COMMENTS,plural, =0{No hay comentarios}=1{Un comentario}other{# comentarios}}"
   },
   "3455405209271884570": {
      "message": "Extraer"
   },
   "345585899501260401": {
      "message": "píxeles"
   },
   "345718983715470367": {
      "message": "Fuente"
   },
   "3468441711253011521": {
      "message": "Hojas de cálculo de Google"
   },
   "3473620774713000513": {
      "message": "Resuelto"
   },
   "3485469306694683931": {
      "message": "Extraer en tu cuenta de Drive"
   },
   "3487924397596265480": {
      "message": "Se seleccionó $1​."
   },
   "3488766808236147068": {
      "message": "El color es $1​. Selecciona otro para aplicarlo a la nota."
   },
   "3496410038494993160": {
      "message": "Combinaciones de teclas más utilizadas"
   },
   "3518073392823563581": {
      "message": "Combinaciones de teclas para acceso directo"
   },
   "3528739824697875943": {
      "message": "elemento de lista"
   },
   "3549581437554274388": {
      "message": "Se movió la selección hacia la derecha."
   },
   "3551522853788442530": {
      "message": "Atrás"
   },
   "3551608745198442336": {
      "message": "Dibujo $1​/$2​"
   },
   "3553997866738769437": {
      "message": "Editar el dibujo"
   },
   "3555017093330694286": {
      "message": "Compartida por"
   },
   "3555297636767750285": {
      "message": "Verde"
   },
   "3561658662634401836": {
      "message": "Título"
   },
   "3569884090205828853": {
      "message": "OpenOffice Calc"
   },
   "3570074492517305433": {
      "message": "Registrarse"
   },
   "3571704286086017611": {
      "message": "Se borró el recordatorio"
   },
   "3574963906259719128": {
      "message": "Tu navegador no puede reproducir este archivo de audio."
   },
   "3580293729117872545": {
      "message": "Finaliza"
   },
   "3595000514985906359": {
      "message": "Excel"
   },
   "3595562664731337243": {
      "message": "Renombrar etiqueta"
   },
   "3603931013946597836": {
      "message": "{NUM_ITEMS,plural, =1{Moverás un archivo ubicado en {NUM_PARENTS} carpetas}other{Moverás archivos ubicados en {NUM_PARENTS} carpetas}}"
   },
   "3608606849109645545": {
      "message": "Escribe un nombre nuevo para el documento:"
   },
   "3609912631958780352": {
      "message": "Herramienta de caligrafía"
   },
   "3611573349633408445": {
      "message": "Descargar"
   },
   "3612936866865912552": {
      "message": "Cargando…"
   },
   "3617727970098875990": {
      "message": "Buscar todas las combinaciones de teclas"
   },
   "362521762755836201": {
      "message": "Fecha de creación: $1​"
   },
   "3634885664399305142": {
      "message": "La opción de dibujar no está disponible"
   },
   "3651893685901703652": {
      "message": "…"
   },
   "3657386785336906042": {
      "message": "barra invertida"
   },
   "3659554681396757189": {
      "message": "Abierto por mí"
   },
   "366289214151975122": {
      "message": "Cualquier usuario de $1​ que tenga el vínculo"
   },
   "3663571259791438207": {
      "message": "Denunciar abuso"
   },
   "3664842788764635265": {
      "message": "Ninguno"
   },
   "3666123569747918021": {
      "message": "Este documento contiene cambios sin guardar. ¿Quieres abandonar la página y descartar los cambios?"
   },
   "3678477908297567934": {
      "message": "guión bajo"
   },
   "3690515530505404607": {
      "message": "Se produjo un error al reproducir este video."
   },
   "369764661829607970": {
      "message": "{NUM_ITEMS,plural, =0{Sin elementos}=1{1 elemento}other{# elementos}}"
   },
   "3707311099386068778": {
      "message": "Quitar todo"
   },
   "3712215972250917265": {
      "message": "Comentarios"
   },
   "3721649886572275931": {
      "message": "Tamaño 8"
   },
   "372633345629975481": {
      "message": "Se fijaron las notas"
   },
   "372823375470132483": {
      "message": "Cancelar selección de nota enviada a la Papelera"
   },
   "3734444903221631913": {
      "message": "{NUM_ITEMS_1,plural, =0{unused plural form}=1{unused plural form}other{Quitarás {NUM_ITEMS_2} elementos de las unidades de equipo y las carpetas compartidas, por lo que las personas perderán el acceso a ellos.}}"
   },
   "3751183760611784323": {
      "message": "Se hizo zoom para que el elemento se ajuste al ancho de la pantalla."
   },
   "3793086499925031123": {
      "message": "Abrir la barra de búsqueda/encontrar anterior"
   },
   "3796511349428373407": {
      "message": "Opciones de fecha"
   },
   "37992665410817181": {
      "message": "Reabierto"
   },
   "3801617971018550169": {
      "message": "Ayer"
   },
   "381100310424863459": {
      "message": "Illustrator"
   },
   "3827179818223863356": {
      "message": "Verde claro"
   },
   "3845302429676793049": {
      "message": "Se produjo un error al cambiar la descripción de \"$1​\"."
   },
   "3856960241878617076": {
      "message": "Cargando comentarios. Espera…"
   },
   "3858324058837632381": {
      "message": "Se produjo un error al reproducir este archivo de audio."
   },
   "3869166581651870488": {
      "message": "Finalizar edición"
   },
   "3874597373619381607": {
      "message": "Mostrando los comentarios resueltos"
   },
   "3877974536163446728": {
      "message": "Se seleccionó $1​ ($2​)"
   },
   "3888733084985311515": {
      "message": "Grupo familiar disponible."
   },
   "3897281533382850749": {
      "message": "Dejar de silenciar"
   },
   "3907816292084809686": {
      "message": "Se rehízo la acción"
   },
   "3909380459614154542": {
      "message": "Ir al vínculo"
   },
   "3930910469078167425": {
      "message": "Archivar"
   },
   "3952341864324097024": {
      "message": "Borrar la búsqueda"
   },
   "3955575370175991097": {
      "message": "Se cambió a la vista de la etiqueta $1​"
   },
   "3974822583047850066": {
      "message": "Cancelar"
   },
   "3977699855735576796": {
      "message": "Se produjo un error al cargar más páginas."
   },
   "3981269900634596036": {
      "message": "{numberOfNotes,plural, =1{Borrar la nota}other{Borrar las notas}}"
   },
   "3988418762222300024": {
      "message": "punto"
   },
   "4005725939358875643": {
      "message": "Acción de deshacer realizada correctamente"
   },
   "4020393055976236243": {
      "message": "Se transferirá la propiedad de \"$3​\" ($2​) a $1​."
   },
   "4023299615382814997": {
      "message": "No se puede editar en la Papelera."
   },
   "4030906186910275934": {
      "message": "Ver"
   },
   "4036523543547629779": {
      "message": "Imágenes"
   },
   "4044915502415235332": {
      "message": "Seleccionar la nota fijada"
   },
   "4052960606031736645": {
      "message": "{NUM_ITEMS,plural, =1{Moverás una carpeta ubicada en {NUM_PARENTS} carpetas}other{Moverás carpetas ubicadas en {NUM_PARENTS} carpetas}}"
   },
   "4061102590585232601": {
      "message": "Se quitó a $1​"
   },
   "4064820890482961434": {
      "message": "Mostrar casillas de verificación"
   },
   "4072353527895477784": {
      "message": "Personas"
   },
   "407982090576503781": {
      "message": "¿Deseas mover a Mi unidad?"
   },
   "4081524305222967804": {
      "message": "Verde azulado"
   },
   "4085493778209859942": {
      "message": "Reproducir de todos modos"
   },
   "4086409218932829944": {
      "message": "Editar etiquetas"
   },
   "4087289538934418537": {
      "message": "Al borrarlas, nadie podrá ver las notas que creaste. Las personas que tengan acceso podrán seguir viendo las notas que compartieron contigo."
   },
   "4095714830819118951": {
      "message": "Ayuda"
   },
   "4097921967754832323": {
      "message": "guión"
   },
   "411137507354526852": {
      "message": "Mes"
   },
   "4111452225725405610": {
      "message": "Se eliminó la estrella de \"$1​\"."
   },
   "4117632433281998979": {
      "message": "Mensual"
   },
   "4122858386674768321": {
      "message": "Quitar de $3​$2​$1​"
   },
   "4155905925766040098": {
      "message": "No hay vista previa disponible."
   },
   "4157091150222353401": {
      "message": "Los comentarios se guardan en archivos DOCX, PPTX y XLSX, y pueden verse con Microsoft Office"
   },
   "4174786386751618325": {
      "message": "Nota de foto"
   },
   "4182427157920112948": {
      "message": "tilde de la ñ"
   },
   "4186465168527990324": {
      "message": "\"$1​\" se extrajo correctamente en $2​."
   },
   "4204345954541079744": {
      "message": "No hay notas con esta etiqueta."
   },
   "4206529410529166231": {
      "message": "{NUM_ITEMS,plural, =1{Moverás un elemento ubicado en {NUM_PARENTS} carpetas}other{Moverás elementos ubicados en {NUM_PARENTS} carpetas}}"
   },
   "4209658291185545281": {
      "message": "No se pudo deshacer la acción"
   },
   "4211182812451835307": {
      "message": "Puede editar."
   },
   "4214190403999219403": {
      "message": "Zoom"
   },
   "4214427276033711472": {
      "message": "Configuración"
   },
   "4216242742234357612": {
      "message": "Seleccionar todas las notas"
   },
   "4216628828665009319": {
      "message": "Verde aguacate"
   },
   "4227767243455123953": {
      "message": "Comportamiento de la lista"
   },
   "4228870062013120023": {
      "message": "Navegar a la nota anterior/siguiente"
   },
   "4230101516585408149": {
      "message": "Redactar una nueva nota"
   },
   "4239183034054216803": {
      "message": "Marrón"
   },
   "4243437721135025638": {
      "message": "No tienes permiso para mover archivos en esta unidad de equipo."
   },
   "4248787844477062707": {
      "message": "Crear etiqueta nueva"
   },
   "4267845092591696061": {
      "message": "Destacar/dejar de destacar con una estrella los elementos seleccionados"
   },
   "4269096876505546324": {
      "message": "Enviar comentarios"
   },
   "426927371216979233": {
      "message": "Reglas"
   },
   "4280747719095153198": {
      "message": "Comentario resuelto"
   },
   "4286663890332754386": {
      "message": "Error de carga"
   },
   "4293996570221590891": {
      "message": "Blanco"
   },
   "4296310694082659873": {
      "message": "Herramienta de borrador"
   },
   "4299690446455033653": {
      "message": "Works"
   },
   "4310202846681054741": {
      "message": "{numberOfPreviews,plural, =1{Se quitó la vista previa del vínculo}other{Se quitaron # vistas previas de vínculos}}"
   },
   "4318861667254318892": {
      "message": "Google Video"
   },
   "4320831042030778": {
      "message": "Cancelar"
   },
   "4320942249997687388": {
      "message": "Fin"
   },
   "4321382260116636620": {
      "message": "Seleccionar nota"
   },
   "4332252081504252077": {
      "message": "¡Uy!"
   },
   "4343825450663233452": {
      "message": "Puede ver."
   },
   "4343836986248234462": {
      "message": "Elemento de la lista"
   },
   "4343848624651344174": {
      "message": "Por la tarde"
   },
   "435214284915110062": {
      "message": "Abrir la barra de búsqueda"
   },
   "435444400175963053": {
      "message": "Se movieron $1​ elementos a $2​."
   },
   "4356312843186491987": {
      "message": "Mover"
   },
   "4391715930031906467": {
      "message": "Buscar siguiente"
   },
   "4397482594800054550": {
      "message": "Se produjo un error al cambiar el nombre de \"$1​\"."
   },
   "4412626362660239325": {
      "message": "Organizar en Drive"
   },
   "4421168692772991468": {
      "message": "Papelera"
   },
   "4422985761498356257": {
      "message": "Abrir con"
   },
   "4429542915339609008": {
      "message": "No es posible abrir varios archivos con esta app."
   },
   "4439831283519683004": {
      "message": "Gris"
   },
   "4444571967705751871": {
      "message": "Papelera"
   },
   "4448871104213529122": {
      "message": "Ocultar detalles"
   },
   "4457424709416639982": {
      "message": "Agregar a Mi unidad"
   },
   "4462389610494427551": {
      "message": "centímetros"
   },
   "4466605492523079635": {
      "message": "Guardar"
   },
   "4486429060311743289": {
      "message": "Borrar selección"
   },
   "4494250072784000771": {
      "message": "Se detectó una pluma stylus y se habilitó la función de tocar para hacer desplazamientos laterales."
   },
   "45228242181482134": {
      "message": "Reproducir"
   },
   "4524999513489942668": {
      "message": "$2​Instala la extensión de Chrome para guardar en Google Keep$1​ y podrás guardar todo lo que te interesa en Keep con un simple clic."
   },
   "4533605085334699862": {
      "message": "Citas"
   },
   "4543077011795639870": {
      "message": "Se quitó sangría al elemento."
   },
   "4550209323331625907": {
      "message": "$2​Más información$1​"
   },
   "4557086341175267918": {
      "message": "Error al compartir sin conexión"
   },
   "4558568516353053251": {
      "message": "Los lectores de este archivo pueden ver los comentarios y las sugerencias."
   },
   "4561316395348814504": {
      "message": "Descargas de apps"
   },
   "4564682305303579317": {
      "message": "Continuar"
   },
   "456512308416555173": {
      "message": "Libros"
   },
   "4566838580250578446": {
      "message": "{every,plural, =1{Se repite todos los años}other{Se repite cada # años}}"
   },
   "4583714435275461910": {
      "message": "elemento superior de lista"
   },
   "4586373282767984140": {
      "message": "Amarillo"
   },
   "4595551195988564947": {
      "message": "La Lista de Shopping del Asistente de Google tiene algunos cambios."
   },
   "4607656353105320648": {
      "message": "{count,plural, =1{¿Quieres borrar la nota de forma definitiva?}other{¿Quieres borrar las notas de forma definitiva?}}"
   },
   "4607802784047113873": {
      "message": "Agregar colaborador"
   },
   "4608848277887462246": {
      "message": "Más hojas de cálculo"
   },
   "461126197624379601": {
      "message": "Presiona aquí para comentar este archivo con otros usuarios"
   },
   "4620034373159179678": {
      "message": "Página $1​ de $2​"
   },
   "4632830890362652221": {
      "message": "{NUM_ITEMS,plural, =1{Moverás un elemento ubicado en una carpeta}other{Moverás elementos ubicados en una carpeta}}"
   },
   "4634925432725098930": {
      "message": "px"
   },
   "4643940860676429496": {
      "message": "Guardando…"
   },
   "4675792829115971960": {
      "message": "Marcaremos esta nota y la sacaremos de la cuenta."
   },
   "4685321580747790677": {
      "message": "{every,plural, =1{Se repite cada semana los {days}}other{Se repite cada # semanas los {days}}}"
   },
   "4690120479780049536": {
      "message": "puntos"
   },
   "4691283408020124345": {
      "message": "Vista de lista"
   },
   "4697169479015785830": {
      "message": "Abrir el selector de color y tamaño para la herramienta de caligrafía"
   },
   "4697673185436885400": {
      "message": "Hojas de cálculo anuló la combinación de teclas $2​ del navegador $1​"
   },
   "4698144269846224816": {
      "message": "Tamaño 1"
   },
   "4722167255291887189": {
      "message": "Tamaño 2"
   },
   "4727507448375670209": {
      "message": "Colaboradores"
   },
   "4738612839683751348": {
      "message": "Ya no se puede aplicar sangría al elemento."
   },
   "4740100782728373253": {
      "message": "Guardar en Drive"
   },
   "4748046231232264180": {
      "message": "Formularios de Google"
   },
   "4751202914935960324": {
      "message": "Esta dirección de correo electrónico ya existe."
   },
   "4752655540567953719": {
      "message": "Posición $1​"
   },
   "4762625944764691132": {
      "message": "Menú principal"
   },
   "47670360985205683": {
      "message": "\"$1​\" ($2​) supera el tamaño máximo de archivo que Google puede analizar. Este archivo podría dañar tu computadora, por lo que te recomendamos que solo lo reproduzcas si entiendes los riesgos."
   },
   "4767722428137216885": {
      "message": "Cancelar"
   },
   "477328789314249432": {
      "message": "Buscar en las notas"
   },
   "4773737319879079980": {
      "message": "Crea notas más rápido con la aplicación"
   },
   "4775368111547931093": {
      "message": "Sin descripción"
   },
   "4805047680716507619": {
      "message": " Mover a:"
   },
   "4806763987633034948": {
      "message": "PKCS7 Signature"
   },
   "4807444103404336088": {
      "message": "Se produjo un error al agregar una estrella a \"$1​\"."
   },
   "4821130290026382049": {
      "message": "Combinaciones de teclas más utilizadas"
   },
   "4833214200453019325": {
      "message": "$1​ de $2​"
   },
   "4840513623749850224": {
      "message": "Películas"
   },
   "4847795993918486929": {
      "message": "No se pudo guardar el texto de la imagen. Vuelve a intentarlo más tarde."
   },
   "4853788427396558692": {
      "message": "$1​ MB"
   },
   "4858389278403807208": {
      "message": "Nota en la Papelera"
   },
   "4863652737159067460": {
      "message": "ACCEDER"
   },
   "4864051612562026766": {
      "message": "{count,plural, =1{1 elemento seleccionado}other{# elementos seleccionados}}"
   },
   "4878012031550736317": {
      "message": "{NUM_ITEMS,plural, =0{unused plural form}=1{Las personas que no sean miembros de \"{TEAM_DRIVE_NAME}\" perderán el acceso a este archivo.}other{Las personas que no sean miembros de \"{TEAM_DRIVE_NAME}\" perderán el acceso a estos archivos.}}"
   },
   "4888104357342241891": {
      "message": "Recordatorios"
   },
   "490045476479394048": {
      "message": "Destaca parte del texto para agregar comentarios"
   },
   "4901386320110714275": {
      "message": "La contraseña es incorrecta. Vuelve a intentarlo."
   },
   "4906669330059413958": {
      "message": "Enviar contraseña"
   },
   "4907349694646937491": {
      "message": "La nota se movió al índice $1​"
   },
   "4915450884407029247": {
      "message": "Se agregó la etiqueta $1​."
   },
   "4918998818369420588": {
      "message": "Denunciar abuso"
   },
   "4930422592340561418": {
      "message": "Mi unidad"
   },
   "4948512233726694061": {
      "message": "$4​Página$1​$5​$3​$1​$7​/$2​$6​$8​$1​"
   },
   "4955094356920130803": {
      "message": "Ámbar"
   },
   "4957674814179289955": {
      "message": "Ir al elemento de lista anterior o siguiente"
   },
   "4963784280521435720": {
      "message": "Guardando…"
   },
   "4974059227183970715": {
      "message": "También puedes agregar etiquetas si escribes \"#\"."
   },
   "4982284738093713321": {
      "message": "Organizador"
   },
   "4988132901627446385": {
      "message": "Panel de detalles ampliado"
   },
   "5006765610090288212": {
      "message": "Se aplicó el color $1​"
   },
   "5008901799534614532": {
      "message": "Eliminar"
   },
   "5009448218905630614": {
      "message": "Eliminar"
   },
   "5011858093760184160": {
      "message": "Eliminar estrella"
   },
   "5013331898336483156": {
      "message": "¿Mover a Mi unidad en un nuevo dominio?"
   },
   "501475221876543407": {
      "message": "Las notas que agregues aparecerán aquí."
   },
   "5023623739220371850": {
      "message": "Se produjo un error al autenticar. Los cambios se sincronizarán cuando accedas a la cuenta."
   },
   "5041572047197549869": {
      "message": "Todos los meses el mismo día"
   },
   "5045725997997672553": {
      "message": "{weekNumber,plural, =1{El primer {day} del mes}=2{El segundo {day} del mes}=3{El tercer {day} del mes}=4{El cuarto {day} del mes}other{El último {day} del mes}}"
   },
   "5046219519278664288": {
      "message": "iPhone y iPad"
   },
   "5046371569383796818": {
      "message": "Conservar"
   },
   "5052461293250181960": {
      "message": "Av Pág"
   },
   "5054818452036081005": {
      "message": "$2​Privacidad$1​"
   },
   "5060107422621709815": {
      "message": "No se pudo actualizar"
   },
   "5078184843381528205": {
      "message": "Fijar nota"
   },
   "5085332075590890665": {
      "message": "Deshacer"
   },
   "5086862627563516607": {
      "message": "{NUM_ITEMS,plural, =0{forma plural no utilizada}=1{Los miembros de \"{TEAM_DRIVE_NAME}\" obtendrán acceso a este elemento.}other{Los miembros de \"{TEAM_DRIVE_NAME}\" obtendrán acceso a estos elementos.}}"
   },
   "5094400861508407603": {
      "message": "Se quitó la viñeta"
   },
   "5095987896933771566": {
      "message": "Imprimir el documento"
   },
   "509815948423424872": {
      "message": "Navegación"
   },
   "5098941979861776792": {
      "message": "Intro"
   },
   "5121976648047240846": {
      "message": "Quitar la etiqueta"
   },
   "5130903421326358933": {
      "message": "Se produjo un error al guardar el archivo adjunto en Google Drive."
   },
   "5134649253619244584": {
      "message": "Eliminar etiqueta"
   },
   "5140285776541296873": {
      "message": "Personalizado"
   },
   "5140450179685369890": {
      "message": "{NUM_ITEMS_1,plural, =0{unused plural form}=1{Se movió {NUM_ITEMS_2} carpeta a {XXX_1}.}other{Se movieron {NUM_ITEMS_2} carpetas a {XXX_2}.}}"
   },
   "5151247077945318396": {
      "message": "Se produjo un error al seleccionar la carpeta desde la que se desea extraer la información."
   },
   "5159511879001144721": {
      "message": "Azul cobalto"
   },
   "5167365673547406876": {
      "message": "{NUM_ITEMS,plural, =0{unused plural form}=1{Los miembros de \"{TEAM_DRIVE_NAME}\" obtendrán acceso.}other{Los miembros de \"{TEAM_DRIVE_NAME}\" obtendrán acceso.}}"
   },
   "5178674191443894176": {
      "message": "Etiquetas"
   },
   "5180454621500142444": {
      "message": "Restaurar"
   },
   "5180989337128758117": {
      "message": "corchete de apertura"
   },
   "5182569285908080938": {
      "message": "Opciones de fecha de finalización"
   },
   "5184692850089055965": {
      "message": "Guardar texto de la imagen"
   },
   "5184785218378634051": {
      "message": "El elemento ya no tiene zoom."
   },
   "5197718200713913936": {
      "message": "C++"
   },
   "5201670213497642487": {
      "message": "Barra de pestañas del panel de detalles. Presiona las teclas de flecha izquierda y derecha para desplazarte por las pestañas."
   },
   "5202835861850747976": {
      "message": "$2​Más información$1​"
   },
   "5204391636475413312": {
      "message": "Guardar"
   },
   "5238284741118437734": {
      "message": "Deshacer"
   },
   "5238307666527496111": {
      "message": "Aceptar"
   },
   "5238371081785912565": {
      "message": "Abrir con $1​"
   },
   "5253765183290980485": {
      "message": "Solo tienes permiso para agregar elementos a \"$1​\" y editar los elementos de esa unidad de equipo, por lo que no podrás deshacer esta acción."
   },
   "5255388116256536182": {
      "message": "Usa las teclas de flecha para seleccionar las celdas donde deseas agregar comentarios. Mantén presionada la tecla Mayús mientras presionas las teclas de flecha para expandir la selección. Presiona Intro para crear un comentario o Escape para cancelar."
   },
   "5259541708332520733": {
      "message": "Se quitó la fuente"
   },
   "5271615049826004958": {
      "message": "Opciones de vista previa del vínculo"
   },
   "5281121179861637423": {
      "message": "Se necesita una contraseña para acceder a $1​. Ingresa la contraseña."
   },
   "5288037028604092288": {
      "message": "XPS"
   },
   "5299648222246616124": {
      "message": "acento grave (no español)"
   },
   "5300527252159851865": {
      "message": "El contenido del archivo no coincide con el formato de archivo esperado."
   },
   "5320475549855398784": {
      "message": "Este dibujo estará disponible cuando estés en línea."
   },
   "5321772883765574323": {
      "message": "\"$1​\" se movió de $2​ a $3​."
   },
   "5334959887390704534": {
      "message": "Eliminaremos esta etiqueta y la eliminaremos de todas las notas de Keep. Las notas no se eliminarán."
   },
   "5336801339221383042": {
      "message": "JavaScript"
   },
   "5336924963122494935": {
      "message": "Seleccionar este elemento"
   },
   "534191528712675978": {
      "message": "Pausa"
   },
   "534228323125524312": {
      "message": "Alejar"
   },
   "5353129315502554762": {
      "message": "Style Sheet"
   },
   "5353173068672429342": {
      "message": "Herramientas de depuración"
   },
   "5362962746518601227": {
      "message": "{NUM_ITEMS,plural, =1{Moverás un archivo ubicado en una carpeta}other{Moverás archivos ubicados en una carpeta}}"
   },
   "5363853533596749934": {
      "message": "Ingresar el nombre de la etiqueta"
   },
   "5372143986724491245": {
      "message": "Hace $1​ día."
   },
   "5372160981898991853": {
      "message": "Publisher"
   },
   "5385273191513151655": {
      "message": "Creando una miniatura…"
   },
   "5392844646168201484": {
      "message": "Tamaño 3"
   },
   "5394695048211047984": {
      "message": "Agregar una fecha"
   },
   "5398036630337418486": {
      "message": "Abrir el documento"
   },
   "5399553230649155346": {
      "message": "en $1​ hora"
   },
   "5403636185480096151": {
      "message": "TV"
   },
   "540596856674438371": {
      "message": "El uso compartido está desactivado, por lo que no se puede compartir contenido."
   },
   "5408091115193390231": {
      "message": "AutoCAD"
   },
   "5413225497191133249": {
      "message": "Fijar o dejar de fijar notas"
   },
   "5423742603774911808": {
      "message": "La lista es demasiado larga."
   },
   "5435749276779042277": {
      "message": "y $1​ MÁS"
   },
   "5447119197363232006": {
      "message": "Mostrar en Drive"
   },
   "5455566801812656827": {
      "message": "MENOS"
   },
   "5465081454525683943": {
      "message": "Esta nota ya no se comparte con tu cuenta. Solicita al propietario acceso a esta nota o cambia a una cuenta que tenga permiso."
   },
   "5467649767578147801": {
      "message": "{NUM_ITEMS,plural, =0{unused plural form}=1{Las personas que no sean miembros de \"{TEAM_DRIVE_NAME}\" o no pertenezcan a {DOMAIN_NAME} perderán el acceso a este archivo.}other{Las personas que no sean miembros de \"{TEAM_DRIVE_NAME}\" o no pertenezcan a {DOMAIN_NAME} perderán el acceso a estos archivos.}}"
   },
   "5472312735475866917": {
      "message": "Comentario de $1​"
   },
   "547865385964196102": {
      "message": "Hace $1​ minutos."
   },
   "5478662967017843220": {
      "message": "Azul oscuro"
   },
   "5480497191725157666": {
      "message": "Esc"
   },
   "5482604275203517054": {
      "message": "izquierda"
   },
   "5503885447744017882": {
      "message": "¿Quieres mover los elementos a $1​ y quitarlos de $2​?"
   },
   "5506390497558702263": {
      "message": "{count,plural, =1{Se extrajo del archivo y se fijó la nota}other{Se extrajeron del archivo y se fijaron # notas}}"
   },
   "5520112019886360037": {
      "message": "Cerrar"
   },
   "5539958940810433464": {
      "message": "Eliminar nota"
   },
   "5542817571710587822": {
      "message": "El archivo tiene demasiadas imágenes."
   },
   "5545146751578623220": {
      "message": "Bloq Mayús"
   },
   "5555182241047709329": {
      "message": "Elegir ubicación"
   },
   "5555599189512365009": {
      "message": "ENTENDIDO"
   },
   "556742419793425318": {
      "message": "Descartar"
   },
   "5581834527128285229": {
      "message": "Se produjo un error al agregar \"$1​\" a Mi unidad."
   },
   "5598649706113950710": {
      "message": "Editor"
   },
   "5627470193961862490": {
      "message": "Las notas con recordatorios próximos aparecerán aquí."
   },
   "564165666160590723": {
      "message": "Reproductor de Windows Media"
   },
   "5657974964218523724": {
      "message": "Vaciar papelera"
   },
   "566719933273904590": {
      "message": "Ir a la etiqueta"
   },
   "5670235154099791694": {
      "message": "in"
   },
   "5672326933907786881": {
      "message": "Las notas de la pantalla bloqueada se guardan de manera automática en Google Keep."
   },
   "5678095606167600931": {
      "message": "Se insertó la viñeta"
   },
   "568072913338360182": {
      "message": "HTML"
   },
   "5707549724380589079": {
      "message": "¿Eliminar elementos seleccionados?"
   },
   "5713014647314396479": {
      "message": "Después de"
   },
   "5714240424645614611": {
      "message": "Android Package"
   },
   "5714760273477184428": {
      "message": "Usa las flechas para destacar un área en la que comentar; luego, presiona Intro"
   },
   "5738003914096572768": {
      "message": "Activos"
   },
   "5755541943799933389": {
      "message": "\"$1​\" se destacó con una estrella."
   },
   "577619047319778196": {
      "message": "Borrar selección"
   },
   "5801257863595278616": {
      "message": "Se movió la selección hacia la izquierda."
   },
   "5820033033803019104": {
      "message": "Organizar"
   },
   "5826302153453971149": {
      "message": "Rosa claro"
   },
   "5840202488368071194": {
      "message": "Nota nueva con imagen"
   },
   "5840330517914556080": {
      "message": "Alejar"
   },
   "5854158607727111728": {
      "message": "Tab"
   },
   "585503297543253590": {
      "message": "El"
   },
   "5870134033985574990": {
      "message": "Extrayendo…"
   },
   "5871966496153339793": {
      "message": "Mostrando la miniatura del video $1​"
   },
   "5895666393386604578": {
      "message": "Para aplicar sangría a los elementos de tu lista, arrástralos o usa la combinación de teclas $1​."
   },
   "5909490544352162901": {
      "message": "Solicita acceso a esta nota al propietario o cambia a una cuenta que tenga permiso (accediste con $1​)."
   },
   "5911012384539794869": {
      "message": "Error al iniciar el proceso de extracción"
   },
   "591481266986424156": {
      "message": "En este momento, el navegador $1​ utiliza esta combinación de teclas para $2​"
   },
   "5916010927050975496": {
      "message": "$1​ KB"
   },
   "5917528552332886959": {
      "message": "Mostrar los comentarios resueltos"
   },
   "5947790263929501779": {
      "message": "Se convirtió el elemento en viñeta"
   },
   "5949528478488617689": {
      "message": "Permiso de descarga"
   },
   "5950887255133612666": {
      "message": "Aún no comenzó."
   },
   "5954965790623966933": {
      "message": "Carmesí"
   },
   "5961981688037913870": {
      "message": "$1​ agregado"
   },
   "5965683144165568126": {
      "message": "Reordenar elemento de la lista"
   },
   "5969696744752069015": {
      "message": "No hay ninguna vista previa disponible."
   },
   "597927944425927829": {
      "message": "Se transferirá la propiedad de \"$1​\" a ti."
   },
   "5984398071085567332": {
      "message": "Tablas dinámicas de Google"
   },
   "5987609488177213747": {
      "message": "Crear etiqueta"
   },
   "5989809255170931770": {
      "message": "{time,plural, =1{Keep se actualizará en # segundo}other{Keep se actualizará en # segundos}}"
   },
   "6005084567691342649": {
      "message": "Recordatorios"
   },
   "6009962986062136164": {
      "message": "Cargando $1​"
   },
   "6011637630664474614": {
      "message": "Espacio"
   },
   "6030537159236285525": {
      "message": "Mover el elemento de la lista a la posición anterior o siguiente"
   },
   "60305871484579258": {
      "message": "Alt"
   },
   "6033916931543811803": {
      "message": "{NUM_ITEMS_1,plural, =0{unused plural form}=1{Se movió {NUM_ITEMS_2} carpeta de {XXX_1} a {XXX_2}.}other{Se movieron {NUM_ITEMS_2} carpetas de {XXX_3} a {XXX_4}.}}"
   },
   "6043578784980337112": {
      "message": "Se movieron $1​ archivos a $2​."
   },
   "6062216008944363143": {
      "message": "{weekNumber,plural, =1{Se repite cada {every} meses el primer {day} del mes.}=2{Se repite cada {every} meses el segundo {day} del mes.}=3{Se repite cada {every} meses el tercer {day} del mes.}=4{Se repite cada {every} meses el cuarto {day} del mes.}other{Se repite cada {every} meses el último {day} del mes.}}"
   },
   "6069780031254134657": {
      "message": "Marcar como hecho"
   },
   "6087078248621415351": {
      "message": "Modificada: $1​"
   },
   "6100883940579706314": {
      "message": "Vista previa del vínculo"
   },
   "6105571474005679446": {
      "message": "Se produjo un error con la vista previa."
   },
   "6113237889871930608": {
      "message": "Nota en blanco"
   },
   "6118623991445349480": {
      "message": "Página $1​"
   },
   "6122643025527543706": {
      "message": "Ctrl"
   },
   "6127325177382263770": {
      "message": "URL"
   },
   "6128550071219729739": {
      "message": "Se borró la imagen"
   },
   "6131822680770571276": {
      "message": "PowerPoint"
   },
   "6140634664402328750": {
      "message": "Lista de aplicaciones"
   },
   "6149175749937815029": {
      "message": "Ver todos los elementos"
   },
   "616807262818311711": {
      "message": "Tipo"
   },
   "6185886893933834031": {
      "message": "Conservar seleccionada"
   },
   "6186753450686672643": {
      "message": "{every,plural, =1{Se repite todos los días.}other{Se repite cada # días.}}"
   },
   "6201176165479907499": {
      "message": "{count,plural, =1{Se fijó la nota}other{Se fijaron # notas}}"
   },
   "6203260615455347677": {
      "message": "Numbers"
   },
   "6209117354086898503": {
      "message": "Atrás"
   },
   "6211895332551673425": {
      "message": "Agregado(s) a $2​Mi unidad$1​"
   },
   "6212070333807533570": {
      "message": "Agregando a $2​Mi unidad$1​…"
   },
   "6223207695466118454": {
      "message": "YouTube"
   },
   "6224687211096863620": {
      "message": "Cualquier persona"
   },
   "6252259197986158120": {
      "message": "Ayer"
   },
   "6263940822259442857": {
      "message": "Ocultar casillas de verificación"
   },
   "628140343505892786": {
      "message": "Configuración"
   },
   "6286379137937560558": {
      "message": "Artículo"
   },
   "6286806453721792102": {
      "message": "Organizar en Drive"
   },
   "6305748545202493254": {
      "message": "Mostrar/ocultar el panel de detalles"
   },
   "6306268376900894985": {
      "message": "Ocurre hasta la fecha {endDate}."
   },
   "6324768448533022780": {
      "message": "$1​ de $2​"
   },
   "6336194821483049583": {
      "message": "App nativa predeterminada"
   },
   "6347484050944915390": {
      "message": "Se envió la solicitud. Cuando se apruebe, recibirás un correo electrónico."
   },
   "6352952829934775705": {
      "message": "MÁS"
   },
   "6366376928558090914": {
      "message": "Comidas"
   },
   "6375244206466599493": {
      "message": "Año"
   },
   "6375395544374251820": {
      "message": "Se produjo un error al cargar más páginas. Volviendo a intentar…"
   },
   "6377664889539934": {
      "message": "Tocar para dibujar"
   },
   "6381941041429900831": {
      "message": "Agregar colaborador"
   },
   "6386587519843563719": {
      "message": "Archivo binario"
   },
   "639451288140270562": {
      "message": "Copiada(s) en Documentos de Google"
   },
   "6394816510866826521": {
      "message": "Pruebas internas"
   },
   "6413404795391222793": {
      "message": "Redactar una lista nueva"
   },
   "6416495701611778255": {
      "message": "Aplicaciones de terceros sugeridas"
   },
   "6419411265907669340": {
      "message": "Hoy"
   },
   "6424277546995954045": {
      "message": "Tu navegador actual no permite anular las combinaciones de teclas.\nPara habilitar esta función, usa Chrome, Firefox, IE/Edge o Safari."
   },
   "6428000916830484004": {
      "message": "Marrón"
   },
   "6432019580434957057": {
      "message": "Audio"
   },
   "6443615802319581315": {
      "message": "{NUM_ITEMS,plural, =1{No tienes permiso para mover este archivo de las carpetas actuales. En su lugar, agrégalo a {START_SPAN_1}{NAME}{END_SPAN}.}other{No tienes permiso para mover estos archivos de las carpetas actuales. En su lugar, agrégalos a {START_SPAN_2}{NAME}{END_SPAN}.}}"
   },
   "6450508807204492448": {
      "message": "Ícono de $1​"
   },
   "6457802200418354862": {
      "message": "Los lectores pueden realizar descargas."
   },
   "6459405233858728718": {
      "message": "Presentaciones de Google"
   },
   "6464761738227651511": {
      "message": "Hace $1​ minuto."
   },
   "6466736813846482957": {
      "message": "Anterior"
   },
   "6466858417983764649": {
      "message": "Crea notas con recordatorios para lugares y fechas, haz notas de voz y trabaja en línea o sin conexión."
   },
   "6472238195689960152": {
      "message": "Blanco"
   },
   "6473102097014191455": {
      "message": "Nota con dibujo"
   },
   "6477306554098527424": {
      "message": "Asistente de Google"
   },
   "6480376252068839019": {
      "message": "Abrir opciones de cuadrícula"
   },
   "6496683100661104868": {
      "message": "$2​Licencias de código abierto$1​"
   },
   "6497197865876438261": {
      "message": "Música"
   },
   "6507257480072167483": {
      "message": "El nombre de la etiqueta se cambió a $1​."
   },
   "6510131849363684615": {
      "message": "Mañana"
   },
   "6513721414466645971": {
      "message": "Quitado"
   },
   "6522917155620379865": {
      "message": "Descargar"
   },
   "6524849072392100692": {
      "message": "Carpeta de Google Drive"
   },
   "653160061888539741": {
      "message": "Control de progreso"
   },
   "6571686604846453345": {
      "message": "Se produjo un error al agregar este elemento a Drive."
   },
   "6578339688410021742": {
      "message": "Todos los miembros de \"$1​\" podrán acceder a los elementos."
   },
   "6579707685908557993": {
      "message": "Media tarde"
   },
   "6582286158693833652": {
      "message": "Más información"
   },
   "6588176324871799870": {
      "message": "Google Apps Script"
   },
   "6618562607681757575": {
      "message": "No mover de ninguna carpeta; simplemente agregar a $3​$2​$1​"
   },
   "6622304228074863427": {
      "message": "Aplicación"
   },
   "6627510416186113122": {
      "message": "Verde azulado claro"
   },
   "6650600936729710500": {
      "message": "Respuestas"
   },
   "6664835828596108553": {
      "message": "Opción"
   },
   "670419277288558500": {
      "message": "Video/audio"
   },
   "6707173584987026005": {
      "message": "Hoy"
   },
   "6710728478489145370": {
      "message": "Cerrar"
   },
   "6713235295664405475": {
      "message": "en|para"
   },
   "6715985122107380503": {
      "message": "Grabaciones"
   },
   "6726462693927865256": {
      "message": "Detalles"
   },
   "6726879257388338969": {
      "message": "Imprimir"
   },
   "6732800471045353930": {
      "message": "Esta nota ya se compartió con la cantidad máxima de personas."
   },
   "673551770550324419": {
      "message": "Ajustar al ancho"
   },
   "6747379635033535953": {
      "message": "Agregar elementos nuevos al final"
   },
   "6747528043814108113": {
      "message": "Se cambió a la vista $1​"
   },
   "6749829802551750923": {
      "message": "arriba"
   },
   "6750600017746655174": {
      "message": "Opción"
   },
   "6750827506231593056": {
      "message": "Cambiar de cuenta"
   },
   "6761622351199419182": {
      "message": "Nota archivada"
   },
   "6773222938695237983": {
      "message": "{NUM_ITEMS,plural, =0{Unused}=1{¿Deseas compartir este elemento?}other{¿Deseas compartir estos elementos?}}"
   },
   "6778577079172085976": {
      "message": "Fijadas"
   },
   "678660085936036852": {
      "message": "Procesando imágenes…"
   },
   "6787580031482277539": {
      "message": "Nunca"
   },
   "6797862596948579998": {
      "message": "App de Chrome"
   },
   "6798055902819777633": {
      "message": "Tocar para hacer desplazamientos laterales"
   },
   "6801348618370627980": {
      "message": "Se creó la etiqueta $1​."
   },
   "6815042072535422726": {
      "message": "Se borró el audio"
   },
   "681598652078493281": {
      "message": "Más información"
   },
   "6822520214440117457": {
      "message": "Trabajo"
   },
   "6823109315717909214": {
      "message": "Probar"
   },
   "6831650827360444197": {
      "message": "La nota se dejó de compartir."
   },
   "6833062695195555756": {
      "message": "Abrir el menú de opciones para la herramienta de borrador"
   },
   "6833760103261954639": {
      "message": "Se produjo un error al cargar la página. Volviendo a intentar…"
   },
   "6861978427131390279": {
      "message": "Enviar comentarios"
   },
   "687402923448150707": {
      "message": "Se desmarcó"
   },
   "689017442055275529": {
      "message": "Grupo familiar de $1​"
   },
   "6891563484025164308": {
      "message": "Anterior"
   },
   "6898823203505321799": {
      "message": "Detalles"
   },
   "6904351530369058983": {
      "message": "Propietario"
   },
   "691041991673354191": {
      "message": "Salir de la nota"
   },
   "6918505531548047245": {
      "message": "Herramienta de resaltador"
   },
   "6921237745237410511": {
      "message": "Agregar un comentario"
   },
   "6922953828399110511": {
      "message": "Cerrar el visor"
   },
   "693770783324368110": {
      "message": "Las notas se dejaron de fijar y se enviaron a la papelera"
   },
   "695253297035211081": {
      "message": "Vaciar Papelera"
   },
   "6980199665979997122": {
      "message": "Restablecer"
   },
   "6982682101118067511": {
      "message": "Organizando…"
   },
   "701276785305022936": {
      "message": "El documento está dañado. Asegúrate de que el archivo tenga el formato más reciente."
   },
   "7017485862232001373": {
      "message": "\"$1​\" se agregó a $2​."
   },
   "7019002927048576918": {
      "message": "Filtros de búsqueda de $1​"
   },
   "7030308038380934896": {
      "message": "La copia en Documentos de Google falló"
   },
   "7050021021988648361": {
      "message": "Copiar URL"
   },
   "7050898523853841537": {
      "message": "Opciones de frecuencia"
   },
   "7054631817922169541": {
      "message": "Google Keep tiene cambios sin guardar. ¿Quieres abandonar la página y descartar los cambios?"
   },
   "705714112650622350": {
      "message": "Se produjo un error al agregar el elemento a Google Drive."
   },
   "7059437903473652416": {
      "message": "Reproducir el video $1​ de YouTube"
   },
   "7065454163742312322": {
      "message": "Más colores"
   },
   "7066744251212631722": {
      "message": "Verde lima"
   },
   "7084324152376766809": {
      "message": "Hace $1​ días."
   },
   "7084991134824194740": {
      "message": "Recordarme"
   },
   "7086801490719148597": {
      "message": "Anular selección de este elemento"
   },
   "7094548885298700726": {
      "message": "Marrón oscuro"
   },
   "7120211249329066227": {
      "message": "¡Tienes un Asistente!"
   },
   "7121259585839664942": {
      "message": "Cancelar"
   },
   "7126326627883991568": {
      "message": "Borrar dibujo actual"
   },
   "7126535013613878060": {
      "message": "Fija tus notas importantes en la parte superior."
   },
   "7135182401951359795": {
      "message": "Se te transferirá la propiedad."
   },
   "7141983486405549971": {
      "message": "Insert"
   },
   "7145753028985071097": {
      "message": "Reordenando nota"
   },
   "7146242673022399081": {
      "message": "Texto"
   },
   "7148992630785407972": {
      "message": "No se puede obtener una vista previa de este archivo porque está protegido por contraseña."
   },
   "7153847618034547771": {
      "message": "Habilitar"
   },
   "7161134329606048317": {
      "message": "Cerrar"
   },
   "7161718175684624843": {
      "message": "Quitar la etiqueta"
   },
   "7164532930742017984": {
      "message": "Cualquier persona que tenga el vínculo"
   },
   "7166989725427500881": {
      "message": "Seleccionar nota enviada a la Papelera"
   },
   "7174189954350964804": {
      "message": "Reintentar"
   },
   "7174908348310449675": {
      "message": "Personaliza tus recordatorios predeterminados"
   },
   "7181961085183734135": {
      "message": "La impresión está inhabilitada en este archivo"
   },
   "7201188472754345797": {
      "message": "{NUM_ITEMS,plural, =0{unused plural form}=1{Las personas que no pertenezcan a \"{DESTINATION_DOMAIN}\" perderán el acceso a este archivo.}other{Las personas que no pertenezcan a \"{DESTINATION_DOMAIN}\" perderán el acceso a estos archivos.}}"
   },
   "7218693060378095915": {
      "message": "Nuevo"
   },
   "722264179594523168": {
      "message": "Cancelar"
   },
   "7225445911355686176": {
      "message": "Seleccionar nota archivada"
   },
   "722702934847795304": {
      "message": "Project"
   },
   "7231231875581131930": {
      "message": "{NUM_ITEMS,plural, =0{Unused}=1{Este elemento no puede volver a moverse a \"{TEAM_DRIVE_NAME}\", así que no podrás deshacer esta acción.}other{Al menos un elemento no puede volver a moverse a \"{TEAM_DRIVE_NAME}\", así que no podrás deshacer esta acción.}}"
   },
   "723223692006219983": {
      "message": "pt"
   },
   "7247530225058410142": {
      "message": "$2​ $1​"
   },
   "7247965266239591227": {
      "message": "Se produjo un error al extraer \"$1​\"."
   },
   "7251490702980298031": {
      "message": "Abrir el selector de color y tamaño para la herramienta de resaltador"
   },
   "7265183966796883739": {
      "message": "Ocultar los comentarios resueltos"
   },
   "7278398674737413598": {
      "message": "No se puede convertir el documento."
   },
   "7278859550373246865": {
      "message": "{count,plural, =1{Se archivó la nota}other{Se archivaron # notas}}"
   },
   "7290932540630116546": {
      "message": "Se estableció el recordatorio: $1​"
   },
   "7295254213841803546": {
      "message": "¿Deseas descartar los cambios? Si lo haces, los cambios no se guardarán."
   },
   "7299749713933143099": {
      "message": "Púrpura"
   },
   "7304355547638486270": {
      "message": "Descargar audio ($1​)"
   },
   "7306962184871750459": {
      "message": "Se transferirá la propiedad de \"$4​\" ($3​) a \"$2​\" ($1​)."
   },
   "7337660181466605745": {
      "message": "No se pudo actualizar \"$1​\" en Drive."
   },
   "7342923890755029722": {
      "message": "Cerrar"
   },
   "7344507440412470266": {
      "message": "Se expandió la selección."
   },
   "734478884582426793": {
      "message": "Archivo comprimido"
   },
   "7353547650196788656": {
      "message": "Rojo"
   },
   "7364571366369083618": {
      "message": "Video"
   },
   "7376703418960184879": {
      "message": "Copiar"
   },
   "7377239345926788722": {
      "message": "Acciones"
   },
   "7382688299146249119": {
      "message": "Descargar elemento"
   },
   "7388342865555961406": {
      "message": "en $1​ día"
   },
   "7393771571081973549": {
      "message": "C"
   },
   "7420117636241237177": {
      "message": "Los mensajes de $1​ se extrajeron en tu cuenta de correo con la etiqueta \"Importar: $2​\"."
   },
   "7426603384368095928": {
      "message": "Vuelve a cargar la página para acceder de nuevo y seguir trabajando."
   },
   "7427333772418801813": {
      "message": "Botón y $1​ MÁS expandido"
   },
   "7429084719905985261": {
      "message": "Objective C"
   },
   "7432956605646331928": {
      "message": "SQL"
   },
   "7440735091552109962": {
      "message": "$2​ (editada a la hora $1​)"
   },
   "7441891675459021164": {
      "message": "Guardando en Drive"
   },
   "744753705925710199": {
      "message": "No pudimos autorizar esta app para todos los archivos que quisiste abrir. Vuelve a intentarlo."
   },
   "7452116603589558390": {
      "message": "Cancelar la selección de la nota fijada"
   },
   "7453297286571818554": {
      "message": "Copiar en Documentos de Google"
   },
   "7453307802804717178": {
      "message": "Celeste"
   },
   "7458942806393710991": {
      "message": "Cancelar selección de nota archivada"
   },
   "7464780237502381438": {
      "message": "Conectar más apps"
   },
   "7468842863971844562": {
      "message": "Nueva lista"
   },
   "7469895656894091562": {
      "message": "Esta dirección de correo electrónico no es válida."
   },
   "7482924911694634213": {
      "message": "{weekNumber,plural, =1{Se repite mensualmente el primer {day} del mes.}=2{Se repite mensualmente el segundo {day} del mes.}=3{Se repite mensualmente el tercer {day} del mes.}=4{Se repite mensualmente el cuarto {day} del mes.}other{Se repite mensualmente el último {day} del mes.}}"
   },
   "7483088916037874359": {
      "message": "El archivo es demasiado grande. "
   },
   "7488945223835574498": {
      "message": "Postscript"
   },
   "7503234138288940590": {
      "message": "Buscar"
   },
   "7507827375601925075": {
      "message": "Mover la nota a la posición anterior o siguiente"
   },
   "7516769578943800930": {
      "message": "Se marcó"
   },
   "7528204871156404767": {
      "message": "Safari"
   },
   "7529683448345488779": {
      "message": "La contraseña que ingresaste es incorrecta. Ingresa una diferente."
   },
   "7530677128711603655": {
      "message": "Resultados de la búsqueda para \"$1​\""
   },
   "754367112212424716": {
      "message": "Hoy más tarde"
   },
   "7564771400033548584": {
      "message": "{selectedCount,plural, =1{# seleccionado}other{# seleccionados}}"
   },
   "7565383798249439151": {
      "message": "en $1​ días"
   },
   "7579280421767578228": {
      "message": "Recordatorio para otro día"
   },
   "7586291841734385643": {
      "message": "Ventana emergente"
   },
   "7587936635257676112": {
      "message": "Se agregó a $1​"
   },
   "7598582624136632660": {
      "message": "Abrir la barra de búsqueda/encontrar siguiente"
   },
   "7598850438299201663": {
      "message": "Abriendo \"$1​\"…"
   },
   "7599358608613738069": {
      "message": "Borrar"
   },
   "7604275940271852148": {
      "message": "Extraer en tu cuenta de correo electrónico"
   },
   "7604400308311739073": {
      "message": "Fijar"
   },
   "7610628906656867728": {
      "message": "Archivo"
   },
   "7610654194202731772": {
      "message": "Eliminar"
   },
   "7624042048123264803": {
      "message": "Abrir nota"
   },
   "7629685876277801112": {
      "message": "Se produjo un problema al mostrar el archivo de mapa."
   },
   "7630723924002267143": {
      "message": "Las combinaciones de teclas para acceso directo están habilitadas."
   },
   "7631302417932873160": {
      "message": "No se puede analizar el archivo en busca de virus"
   },
   "7648759818896108920": {
      "message": "$1​ más"
   },
   "7649506133540465463": {
      "message": "No se pudo deshacer esta acción."
   },
   "7653702763016575386": {
      "message": "Azul"
   },
   "7656983816661099886": {
      "message": "Cosas"
   },
   "7659047104232758352": {
      "message": "ese|aquello|esa|aquella|este|esta"
   },
   "7669677145513127809": {
      "message": "¿Deseas mover entre unidades de equipo?"
   },
   "7669846901402551021": {
      "message": "Hoy"
   },
   "7690349821507417537": {
      "message": "Se quitó el elemento de lista $1​"
   },
   "7690355160889785521": {
      "message": "Verde"
   },
   "7691521283331762131": {
      "message": "Las notas archivadas aparecerán aquí."
   },
   "7709557808259730054": {
      "message": "Aprobaciones"
   },
   "7709889936233398701": {
      "message": "Quitar"
   },
   "7715735412192018288": {
      "message": "Ayuda"
   },
   "7715892737835649602": {
      "message": "También puedes agregar etiquetas si escribes \"#\"."
   },
   "772000107335590599": {
      "message": "en $1​ minutos"
   },
   "7724602581120994002": {
      "message": "Naranja"
   },
   "7728066040934031356": {
      "message": "Púrpura"
   },
   "7734578122414851725": {
      "message": "PHP"
   },
   "7735981667219692675": {
      "message": "{resultCount,plural, =1{# resultado de búsqueda}other{# resultados de búsqueda}}"
   },
   "774390292128857049": {
      "message": "Buscar"
   },
   "7751981235297474273": {
      "message": "Deshacer"
   },
   "7754093419850121316": {
      "message": "⌘"
   },
   "7757440777278143092": {
      "message": "Gris oscuro"
   },
   "7772544658778579390": {
      "message": "Buscar en el documento"
   },
   "777546328624962090": {
      "message": "No se puede cargar este archivo. Aceptamos archivos $1​ de menos de $2​ MB y $3​ MP."
   },
   "778181404304502404": {
      "message": "Se quitó el zoom del elemento."
   },
   "7791050524692390574": {
      "message": "Colores"
   },
   "7800318069267901681": {
      "message": "Modificado"
   },
   "7814778057875152792": {
      "message": "Se produjo un error al mover el archivo adjunto a la carpeta seleccionada de Google Drive."
   },
   "7821512290975371360": {
      "message": "Rosa fucsia"
   },
   "7828886646639771557": {
      "message": "Crear una nota…"
   },
   "7830513726270865588": {
      "message": "Calendario"
   },
   "7842164552344536314": {
      "message": "Organizando..."
   },
   "7844842290699524598": {
      "message": "Alcanzaste la cantidad máxima de etiquetas permitidas. Elimina alguna para poder agregar una nueva."
   },
   "7845751753397906805": {
      "message": "Ediciones en conflicto encontradas"
   },
   "785840448809859989": {
      "message": "Opciones de hora"
   },
   "7865240075542402013": {
      "message": "Destacar con estrella"
   },
   "7868324478160174739": {
      "message": "Azul"
   },
   "7873060817438017568": {
      "message": "$2​ · $1​"
   },
   "7873698934773957560": {
      "message": "Ninguno"
   },
   "787773550893657271": {
      "message": "Se abrió el dibujo anterior"
   },
   "7888520165977111723": {
      "message": "¿Quieres moverlo(s) a una unidad de equipo?"
   },
   "7895643887742936844": {
      "message": "punto y coma"
   },
   "7906726367011430855": {
      "message": "Conectar"
   },
   "7910887984113996757": {
      "message": "Activar el uso compartido"
   },
   "7922692430438844436": {
      "message": "Extraer"
   },
   "792315196550007047": {
      "message": "No hay resultados que coincidan."
   },
   "7943657844420237650": {
      "message": "OpenOffice Impress"
   },
   "7946114032014914338": {
      "message": "{repeatSentence}. {endSentence}."
   },
   "7947001788143789176": {
      "message": "Cargando…"
   },
   "7959130747647079558": {
      "message": "{selectedCount,plural, =1{# nota seleccionada}other{# notas seleccionadas}}"
   },
   "7976461426527138085": {
      "message": "Listas"
   },
   "7988058806865329896": {
      "message": "Elegir fecha y hora"
   },
   "7991475666499751798": {
      "message": "Marcar recordatorio como hecho"
   },
   "7996360883730444101": {
      "message": "Se produjo un error al abrir el archivo. Vuelve a intentarlo."
   },
   "7998118521140187915": {
      "message": "Se ocultaron los comentarios resueltos"
   },
   "8003252582874834655": {
      "message": "Cuando se mueven elementos a una unidad de equipo, se ven afectados el acceso a ellos y la propiedad."
   },
   "8010075936095394680": {
      "message": "La versión del archivo es demasiado antigua. Asegúrate de que el archivo tenga el formato más reciente. "
   },
   "8011497727123874703": {
      "message": "Botón de carpeta $1​"
   },
   "8013687642711017862": {
      "message": "{NUM_ITEMS_1,plural, =0{unused plural form}=1{Quitarás un elemento de las carpetas compartidas, por lo que las personas perderán el acceso a él.}other{Quitarás {NUM_ITEMS_2} elementos de las carpetas compartidas, por lo que las personas perderán el acceso a ellos.}}"
   },
   "8019402848412685977": {
      "message": "Se cambió el nombre de \"$2​\" a \"$1​\"."
   },
   "802668096552856965": {
      "message": "{checkedItemCount,plural, =1{# elemento completado}other{# elementos completados}}"
   },
   "8043514121228710092": {
      "message": "Agregar imagen"
   },
   "8044700199531805239": {
      "message": "Se conectó $3​$1​$2​."
   },
   "8046884224424523922": {
      "message": "{NUM_ITEMS_1,plural, =0{unused plural form}=1{Se movió {NUM_ITEMS_2} archivo de {XXX_1} a {XXX_2}.}other{Se movieron {NUM_ITEMS_2} archivos de {XXX_3} a {XXX_4}.}}"
   },
   "8063817953234049242": {
      "message": "Herramienta de selección"
   },
   "8066398070826666542": {
      "message": "{count,plural, =1{ + # elemento completado}other{+ # elementos completados}}"
   },
   "8069384932934428393": {
      "message": "en $1​ minuto"
   },
   "807840433749698811": {
      "message": "Cian"
   },
   "8080583426915938264": {
      "message": "Aplicaciones en el equipo"
   },
   "8085493757603803516": {
      "message": "Editar selección"
   },
   "8090743714060857028": {
      "message": "Los lectores no pueden descargar."
   },
   "8095838445486198080": {
      "message": "{FILE_SIZE,plural, =0{0 bytes}=1{1 byte}other{# bytes}}"
   },
   "8111632928339277375": {
      "message": "{NUM_FOLDERS,plural, =1{Mover de una carpeta}=2{Mover de ambas carpetas}other{Mover de las # carpetas}}"
   },
   "8125425371755035523": {
      "message": "Deshacer"
   },
   "8133866583554546341": {
      "message": "$1​, a la(s) $2​"
   },
   "8135145577663029437": {
      "message": "Conservar ambas"
   },
   "8139785559888164453": {
      "message": "Más información"
   },
   "8144512434938656483": {
      "message": "o"
   },
   "8146560259680897627": {
      "message": "Cancelar"
   },
   "8149439558305434788": {
      "message": "$1​, $2​"
   },
   "8159493406018222636": {
      "message": "Enviar comentarios"
   },
   "8163781449224244510": {
      "message": "Se retractó la selección."
   },
   "8174654098152723289": {
      "message": "Editar descripción"
   },
   "818217888086545352": {
      "message": "Amarillo"
   },
   "8189126656205301402": {
      "message": "Copiar en Documentos de Google"
   },
   "8194941811853358224": {
      "message": "Se produjo un error al eliminar una estrella de \"$1​\"."
   },
   "821942580510564685": {
      "message": "Ingresa la contraseña de este documento para verlo."
   },
   "8223878224920694193": {
      "message": "Cada"
   },
   "8224193807932432983": {
      "message": "Acciones"
   },
   "8225614702924834215": {
      "message": "Más opciones"
   },
   "8231449936104909428": {
      "message": "Se produjo un problema al mover \"$1​\" a la carpeta seleccionada en Drive."
   },
   "8233945959714786736": {
      "message": "Anterior"
   },
   "8242655297101700529": {
      "message": "Mi unidad"
   },
   "826433162451399549": {
      "message": "Mañana"
   },
   "8273434617910595878": {
      "message": "abajo"
   },
   "8281141013543828574": {
      "message": "Imagen RAW"
   },
   "8292708563843446267": {
      "message": "\"$1​\" será el propietario de los elementos."
   },
   "8304474373444239435": {
      "message": "Respuesta de $1​"
   },
   "8305505634689906340": {
      "message": "Buscar dentro de \"$1​\""
   },
   "8322416564157128458": {
      "message": "Uso compartido"
   },
   "8332720954679654953": {
      "message": "Descargas de aplicaciones"
   },
   "8337582740675387693": {
      "message": "Java"
   },
   "8342620486324515462": {
      "message": "Ignorar"
   },
   "837692854094319105": {
      "message": "No se puede compartir con los siguientes usuarios porque su administrador inhabilitó la posibilidad de compartir elementos con su dominio."
   },
   "8379952094517631162": {
      "message": "No"
   },
   "8409190394690387796": {
      "message": "Agrega un comentario"
   },
   "8412098268689886334": {
      "message": "Combinar"
   },
   "8412733496413412439": {
      "message": "Sin conexión"
   },
   "84334343973701810": {
      "message": "Inicio"
   },
   "8452647597930138120": {
      "message": "Destaca una celda para agregar comentarios"
   },
   "8453627484113670693": {
      "message": "Naranja claro"
   },
   "8467894483369467251": {
      "message": "Flash"
   },
   "8471029293590878384": {
      "message": "Pausar"
   },
   "8493378997610580289": {
      "message": "Más combinaciones de teclas"
   },
   "8505989225387082493": {
      "message": "Agregar etiqueta"
   },
   "8509270263487836281": {
      "message": "Acceder"
   },
   "8517148045938431718": {
      "message": "Corregir errores"
   },
   "8535303351837089357": {
      "message": "Para deshacer y rehacer cambios, presiona {modifierKey}+Z y {modifierKey}+Y."
   },
   "8562196940800756925": {
      "message": "Herramienta de marcador"
   },
   "8589423377647285975": {
      "message": "$1​ el elemento $2​ de lista $3​."
   },
   "8591848339430983053": {
      "message": "Notas"
   },
   "8595175575778060149": {
      "message": "Más"
   },
   "8596279649507974639": {
      "message": "Mover aquí"
   },
   "8602525917014156029": {
      "message": "Lugares"
   },
   "8616342546716995946": {
      "message": "Entendido"
   },
   "8621067185485606452": {
      "message": "ECMAScript"
   },
   "8621178077822096827": {
      "message": "Se insertó el elemento de lista $1​"
   },
   "8626694988569301667": {
      "message": "La opción de dibujar no está disponible"
   },
   "8637215430007224613": {
      "message": "Se abrió el dibujo siguiente"
   },
   "8646821180780920830": {
      "message": "Etiquetas"
   },
   "8652657235429996594": {
      "message": "Pronto"
   },
   "8660016472468563221": {
      "message": "dos puntos"
   },
   "8663507590720636709": {
      "message": "$1​ y $2​ más"
   },
   "8663993454460982287": {
      "message": "Las casillas de verificación están ocultas"
   },
   "8674222789100049233": {
      "message": "Cerrar"
   },
   "86815590954366945": {
      "message": "Lista de contenido archivado"
   },
   "8708723278154759600": {
      "message": "Se archivaron las notas"
   },
   "8726038895018570620": {
      "message": "Ir al vínculo"
   },
   "8734569874711220205": {
      "message": "Menú de navegación"
   },
   "8738345098829705526": {
      "message": "Tamaño 12"
   },
   "8742388056829916665": {
      "message": "Mostrar vistas previas de vínculos enriquecidos"
   },
   "8773943264600860531": {
      "message": "Internet Explorer"
   },
   "8775097441636640256": {
      "message": "$2​: $1​"
   },
   "8781837301864053001": {
      "message": "Texto enriquecido"
   },
   "8786673003584562680": {
      "message": "Re Pág"
   },
   "8792038552136453044": {
      "message": "Se produjo un error"
   },
   "8793166064242077041": {
      "message": "Se produjo un error al visualizar esta imagen."
   },
   "8822326207328431952": {
      "message": "No se puede subir imágenes"
   },
   "8825353897919495748": {
      "message": "{NUM_ITEMS,plural, =0{forma plural no utilizada}=1{¿Estás seguro de que quieres mover este archivo?}other{¿Estás seguro de que quieres mover estos archivos?}}"
   },
   "8845176264121061589": {
      "message": "Desmarcar todos los elementos"
   },
   "8851252390780816895": {
      "message": "Registro del cliente"
   },
   "8852550049823214385": {
      "message": "luego"
   },
   "8860658114732392347": {
      "message": "Borrar el recordatorio"
   },
   "8867634760949689122": {
      "message": "No se pudo convertir el archivo: se agotó el tiempo de espera para la conversión. Vuelve a intentarlo más tarde."
   },
   "8868758864963683383": {
      "message": "Cancelar selección de nota"
   },
   "8869202143464930500": {
      "message": "¿Quieres transferir la propiedad a $1​?"
   },
   "887001400549949730": {
      "message": "Abrir en una ventana nueva"
   },
   "888015650266122140": {
      "message": "repeticiones"
   },
   "8889019648958415451": {
      "message": "Archivo desconocido"
   },
   "8917554093651202032": {
      "message": "Reproducir $1​"
   },
   "8919660666733306860": {
      "message": "Imagen"
   },
   "8923591894816841670": {
      "message": "Se movió la selección hacia abajo."
   },
   "8925842014466254066": {
      "message": "Copiando en Documentos de Google"
   },
   "8930959387403789939": {
      "message": "Recordatorio"
   },
   "8931267220766224111": {
      "message": "¿Quieres activar los recordatorios de Google Keep? Es posible que debas habilitar las notificaciones del navegador."
   },
   "8938626240031421092": {
      "message": "Activar o desactivar casillas de verificación"
   },
   "8943760679396635042": {
      "message": "Mostrando $1​"
   },
   "8953555255469284376": {
      "message": "Suelta las imágenes aquí."
   },
   "8962132866274125834": {
      "message": "Rehacer"
   },
   "896590342186332268": {
      "message": "Tamaño 16"
   },
   "8975305711699693093": {
      "message": "Ocultar la columna de comentarios"
   },
   "8978442832029227748": {
      "message": "Google Jamboard"
   },
   "8979104019474011578": {
      "message": "{every,plural, =1{Se repite todas las semanas.}other{Se repite cada # semanas.}}"
   },
   "8979615310931291676": {
      "message": "Última edición: $1​"
   },
   "8988925599985431446": {
      "message": "No fijar"
   },
   "900086393693234779": {
      "message": "Casa"
   },
   "9003585743562048321": {
      "message": "No se pudieron sincronizar los comentarios debido a un error de red."
   },
   "9012753183662045049": {
      "message": "Escribe un nombre de etiqueta más corto"
   },
   "9021945828354340363": {
      "message": "{count,plural, =1{Ya no verás la nota compartida.}other{Ya no verás las notas compartidas.}}"
   },
   "9024023699330078373": {
      "message": "Si abres este elemento, se agregará a tu unidad de Drive."
   },
   "9058308423774656474": {
      "message": "Hangul Word Processor"
   },
   "9063863448028905602": {
      "message": "Quitar de los resultados"
   },
   "9072994494820207560": {
      "message": "Elemento marcado"
   },
   "9083935734710258396": {
      "message": "Rechazar"
   },
   "9094248058931620597": {
      "message": "Panel de detalles contraído"
   },
   "911586799466052745": {
      "message": "OpenOffice Draw"
   },
   "911698676339750373": {
      "message": "Grupo familiar"
   },
   "9121915169985572840": {
      "message": "Cambiar color"
   },
   "9124422680181020503": {
      "message": "Se borró el dibujo"
   },
   "9131268871618792263": {
      "message": "{NUM_ITEMS,plural, =0{unused plural form}=1{unused plural form}other{Los miembros de las unidades de equipo perderán el acceso, a menos que estos elementos se compartan con ellos.}}"
   },
   "9149141099919589043": {
      "message": "Valores separados por comas"
   },
   "9155213204821633067": {
      "message": "Se dejó de seleccionar $1​."
   },
   "9180910903828232576": {
      "message": "{NUM_ITEMS_1,plural, =0{unused plural form}=1{Se agregó {NUM_ITEMS_2} carpeta a {XXX_1}.}other{Se agregaron {NUM_ITEMS_2} carpetas a {XXX_2}.}}"
   },
   "9197837492705576727": {
      "message": "Ir al siguiente elemento"
   },
   "919969969251998566": {
      "message": "Extrae este archivo en la cuenta de correo."
   },
   "9203454763088526300": {
      "message": "No se puede reconocer el texto."
   },
   "9208632284144316801": {
      "message": "Repetir"
   },
   "9213031420087755232": {
      "message": "Borrar la página"
   },
   "9220412150349575379": {
      "message": "pulgadas"
   },
   "938074023403688885": {
      "message": "Quitar"
   },
   "951963820437151566": {
      "message": "Google Sites"
   },
   "960732173870658714": {
      "message": "Documento de Google Keep"
   },
   "969509857504028202": {
      "message": "Cuando se quitan archivos de una unidad de equipo, se ven afectados el acceso a ellos y la propiedad."
   },
   "976103457024703736": {
      "message": "No se pudo abrir \"$1​\"."
   },
   "985197728509875956": {
      "message": "Chemical Model"
   },
   "991852286447868510": {
      "message": "Buscando $1​"
   },
   "99635082918315028": {
      "message": "Se guardó el texto de las imágenes"
   },
   "996381410993745580": {
      "message": "Photoshop"
   },
   "996406443443155276": {
      "message": "No se pudo abrir \"$1​\"."
   },
   "appDesc": {
      "description": "App description",
      "message": "Registra rápidamente lo que estás pensando y compártelo con tus familiares y amigos."
   },
   "appName": {
      "description": "App name",
      "message": "Google Keep: notas y listas"
   },
   "shortName": {
      "description": "App short name",
      "message": "Google Keep"
   }
}
