{
   "1001407065815272462": {
      "message": "ወደ $2​የእኔ Drive$1​ ማከል አልተቻለም"
   },
   "1013939682284715002": {
      "message": "አደራጅ"
   },
   "1029576232144989689": {
      "message": "እንዲሁም&nbsp;የ$2​Google Keep Chrome ቅጥያውን$1​ በመጠቀም አገናኞችን ለበኋላ ማስቀመጥ ይችላሉ።"
   },
   "1039394921418415681": {
      "message": "በመለያ ይግቡ"
   },
   "1040405721361467195": {
      "message": "አስተያየት የሚሰጡባቸው ቃላትን ለመምረጥ የአቅጣጫ ቁልፎቹን ይጠቀሙ። ምርጫውን ለመዘርጋት ቀስቱን እየጫኑ ሳለ shiftን ይያዙ። አስተያየት ለመፍጠር የEnter ቁልፉን ይጠቀሙ፣ ወይም ለመሰረዝ Escapeን ይጫኑ።"
   },
   "1061011362310586469": {
      "message": "በማጋራት ላይ"
   },
   "1083918249169198626": {
      "message": "የቁልፍ ሰሌዳ አቋራጮች ተሰናክለዋል።"
   },
   "1101371910696766077": {
      "message": "አንድ ቅጂ ስራ"
   },
   "1105774658609209931": {
      "message": "የChrome ቅጥያ"
   },
   "1122146167985532789": {
      "message": "ትላንትና"
   },
   "1127320433256851404": {
      "message": "የቪዲዮ ማጫወቻ"
   },
   "1131044617724567645": {
      "message": "በPDFs ያሉ አስተያየቶች በፋይሉ ላይ የሚቀመጡ ሲሆኑ በሌሎች መተግበሪያዎች ውስጥ ይታያሉ"
   },
   "1137446830169628669": {
      "message": "ንጥል ገብ ተጨምሮበታል።"
   },
   "1158660505977623040": {
      "message": "እስከመጨረሻው ሰርዝ"
   },
   "1162642135048988280": {
      "message": "ሰነድ ዳግም ይሰይሙ"
   },
   "1163324543881570799": {
      "message": "Google ሰነዶች"
   },
   "1166244120191806795": {
      "message": "ግብረመልስ ስጥ"
   },
   "1177768120450365955": {
      "message": "ምልክት የተደረገባቸውን ንጥሎች ወደታች አንቀሳቅስ"
   },
   "1179891706526242218": {
      "message": "ቀጣይ"
   },
   "1185164838496022543": {
      "message": "እባክዎ ገጹን እንደገና ለመጫን እዚህ ጋር ጠቅ ያድርጉ።"
   },
   "1213005208968286932": {
      "message": "መፍትሔ እንዳገኘ ምልክት ተደርጎበታል"
   },
   "124010372300613445": {
      "message": "{numNotes,plural, =1{በማህደር ያልተቀመጠ ማስታወሻ ተፈጥሯል}one{# በማህደር ያልተቀመጡ ማስታወሻዎች ተፈጥረዋል}other{# በማህደር ያልተቀመጡ ማስታወሻዎች ተፈጥረዋል}}"
   },
   "124900027451629830": {
      "message": "አጫውት"
   },
   "125608713654167241": {
      "message": "መካከለኛ አረንጓዴ"
   },
   "1256362146573583104": {
      "message": "አውጣ"
   },
   "1259492729704800881": {
      "message": "ማስታወሻ ይመዝግቡ"
   },
   "1263685395252160366": {
      "message": "LaTeX"
   },
   "1271038294394884640": {
      "message": "ይቅር"
   },
   "12768758038718216": {
      "message": "በማህደር የተቀመጠ ማስታወሻን ሰካ"
   },
   "1280430284217153733": {
      "message": "ጊዜ ያክሉ"
   },
   "1330083198022464084": {
      "message": "አዲስ ማስታወሻ ፍጠር"
   },
   "1333255388111908292": {
      "message": "ሸቀጣ ሸቀጦች"
   },
   "1335763707789999819": {
      "message": "{NUM_ITEMS,plural, =1{ይህን ንጥል አሁን ካለበት አቃፊዎች ውስጥ ለመውሰድ ፍቃድ የለዎትም። በምትኩ ንጥሉን ወደ {START_SPAN_1}{NAME}{END_SPAN} ያክሉት።}one{እነዚህን ንጥሎች አሁን ካሉበት አቃፊዎች ውስጥ ለመውሰድ ፍቃድ የለዎትም። በምትኩ ንጥሉን ወደ {START_SPAN_2}{NAME}{END_SPAN} ያክሏቸው።}other{እነዚህን ንጥሎች አሁን ካሉበት አቃፊዎች ውስጥ ለመውሰድ ፍቃድ የለዎትም። በምትኩ ንጥሉን ወደ {START_SPAN_2}{NAME}{END_SPAN} ያክሏቸው።}}"
   },
   "1338300799355131761": {
      "message": "ርዕስ አልባ ማስታወሻ"
   },
   "1349697396109290623": {
      "message": "ከፍ ያለ የ$1​ ጥራት በማሳየት ላይ"
   },
   "1359937199332190522": {
      "message": "{NUM_ITEMS_1,plural, =0{ጥቅም ላይ ያልዋለ ብዙ ቁጥር}=1{{NUM_ITEMS_2} ፋይል ወደ {XXX_1} ታክሏል።}one{{NUM_ITEMS_2} ፋይሎች ወደ {XXX_2} ታክለዋል።}other{{NUM_ITEMS_2} ፋይሎች ወደ {XXX_2} ታክለዋል።}}"
   },
   "136335357683289450": {
      "message": "ዝጋ"
   },
   "1368808491835583439": {
      "message": "ደማቅ ሐምራዊ"
   },
   "1379850360723600538": {
      "message": "በይለፍ ቃል የተጠበቁ ፋይሎች አይደገፉም።"
   },
   "1397887822627488928": {
      "message": "የሚላክለት ሰው ወይም ኢሜይል"
   },
   "139942704574044780": {
      "message": "ተቀበል"
   },
   "1419896259743862406": {
      "message": "በሚከተለው ክፈት"
   },
   "1432850707344442376": {
      "message": "መሰየሚያ $1​ ፍጠር"
   },
   "1434081385486479995": {
      "message": "ማጋራት አሁን አይገኝም"
   },
   "1439211265324766071": {
      "message": "ማስታወሻ በመጣያ ውስጥ አለ"
   },
   "1441487391064925653": {
      "message": "ሁሉንም አቋራጮች በእገዛ ማዕከል ውስጥ ይመልከቱ"
   },
   "1441712877952841568": {
      "message": "አርትዖት የተደረገው በ$1​"
   },
   "1442722292947881614": {
      "message": "አይነቶች"
   },
   "1446829548948002072": {
      "message": "ኮማ"
   },
   "1453330983536591773": {
      "message": "ፈካ ያለ ግራጫ"
   },
   "1463389029497634261": {
      "message": "ድምጽ ቀንስ"
   },
   "1465828580966685215": {
      "message": "መለያውን አጽዳ"
   },
   "1466663154000252842": {
      "message": "አንዳንድ ሰዎች መዳረሻ ሊያጡ ይችላሉ"
   },
   "1467797923781828000": {
      "message": "$1​ ንጥሎች ወደ $2​ ታክለዋል።"
   },
   "1473312930157933007": {
      "message": "የእርስዎ አስተዳዳሪ ከጎራዎ ውጭ ማጋራትን ስላሰናከሉ ለሚከተሉት ተጠቃሚዎች ማጋራት አይቻልም።"
   },
   "1475258635371833968": {
      "message": "$2​፣ $1​"
   },
   "1475261522522402536": {
      "message": "ቦታ ይምረጡ"
   },
   "1478393252643397554": {
      "message": "ብርቱካናማ"
   },
   "1482452362096735080": {
      "message": "{numOccurrences} ጊዜ ይከሰታል"
   },
   "1499433769420882987": {
      "message": "$1​ን በማሳየት ላይ"
   },
   "1505876360160857231": {
      "message": "$1​ ቴባ"
   },
   "1507063529674142853": {
      "message": "በወሩ የመጨረሻ ቀን ላይ"
   },
   "1507445189431379166": {
      "message": "ሰርዝ"
   },
   "1512114410402431831": {
      "message": "አድስ"
   },
   "1512454807955173272": {
      "message": "Keep መስመር ላይ ሲሆን ይዘመናል"
   },
   "1513178578981188988": {
      "message": "Edge"
   },
   "1532717559893630620": {
      "message": "መሰየሚያ $1​ ወደ $2​ ተዋህዷል።"
   },
   "1536051766421561160": {
      "message": "እኩል ይሆናል"
   },
   "153659275234722804": {
      "message": "አሰናብት"
   },
   "1543499632005215694": {
      "message": "{NUM_ITEMS,plural, =0{ጥቅም ላይ ያልዋለ ብዙ ቁጥር}=1{ወደ «{ADDED_PARENT_NAME}» እየተወሰደ ያለው ፋይል የDLP ማወቅን ቀስቅሷል። በዚህ ፋይል ውስጥ ሚስጥራዊነት ያለው መረጃ ሊኖር ይችላል።}one{ወደ «{ADDED_PARENT_NAME}» እየተወሰዱ ያሉ አንዳንድ ፋይሎቹ የDLP ማወቅን ቀስቅሰዋል። በእነዚህ ፋይሎች ውስጥ ሚስጥራዊነት ያለው መረጃ ሊኖር ይችላል።}other{ወደ «{ADDED_PARENT_NAME}» እየተወሰዱ ያሉ አንዳንድ ፋይሎቹ የDLP ማወቅን ቀስቅሰዋል። በእነዚህ ፋይሎች ውስጥ ሚስጥራዊነት ያለው መረጃ ሊኖር ይችላል።}}"
   },
   "1568379678795589771": {
      "message": "ካሬ"
   },
   "1586968957182554447": {
      "message": "አሰናክል"
   },
   "1588268697057804046": {
      "message": "ከ$1​ ሰዓቶች በፊት"
   },
   "1606998668553414638": {
      "message": "መዳረሻ ይጠይቁ"
   },
   "1612117309990202511": {
      "message": "ነጥቦች"
   },
   "1623657263486883050": {
      "message": "ሴሜ"
   },
   "1633798963327779260": {
      "message": "ነገ"
   },
   "1655692513689044870": {
      "message": "ወጥተው ነበር።"
   },
   "1656911987308166143": {
      "message": "ሰርዝ"
   },
   "1661251023749398110": {
      "message": "ኦዲዮውን አውርድ"
   },
   "1665821947855814052": {
      "message": "መጠን"
   },
   "1675900304699098572": {
      "message": "{count,plural, =1{ማስታወሻ ተነቅሏል}one{# ማስታወሻዎች ተነቅለዋል}other{# ማስታወሻዎች ተነቅለዋል}}"
   },
   "1680617124502957636": {
      "message": "አሁን ላይ ማገናኘት አይቻልም። ቆይተው እንደገና ይሞክሩ።"
   },
   "1680818623013843452": {
      "message": "Lucidchart"
   },
   "1683762293389974494": {
      "message": "ሰርዝ"
   },
   "1694896269813520248": {
      "message": "ስዕል አክል"
   },
   "1697160643589236962": {
      "message": "$1​ ፔባ"
   },
   "1703175513040690135": {
      "message": "$1​ ላይ ያለ ማንኛውም ሰው"
   },
   "1704004075228783011": {
      "message": "{every,plural, =1{በወሩ መጨረሻ ላይ በየወሩ ይደገማል}one{በወሩ መጨረሻ ላይ በየ# ወሩ ይደገማል}other{በወሩ መጨረሻ ላይ በየ# ወሩ ይደገማል}}"
   },
   "1711424025297585662": {
      "message": "||"
   },
   "171683163267149669": {
      "message": "$1​ ጊባ"
   },
   "1730171019350750807": {
      "message": "ጥቁር"
   },
   "1737240194537729525": {
      "message": "ሳምንታዊ"
   },
   "1738407623218213194": {
      "message": "ስም-አልባ"
   },
   "1739900012825270238": {
      "message": "ወደ ቀዳሚው ንጥል ሂድ"
   },
   "1740371341228065086": {
      "message": "ዳግም ጫን"
   },
   "1745782414562966515": {
      "message": "የ«$1​» መሰየሚያው ከ«$2​» መሰየሚያ ጋር ይዋሃድ? የ«$1​» መሰየሚያ ያላቸው ማስታወሻዎች ሁሉ ከ«$2​» ጋር ይዋሃዳሉ፣ እና የ«$1​» መሰየሚያው ይሰረዛል።"
   },
   "1746512984326924716": {
      "message": "ይህ እርምጃ ሊቀለበስ አይችልም።"
   },
   "1783719421893050637": {
      "message": "ልኬቶች"
   },
   "178927681797742562": {
      "message": "ግባ"
   },
   "1791115075948268631": {
      "message": "የቁልፍ ሰሌዳ አቋራጭ እገዛ ይክፈቱ"
   },
   "179545118447015250": {
      "message": "የፍርግርግ ዕይታ"
   },
   "1803966010993357655": {
      "message": "ሌሎች"
   },
   "1808245543551507519": {
      "message": "ድምጽ"
   },
   "1808500458645743749": {
      "message": "የማያ ገጽ ቁልፎች ማስታወሻዎች በራስ-ሰር ወደ Google Keep ይቀመጣሉ። የበጣም ቅርብ ጊዜዎ ማስታወሻ በማያ ገጽ ቁልፉ ላይ እንዳለ ይቀራል።"
   },
   "1810354345035313773": {
      "message": "የምልክት ማድረጊያ መሣሪያ ቀለም እና መጠን መራጭን ይክፈቱ"
   },
   "1819225489062185613": {
      "message": "ሌሎች"
   },
   "1823222042913714987": {
      "message": "የይለፍ ቃል አስገባ"
   },
   "1829174126565818591": {
      "message": "Firefox"
   },
   "1830157062072535681": {
      "message": "$1​ን በማሳየት ላይ"
   },
   "1852745815330163711": {
      "message": "Google ስዕሎች"
   },
   "1857224091554117760": {
      "message": "ቀይ"
   },
   "1870691479127746185": {
      "message": "ቀኝ"
   },
   "187077078156858455": {
      "message": "የድምጽ ማስታወሻ"
   },
   "189303170370862360": {
      "message": "$1​ ከ$2​ ንጥሎች"
   },
   "1900571668686750716": {
      "message": "vCard"
   },
   "1901215424950227523": {
      "message": "የ$1​ መሰየሚያ የለም"
   },
   "1918176455405610789": {
      "message": "ተከናውኗል"
   },
   "1936219394601788126": {
      "message": "ወላጅ"
   },
   "1938115711058331119": {
      "message": "የአስተያየቶች አምድን አሳይ"
   },
   "195154114623528341": {
      "message": "አካባቢ አክል"
   },
   "1956794332842050061": {
      "message": "ቀጣይ ገፅ"
   },
   "1965626377712226216": {
      "message": "Keynote"
   },
   "1967536906522187719": {
      "message": "ይህን ሉህ አስቀድሞ መመልከት ላይ አንድ ችግር ነበር።"
   },
   "1968405748623909021": {
      "message": "ይህንን ንጥል ለመክፈት ወይም አርትእ ለማድረግ ከመተግበሪያዎቹ ውስጥ አንዱን ይሞክሩ"
   },
   "1969531182936822963": {
      "message": "እርምጃ ተቀልብሷል"
   },
   "1973454937875679500": {
      "message": "የመሰየሚያ ስም ያስገቡ"
   },
   "1975630610063119352": {
      "message": "{charsRemaining,plural, =1{# ቁምፊ ይቀራል}one{# ቁምፊዎች ይቀራሉ}other{# ቁምፊዎች ይቀራሉ}}"
   },
   "1980209166254310911": {
      "message": "ቀን"
   },
   "1988244842147989817": {
      "message": "በመጣያ ውስጥ ያሉ ማስታወሻዎች ከ7 ቀኖች በኋላ ይሰረዛሉ።"
   },
   "200005227964332868": {
      "message": "ተጨማሪ"
   },
   "2003845117979929469": {
      "message": "ዝርዝሮች"
   },
   "200488920523496447": {
      "message": "ንጥልን አጉልቷል።"
   },
   "2039757863628752523": {
      "message": "የተደጋጋሚነት አማራጮች"
   },
   "205876860571942679": {
      "message": "የእኔ Google ካርታዎች"
   },
   "2059084517358086391": {
      "message": "የአግኝ አሞሌን ዝጋ"
   },
   "2061440050632248160": {
      "message": "በማህደር አስቀምጥ"
   },
   "2068023589621557589": {
      "message": "TrueType ቅርጸ ቁምፊ"
   },
   "2073322475696388995": {
      "message": "ወደፊት ዝለል"
   },
   "2074454463201225704": {
      "message": "አጉላን ዳግም አስጀምር"
   },
   "207810168108507460": {
      "message": "ከ$1​ ሰዓት በፊት"
   },
   "2085048987351765091": {
      "message": "ገባኝ"
   },
   "2091811447965921066": {
      "message": "እነሱን ያስወግዷቸው"
   },
   "2107379241532042955": {
      "message": "አካባቢ"
   },
   "2107589831642088814": {
      "message": "«$3​$2​$1​»ን ፍጠር"
   },
   "2109979457438465538": {
      "message": "የመሰየሚያ መራጭ ምናሌው ተከፍቷል"
   },
   "2113092209746357267": {
      "message": "Chrome"
   },
   "2118635459760443566": {
      "message": "ቀጣይ"
   },
   "2119255452378336327": {
      "message": "ነጥበ ምልክት ወደ $1​ አድህሯል"
   },
   "212796670323571824": {
      "message": "እሺ"
   },
   "213665695896111861": {
      "message": "ማስታወሻዎች"
   },
   "2138593281154109183": {
      "message": "ማህደር"
   },
   "214517458278879973": {
      "message": "እንደ $1​ ሆነው በመለያ ይግቡ"
   },
   "2147952938331523160": {
      "message": "ዳግም ሰይም..."
   },
   "2154372123324862271": {
      "message": "ህዝባር"
   },
   "2166966123760559393": {
      "message": "አዲስ መሰየሚያ ፍጠር"
   },
   "2168461275182666804": {
      "message": "አርትዕ"
   },
   "2181197458532159304": {
      "message": "{numberOfNotes,plural, =1{ማስታወሻው ተጥሏል}one{# ማስታወሻዎች ተጥለዋል}other{# ማስታወሻዎች ተጥለዋል}}"
   },
   "2184278444368405837": {
      "message": "$1​ ንጥሎች"
   },
   "2187239650627580457": {
      "message": "አስገባ"
   },
   "2189621188983913867": {
      "message": "ተጨማሪ መተግበሪያዎችን ያገናኙ"
   },
   "2190049738646901760": {
      "message": "{count,plural, =1{ማስታወሻ ይሰረዝ?}one{ማስታወሻዎች ይሰረዙ?}other{ማስታወሻዎች ይሰረዙ?}}"
   },
   "2195440644060728966": {
      "message": "{NUM_ITEMS,plural, =1{በአንድ አቃፊ ውስጥ የሚገኝ አቃፊ እየወሰዱ ነው}one{በአንድ አቃፊ ውስጥ የሚገኙ አቃፊዎችን እየወሰዱ ነው}other{በአንድ አቃፊ ውስጥ የሚገኙ አቃፊዎችን እየወሰዱ ነው}}"
   },
   "2198096971937872560": {
      "message": "አስታዋሽ፦"
   },
   "220168959069469607": {
      "message": "ተጨማሪ እርምጃዎች"
   },
   "2202265279234683999": {
      "message": "የቁልፍ ሰሌዳ አቋራጮች"
   },
   "2203926649090909861": {
      "message": "የዝርዝር ንጥል ወደ መረጃ ጠቋሚ $1​ ተወስዷል"
   },
   "2215890921415017560": {
      "message": "የሙሉ ማያ ገጽ ሁነታ"
   },
   "2216904725760458480": {
      "message": "በየቀኑ"
   },
   "221715292685577880": {
      "message": "አዎ"
   },
   "2226562046914098941": {
      "message": "ይህ ፋይል አስቀድሞ ለማየት በጣም ትልቅ ነው"
   },
   "2226937423434054727": {
      "message": "ከ$1​፣ $2​ እስከ $3​፣ $4​ ተመርጧል"
   },
   "223198388381606871": {
      "message": "ፈካ ያለ ወይን ጠጅ"
   },
   "2264311811697505466": {
      "message": "አድስ"
   },
   "2270469222412517777": {
      "message": "ጽሑፍን ለይቶ ማወቅ አልተቻለም"
   },
   "2270633624888102832": {
      "message": "ማስታወሻን ንቀል"
   },
   "2280650195464600721": {
      "message": "ዳሰሳ"
   },
   "2282423663539387332": {
      "message": "በቅርብ ጊዜ የሚካሄዱ"
   },
   "2285069188138705005": {
      "message": "የተገናኙ መተግበሪያዎች"
   },
   "2286685488296851497": {
      "message": "{NUM_ITEMS_1,plural, =0{ጥቅም ላይ ያልዋለ ብዙ ቁጥር}=1{አንድ ንጥል ከተጋራ አቃፊ «{SHARED_FOLDER_NAME}» እያስወጡ ነው፣ ይህም በመሆኑ ሰዎች መዳረሻ ያጣሉ።}one{{NUM_ITEMS_2} ንጥሎችን ከተጋራ አቃፊ «{SHARED_FOLDER_NAME}» እያስወጡ ነው፣ ይህም በመሆኑ ሰዎች መዳረሻ ያጣሉ።}other{{NUM_ITEMS_2} ንጥሎችን ከተጋራ አቃፊ «{SHARED_FOLDER_NAME}» እያስወጡ ነው፣ ይህም በመሆኑ ሰዎች መዳረሻ ያጣሉ።}}"
   },
   "228741435562395266": {
      "message": "ህትመት ገና አይገኝም"
   },
   "2289534534793293486": {
      "message": "ከማህደር አውጣ"
   },
   "2289812403593835836": {
      "message": "ገፆች"
   },
   "229177484946387188": {
      "message": "Google Earth"
   },
   "2292696732672795285": {
      "message": "ድምጽ ጨምር"
   },
   "2299671629154778581": {
      "message": "ማስታወሻዎች ተነቅለው በማህደር ተቀምጠዋል"
   },
   "2308018963132768704": {
      "message": "መጠን 4"
   },
   "2310145944356900158": {
      "message": "ምልክት የተደረገባቸው"
   },
   "2311880726221661199": {
      "message": "ከፍ ያሉ ጥራቶችን በመጫን ላይ"
   },
   "2324955914430674498": {
      "message": "ምንም የ«$1​» ፍለጋ ውጤቶች የሉም"
   },
   "2329167963662998826": {
      "message": "Google Keep የእርስዎን አካባቢ ለአካባቢ አስታዋሾች የቦታዎች ጥቆማዎችን ለማሻሻል ጥቅም ላይ ማዋል ይፈልጋል።"
   },
   "2346361265476305332": {
      "message": "ባለቤቱ የዚህን ኦዲዮ ፋይል ውርዶች ከልክሏል።"
   },
   "2357623745116912085": {
      "message": "{NUM_ITEMS,plural, =0{ጥቅም ላይ ያልዋለ ብዙ ቁጥር}=1{ይህ ንጥል ለእነሱ እስካልተጋራ ድረስ የ«{TEAM_DRIVE_NAME}» አባላት መዳረሻ ያጣሉ።}one{እነዚህ ንጥሎች ለእነሱ እስካልተጋሩ ድረስ የ«{TEAM_DRIVE_NAME}» አባላት መዳረሻ ያጣሉ።}other{እነዚህ ንጥሎች ለእነሱ እስካልተጋሩ ድረስ የ«{TEAM_DRIVE_NAME}» አባላት መዳረሻ ያጣሉ።}}"
   },
   "2357761837816388330": {
      "message": "ከመስመር ውጪ"
   },
   "2359614137862708172": {
      "message": "Shift"
   },
   "2364374826543847335": {
      "message": "ምንጩን አስወግድ"
   },
   "236689092839978781": {
      "message": "አይደጋገምም"
   },
   "2370656573843123707": {
      "message": "ቀኝ ቅንፍ"
   },
   "2373760032138505521": {
      "message": "መሰየሚያ አስቀድሞ አለ"
   },
   "2386536768112358461": {
      "message": "ገጽ ወደ ታች"
   },
   "2396804279177914769": {
      "message": "ባለቤትነት ወደ የቡድን Drive ይተላለፍ?"
   },
   "2405795704816921421": {
      "message": "$1​ ፋይል"
   },
   "2408383448126741628": {
      "message": "የቆይታ ጊዜ"
   },
   "2408933271548524782": {
      "message": "ተቆልፏል"
   },
   "2423877407428530040": {
      "message": "ፋይሉ በጣም ብዙ ገበታዎች አሉት።"
   },
   "2433429041384246549": {
      "message": "ድምጸ-ከል አድርግ"
   },
   "2444198666025646119": {
      "message": "ሐምራዊ"
   },
   "2449254824382583885": {
      "message": "ለይተህ አውጣ"
   },
   "2452145367257933677": {
      "message": "ቀልብስ"
   },
   "2452522051596946166": {
      "message": "ውይ! $1​ን ቅድሚያ ማየት ላይ አንድ ችግር ነበር። ዳግም በመሞከር ላይ።"
   },
   "2454642351139428112": {
      "message": "ቀልብስ"
   },
   "2466251465475184755": {
      "message": "መጣያው ይጽዳ? በመጣያ ውስጥ ያሉ ሁሉም ማስታወሻዎች እስከመጨረሻው ይሰረዛሉ።"
   },
   "2475181823688399272": {
      "message": "ቀጣይ"
   },
   "2478862372619762755": {
      "message": "አስተያየት የሚሰጡበትን አካባቢ ያድምቁ"
   },
   "2483363439634684283": {
      "message": "መጠን 20"
   },
   "2504232652631703202": {
      "message": "ተገናኝቷል"
   },
   "251025074207413762": {
      "message": "አንድ ማብራሪያ ያክሉ"
   },
   "2525633490863427854": {
      "message": "ድገም"
   },
   "2527534830196374788": {
      "message": "Ctrl"
   },
   "2532280782491328445": {
      "message": "ቀዳሚውን አግኝ"
   },
   "2555961950726197809": {
      "message": "ተመልካችን በማሳየት ላይ።"
   },
   "2562881166530755046": {
      "message": "ስዕሎች"
   },
   "257317112834806705": {
      "message": "በዝርዝር እና ፍርግርግ እይታ መካከል ቀያይር"
   },
   "2579261044590673579": {
      "message": "የእኔ Drive"
   },
   "2579679351920691492": {
      "message": "ወደኋላ ዝለል"
   },
   "2581526424350930407": {
      "message": "አርትዕ"
   },
   "2584557103820423944": {
      "message": "የዝርዝር ንጥል ገብ አስገባ/ከገብ አስወጣ"
   },
   "2600731575260427177": {
      "message": "ፋይሉ የለም፣ እና ተሰርዞ ሊሆን ይችላል። እባክዎ ፋይሉን እንደገና ለመስቀል ይሞክሩ።"
   },
   "2601304136110057215": {
      "message": "አዲስ ስዕል"
   },
   "2604527707881848686": {
      "message": "ንጥሉ ከዚህ ወዲህ ገቡ ሊቀነስለት አይችልም።"
   },
   "2609409316752026806": {
      "message": "ተሰቅ"
   },
   "2609767652209789035": {
      "message": "መሰየሚያዎች"
   },
   "2623861453769098676": {
      "message": "ይህን ሰነድ ቅድሚያ ማየት ላይ አንድ ችግር ነበር።"
   },
   "2626653026098396543": {
      "message": "{NUM_ITEMS,plural, =0{ስራ ላይ ያልዋለ}=1{ይህን ንጥል መውሰድ የተጋራውን አቃፊ «{SHARED_FOLDER_NAME}»ን ማየት ለሚችል ሰው ሁሉ ያጋራዋል።}one{እነዚህን ንጥሎች መውሰድ የተጋራውን አቃፊ «{SHARED_FOLDER_NAME}»ን ማየት ለሚችል ሰው ሁሉ ያጋራቸዋል።}other{እነዚህን ንጥሎች መውሰድ የተጋራውን አቃፊ «{SHARED_FOLDER_NAME}»ን ማየት ለሚችል ሰው ሁሉ ያጋራቸዋል።}}"
   },
   "2630254198275172065": {
      "message": "ውሰድ ወደ..."
   },
   "2632263751512428257": {
      "message": "በየዓመቱ"
   },
   "2645469029410848421": {
      "message": "{noteCount,plural, =1{የመሰየሚያ ማስታወሻ}one{የመሰየሚያ ማስታወሻዎች}other{የመሰየሚያ ማስታወሻዎች}}"
   },
   "2661850177130037208": {
      "message": "ንጥል ክፈት"
   },
   "2680303811435018716": {
      "message": "ተጨማሪ ንጥሎችን ማከል አይቻልም"
   },
   "2681830832355823748": {
      "message": "ሁሉንም አቋራጮች ይፈልጉ"
   },
   "268402507078609011": {
      "message": "{imagesAdded,plural, =1{ምስል ታክሏል}one{# ምስሎች ታክለዋል}other{# ምስሎች ታክለዋል}}"
   },
   "2702485557996900362": {
      "message": "እርስ በእርሳቸው የሚጋጩ አርትኦቶችን ያስተካክሉ"
   },
   "2704959686524436777": {
      "message": "በመጫን ላይ"
   },
   "2715199780155065699": {
      "message": "ፋይሉ በጣም ብዙ ቅርጾች፣ የጽሑፍ ሣጥኖች ወይም ሥዕሎች አሉት።"
   },
   "2716433087531258659": {
      "message": "ላይ ገጽ"
   },
   "2719125961689709460": {
      "message": "ማስታወሻ"
   },
   "2742719907061406418": {
      "message": "XML"
   },
   "2758125083752925237": {
      "message": "(ባለቤት)"
   },
   "2760106082595028595": {
      "message": "ማስታወሻው በጣም ትልቅ ነው።"
   },
   "277430914014962533": {
      "message": "ውይ! $1​ን ቅድሚያ ማየት ላይ አንድ ችግር ነበር።"
   },
   "2777453609143551768": {
      "message": "የድምጽ መቆጣጠሪያ"
   },
   "2793841261389879255": {
      "message": "ቀዳሚ ገፅ"
   },
   "2794676336056877832": {
      "message": "{every,plural, =1{በእያንዳንዱ ወር ውስጥ በተመሳሳዩ ቀን ላይ በየወሩ ይደገማል}one{በእያንዳንዱ ወር ውስጥ በተመሳሳዩ ቀን ላይ በየ# ወሩ ይደገማል}other{በእያንዳንዱ ወር ውስጥ በተመሳሳዩ ቀን ላይ በየ# ወሩ ይደገማል}}"
   },
   "2798322202738486782": {
      "message": "{HOURS,plural, =0{0 ሰዓቶች }=1{1 ሰዓት }one{# ሰዓቶች }other{# ሰዓቶች }}{MINUTES,plural, =0{0 ደቂቃዎች }=1{1 ደቂቃ }one{# ደቂቃዎች }other{# ደቂቃዎች }}{SECONDS,plural, =0{0 ሰከንዶች።}=1{1 ሰከንድ።}one{# ሰከንዶች።}other{# ሰከንዶች።}}"
   },
   "2803553109654833664": {
      "message": "ሮዝ"
   },
   "2818020101821669029": {
      "message": "የተፈጠረበት ቀን"
   },
   "2820045170951016567": {
      "message": "አስታዋሾች"
   },
   "2823533464825550362": {
      "message": "የሰነድ መቆጣጠሪያዎች"
   },
   "2827039933590757722": {
      "message": "Windows አቋራጭ"
   },
   "2828060233316503200": {
      "message": "{NUM_ITEMS_1,plural, =0{ጥቅም ላይ ያልዋለ ብዙ ቁጥር}=1{{NUM_ITEMS_2} ንጥል ከ{XXX_1} ወደ {XXX_2} ተወስዷል።}one{{NUM_ITEMS_2} ንጥሎች ከ{XXX_3} ወደ {XXX_4} ተወስደዋል።}other{{NUM_ITEMS_2} ንጥሎች ከ{XXX_3} ወደ {XXX_4} ተወስደዋል።}}"
   },
   "2829226075651806940": {
      "message": "አጉላ"
   },
   "2842462703735289745": {
      "message": "የተጋራውን አቃፊ «$1​»ን ማየት የሚችል ሰው ሁሉ መዳረሻ ያገኛል።"
   },
   "2853036885874864031": {
      "message": "ባለቤትነት ወደ $1​ ይዛወራል።"
   },
   "2854717396594966319": {
      "message": "OpenOffice Writer"
   },
   "2858566870229558873": {
      "message": "$2​ውል$1​"
   },
   "2862675909830094845": {
      "message": "አዲስ መሰየሚያ ፍጠር"
   },
   "2873089307546162154": {
      "message": "እሺ"
   },
   "2877285560485318801": {
      "message": "ለአፍታ አቁም"
   },
   "2879276552944958066": {
      "message": "ወደ የ$1​ አቃፊ ተመለስ።"
   },
   "2886313667612471214": {
      "message": "ማደስ ያስፈልጋል። የተወሰኑ ደቂቃዎችን ሊወስድ ይችላል።"
   },
   "2893055432094515558": {
      "message": "አመልካች ሳጥኖች ይታያሉ"
   },
   "289798573180023043": {
      "message": "እሺ"
   },
   "2901360496423912565": {
      "message": "ሪፖርት አድርግ"
   },
   "2902570047322934912": {
      "message": "ማጋራትን ያንቁ"
   },
   "2908917161758545146": {
      "message": "{count,plural, =1{ማስታወሻ ተነቅሎ በማህደር ተቀምጧል}one{# ማስታወሻዎች ተነቅለው በማህደር ተቀምጠዋል}other{# ማስታወሻዎች ተነቅለው በማህደር ተቀምጠዋል}}"
   },
   "292972929665636688": {
      "message": "Keep ላይ አዲስ ማስታወሻዎችን እና የማረጋገጫ ዝርዝሮችን ለመፍጠር Google ረዳትን አሁን መጠቀም ይችላሉ።"
   },
   "2935193106137642160": {
      "message": "ማጉላት አይገኝም"
   },
   "2942094715879803305": {
      "message": "ምልክት የተደረገባቸውን ንጥሎች ሰርዝ"
   },
   "295331174171409695": {
      "message": "የ«$1​» ማውረጃ ፍቃድ ማዘመን ላይ አንድ ችግር ነበር።"
   },
   "2960516445247616550": {
      "message": "ህትመት አይገኝም"
   },
   "296391753033307868": {
      "message": "መሰየሚያ $1​ ተፈጥሮ ወደ ማስታወሻ ታክሏል።"
   },
   "2964778642459027786": {
      "message": "በመጣያ ውስጥ ያሉ ማስታወሻዎች"
   },
   "2971623719720688041": {
      "message": "እርምጃ ተቀልብሷል"
   },
   "2971780287153684447": {
      "message": "የAndroid መሣሪያዎች"
   },
   "2973306402585941108": {
      "message": "ጥዋት"
   },
   "298817883481775869": {
      "message": "በመጫን ላይ..."
   },
   "2990497076082409431": {
      "message": "«$1​» ወደ $2​ ተወስዷል።"
   },
   "2993901764282547916": {
      "message": "መተግበሪያ ገንቢ"
   },
   "3005058076425755361": {
      "message": "የኋሊት መደምሰሻ"
   },
   "3018905429279095639": {
      "message": "{NUM_ITEMS,plural, =1{ይህን አቃፊ አሁን ካለባቸው አቃፊዎች ውስጥ ለመውሰድ ፍቃድ የለዎትም። በምትኩ አቃፊውን ወደ {START_SPAN_1}{NAME}{END_SPAN} ያክሉት።}one{እነዚህን አቃፊዎች አሁን ካሉባቸው አቃፊዎች ውስጥ ለመውሰድ ፍቃድ የለዎትም። በምትኩ አቃፊዎቹን ወደ {START_SPAN_2}{NAME}{END_SPAN} ያክሏቸው።}other{እነዚህን አቃፊዎች አሁን ካሉባቸው አቃፊዎች ውስጥ ለመውሰድ ፍቃድ የለዎትም። በምትኩ አቃፊዎቹን ወደ {START_SPAN_2}{NAME}{END_SPAN} ያክሏቸው።}}"
   },
   "3043961722025425136": {
      "message": "መግለጫ"
   },
   "3045997283325725532": {
      "message": "Google Keep ውስጥ ምን አዲስ ነገር አለ"
   },
   "306516303501625305": {
      "message": "ማረጋገጫ አልተሳካም።"
   },
   "3108098439469164127": {
      "message": "አዲስ ስዕል ተከፍቷል"
   },
   "3109321241584918345": {
      "message": "ተጨማሪ መተግበሪያዎች አገናኝ..."
   },
   "3121560585545725724": {
      "message": "$1​፣ $2​"
   },
   "3140236589681731084": {
      "message": "በ$1​ ሰዓቶች ውስጥ"
   },
   "3147722095652727387": {
      "message": "የሚከተሉት ተጠቃሚዎች አስተዳዳሪ ከጎራቸው ውጭ ማጋራትን ስላሰናከሉ ወይም የእርስዎ አስተዳዳሪ ከጎራዎ ውጭ ማጋራትን ስላሰናከሉ ለእነሱ ማጋራት አይቻልም።"
   },
   "3149135495425830054": {
      "message": "በመለያ ከተገባ የአስተያየት ጥቆማ እና በራስ-ማጠናቅቅ ይገኛል"
   },
   "3150651996344750990": {
      "message": "{count,plural, =1{ማስታወሻ ከማህደር ወጥቷል}one{# ማስታወሻዎች ከማህደር ወጥተዋል}other{# ማስታወሻዎች ከማህደር ወጥተዋል}}"
   },
   "3167198321908629554": {
      "message": "የእርስዎን ማስታወሻዎች በማደስ እና ዳግም በመጫን ላይ…"
   },
   "3176246635438298155": {
      "message": "ሰርዝ"
   },
   "3187117482772485385": {
      "message": "ድንክዬን በመፍጠር ላይ..."
   },
   "3189854932778515441": {
      "message": "ማስታወሻ በማህደር ውስጥ"
   },
   "3190546672187601036": {
      "message": "ሌሊት"
   },
   "3195812604657128345": {
      "message": "የሚወጣበትን የDrive አቃፊ ይምረጡ"
   },
   "32059145043728507": {
      "message": "{numberOfNotes,plural, =1{ማስታወሻ ወደነበረበት ተመልሷል}one{#ማስታወሻዎች ወደነበሩበት ተመልሰዋል}other{#ማስታወሻዎች ወደነበሩበት ተመልሰዋል}}"
   },
   "3207650089232728475": {
      "message": "መሰየሚያዎችን ቀይር"
   },
   "3211163842850942567": {
      "message": "አጉላ"
   },
   "3217354672216773127": {
      "message": "$1​ ላይ ተቀስቅሷል"
   },
   "3220641589840600333": {
      "message": "ወደ የ$1​ እይታ ተለውጧል"
   },
   "3241696131593027453": {
      "message": "ማስታወሻ ይምረጡ"
   },
   "3243916603465112517": {
      "message": "ያነሰ"
   },
   "3249966726137025950": {
      "message": "የተባባሪ ቤተሰብ ቡድን"
   },
   "3250489229749307913": {
      "message": "ኤሌክትሮኒክ ሕትመት"
   },
   "3258100527833044153": {
      "message": "ባዶ ስዕል ተጥሏል"
   },
   "3261131345401321392": {
      "message": "አስተያየት መስጠት ይችላሉ"
   },
   "3266448715145955862": {
      "message": "ማስታወሻዎች ከማህደር ወጥተው እና ተሰክተዋል"
   },
   "3268028083415317236": {
      "message": "አይ፣ አመሰግናለሁ"
   },
   "3272496516667407797": {
      "message": "ዝርዝሮቹን መጫን ላይ አንድ ችግር ነበር።"
   },
   "3278046126264096288": {
      "message": "ሳምንት"
   },
   "3281684668260174833": {
      "message": "{numberOfNotes,plural, =1{ማስታወሻ ተነቅሎ ተጥሏል}one{# ማስታወሻዎች ተነቅለው እና ተጥለዋል}other{# ማስታወሻዎች ተነቅለው እና ተጥለዋል}}"
   },
   "3288498486633948368": {
      "message": "«$1​» ወደ Google Drive ታክሏል።"
   },
   "330603631583186798": {
      "message": "Word"
   },
   "3308935528045767909": {
      "message": "ስዕል ያለው አዲስ ማስታወሻ"
   },
   "3312545971976531405": {
      "message": "መልዕክት"
   },
   "3326410145104517459": {
      "message": "ከማንኛውም መሣሪያ ላይ $1​ ሆነው ሐሳቦችዎን ይያዙ"
   },
   "3345567742278474807": {
      "message": "ይህ ማስታወሻ አግባብ እንዳለሆነ ተጠቁሟልና ሊጋራ አይችልም"
   },
   "3348057264663626000": {
      "message": "ምርጫ ወደ ላይ ተወስዷል።"
   },
   "3354260708176476985": {
      "message": "በመጫን ላይ…"
   },
   "3362903141674317449": {
      "message": "ተባባሪ"
   },
   "336772567640975291": {
      "message": "ቀጣይ ሳምንት"
   },
   "3371033609268806242": {
      "message": "መሰየሚያ $1​ ተሰርዟል።"
   },
   "3381619429606029445": {
      "message": "Visio"
   },
   "3382236845597426718": {
      "message": "ክፈት"
   },
   "3385831848537487538": {
      "message": "ጉዞ"
   },
   "3409257542937182842": {
      "message": "ድጋሚ በመሞከር ላይ..."
   },
   "3409483962000136213": {
      "message": "አጫውት/ለአፍታ አቁም"
   },
   "3418767079436101103": {
      "message": "ይህን ገጽ መጫን ላይ አንድ ችግር ነበር።"
   },
   "3419821606494999471": {
      "message": "የአስተያየት ማሳወቂያዎችን አቀናብር"
   },
   "3435089737264042207": {
      "message": "አብራ"
   },
   "3447704623213039325": {
      "message": "የግሮሰሪ ንጥል"
   },
   "3448234415275521882": {
      "message": "አጠቃላይ መረጃ"
   },
   "3451851833460018584": {
      "message": "{NUM_COMMENTS,plural, =0{ምንም አስተያየቶች የሉም}=1{አንድ አስተያየት}one{# አስተያየቶች}other{# አስተያየቶች}}"
   },
   "3455405209271884570": {
      "message": "አውጣ"
   },
   "345585899501260401": {
      "message": "(ፒክሴሎች)"
   },
   "345718983715470367": {
      "message": "ምንጭ"
   },
   "3468441711253011521": {
      "message": "Google ሉሆች"
   },
   "3473620774713000513": {
      "message": "መፍትሔ አግኝቷል"
   },
   "3485469306694683931": {
      "message": "ወደ የእርስዎ Drive መለያ ያውጡ"
   },
   "3487924397596265480": {
      "message": "$1​ ተመርጧል።"
   },
   "3488766808236147068": {
      "message": "ቀለም $1​ ነው። በማስታወሻው ላይ ለመተግበር ሌላ ቀለም ይምረጡ።"
   },
   "3496410038494993160": {
      "message": "ታዋቂ የቁልፍ ሰሌዳ አቋራጮች"
   },
   "3518073392823563581": {
      "message": "የቁልፍ ሰሌዳ አቋራጮች"
   },
   "3528739824697875943": {
      "message": "የዝርዝር ንጥል"
   },
   "3549581437554274388": {
      "message": "ምርጫ ወደ ቀኝ ተወስዷል።"
   },
   "3551522853788442530": {
      "message": "ወደኋላ ተመለስ"
   },
   "3551608745198442336": {
      "message": "ስዕል $1​/$2​"
   },
   "3553997866738769437": {
      "message": "ስዕልን አርትዕ"
   },
   "3555017093330694286": {
      "message": "የተጋራው ከ"
   },
   "3555297636767750285": {
      "message": "አረንጓዴ"
   },
   "3561658662634401836": {
      "message": "ርዕስ"
   },
   "3569884090205828853": {
      "message": "OpenOffice Calc"
   },
   "3570074492517305433": {
      "message": "ይመዝገቡ"
   },
   "3571704286086017611": {
      "message": "አስታዋሽ ተሰርዟል"
   },
   "3574963906259719128": {
      "message": "አሳሽዎ ይህን የኦዲዮ ፋይል ማጫወት አልቻለም።"
   },
   "3580293729117872545": {
      "message": "ያልቃል"
   },
   "3595000514985906359": {
      "message": "Excel"
   },
   "3595562664731337243": {
      "message": "መሰየሚያውን ዳግም ሰይም"
   },
   "3603931013946597836": {
      "message": "{NUM_ITEMS,plural, =1{በ{NUM_PARENTS} አቃፊዎች ውስጥ የሚገኝ ፋይል እየሰወዱ ነው።}one{በ{NUM_PARENTS} አቃፊዎች ውስጥ የሚገኙ ፋይሎችን እየሰወዱ ነው።}other{በ{NUM_PARENTS} አቃፊዎች ውስጥ የሚገኙ ፋይሎችን እየሰወዱ ነው።}}"
   },
   "3608606849109645545": {
      "message": "አዲስ የሰነድ ስም ያስገቡ፦"
   },
   "3609912631958780352": {
      "message": "የካሊግራፊ መሣሪያ"
   },
   "3611573349633408445": {
      "message": "አውርድ"
   },
   "3612936866865912552": {
      "message": "በመጫን ላይ…"
   },
   "3617727970098875990": {
      "message": "ሁሉንም አቋራጮች ፈልግ"
   },
   "362521762755836201": {
      "message": "የተፈጠረው በ$1​"
   },
   "3634885664399305142": {
      "message": "ስዕል አይገኝም"
   },
   "3651893685901703652": {
      "message": "..."
   },
   "3657386785336906042": {
      "message": "የኋላ ህዝባር"
   },
   "3659554681396757189": {
      "message": "በእኔ የተከፈተው"
   },
   "366289214151975122": {
      "message": "$1​ ላይ ያለ አገናኙ ያለው ማንኛውም ሰው"
   },
   "3663571259791438207": {
      "message": "አላግባብ መጠቀምን ሪፖርት አድርግ"
   },
   "3664842788764635265": {
      "message": "ምንም"
   },
   "3666123569747918021": {
      "message": "ይሄ ሰነድ ያልተቀመጡ ለውጦች አሉት። ገጹን መልቀቅ እና ለውጦችዎን ማስወገድ ይፈልጋሉ?"
   },
   "3678477908297567934": {
      "message": "የሥር መስመር"
   },
   "3690515530505404607": {
      "message": "ይህን ቪድዮ ማጫወት ላይ አንድ ችግር ነበር።"
   },
   "369764661829607970": {
      "message": "{NUM_ITEMS,plural, =0{ምንም ንጥሎች የሉም}=1{1 ንጥል}one{# ንጥሎች}other{]# ንጥሎች}}"
   },
   "3707311099386068778": {
      "message": "ሁሉንም አስወግድ"
   },
   "3712215972250917265": {
      "message": "አስተያየቶች"
   },
   "3721649886572275931": {
      "message": "መጠን 8"
   },
   "372633345629975481": {
      "message": "ማስታወሻዎች ተሰክተዋል"
   },
   "372823375470132483": {
      "message": "የተጣለ ማስታወሻን አትምረጥ"
   },
   "3734444903221631913": {
      "message": "{NUM_ITEMS_1,plural, =0{ጥቅም ላይ ያልዋለ ብዙ ቁጥር}=1{ጥቅም ላይ ያልዋለ ብዙ ቁጥር}one{{NUM_ITEMS_2} ንጥሎችን ከቡድን Drives እና የተጋሩ አቃፊዎች እያስወጡ ነው፣ ይህም በመሆኑ ሰዎች መዳረሻ ያጣሉ።}other{{NUM_ITEMS_2} ንጥሎችን ከቡድን Drives እና የተጋሩ አቃፊዎች እያስወጡ ነው፣ ይህም በመሆኑ ሰዎች መዳረሻ ያጣሉ።}}"
   },
   "3751183760611784323": {
      "message": "ንጥል በማያ ገጽ ልክ ጎልቷል።"
   },
   "3793086499925031123": {
      "message": "የፍለጋ አሞሌውን ይክፈቱ / ቀዳሚውን አግኝ"
   },
   "3796511349428373407": {
      "message": "የቀን አማራጮች"
   },
   "37992665410817181": {
      "message": "ዳግም ተከፍቷል"
   },
   "3801617971018550169": {
      "message": "ትላንት"
   },
   "381100310424863459": {
      "message": "Illustrator"
   },
   "3827179818223863356": {
      "message": "ፈካ ያለ አረንጓዴ"
   },
   "3845302429676793049": {
      "message": "የ«$1​»ን መግለጫ ማዘመን ላይ አንድ ችግር ነበር።"
   },
   "3856960241878617076": {
      "message": "አስተያየቶች በመጫን ላይ ናቸው፣ እባክዎ ይጠብቁ"
   },
   "3858324058837632381": {
      "message": "ይህን የተሰሚ ፋይል ማጫወት ላይ አንድ ችግር ነበር።"
   },
   "3869166581651870488": {
      "message": "አርትዖት አጠናቅቅ"
   },
   "3874597373619381607": {
      "message": "መፍትሔ የተገኘላቸውን አስተያየቶች በማሳየት ላይ"
   },
   "3877974536163446728": {
      "message": "$1​, $2​ ተመርጧል"
   },
   "3888733084985311515": {
      "message": "የቤተሰብ ቡድን ይገኛል።"
   },
   "3897281533382850749": {
      "message": "ድምጸ-ከል አንሳ"
   },
   "3907816292084809686": {
      "message": "እርምጃ ተደግሟል"
   },
   "3909380459614154542": {
      "message": "ወደ አገናኝ ይሂዱ"
   },
   "3930910469078167425": {
      "message": "አቁር"
   },
   "3952341864324097024": {
      "message": "ፍለጋን አጽዳ"
   },
   "3955575370175991097": {
      "message": "ወደ የ$1​ መሰየሚያ እይታ ተለውጧል"
   },
   "3974822583047850066": {
      "message": "ይቅር"
   },
   "3977699855735576796": {
      "message": "ተጨማሪ ገጾችን መጫን ላይ አንድ ችግር ነበር።"
   },
   "3981269900634596036": {
      "message": "{numberOfNotes,plural, =1{ማስታወሻን ሰርዝ}one{ማስታወሻዎችን ሰርዝ}other{ማስታወሻዎችን ሰርዝ}}"
   },
   "3988418762222300024": {
      "message": "ነጥብ"
   },
   "4005725939358875643": {
      "message": "እርምጃ ተቀልብሷል።"
   },
   "4020393055976236243": {
      "message": "ባለቤትነት በ$2​ ውስጥ ከ«$3​» ወደ $1​ ይተላለፋል።"
   },
   "4023299615382814997": {
      "message": "በቆሻሻ መጣያ ውስጥ አርትዕ ማድረግ አይቻልም"
   },
   "4030906186910275934": {
      "message": "ይመልከቱ"
   },
   "4036523543547629779": {
      "message": "ምስሎች"
   },
   "4044915502415235332": {
      "message": "የተሰካ ማስታወሻን ምረጥ"
   },
   "4052960606031736645": {
      "message": "{NUM_ITEMS,plural, =1{በ{NUM_PARENTS} አቃፊዎች ውስጥ የሚገኝ አቃፊ እየሰወዱ ነው።}one{በ{NUM_PARENTS} አቃፊዎች ውስጥ የሚገኙ አቃፊዎች እየሰወዱ ነው።}other{በ{NUM_PARENTS} አቃፊዎች ውስጥ የሚገኙ አቃፊዎች እየሰወዱ ነው።}}"
   },
   "4061102590585232601": {
      "message": "$1​ ተወግደዋል"
   },
   "4064820890482961434": {
      "message": "አመልካች ሳጥኖችን አሳይ"
   },
   "4072353527895477784": {
      "message": "ሰዎች"
   },
   "407982090576503781": {
      "message": "ወደ የእኔ Drive ይወሰድ?"
   },
   "4081524305222967804": {
      "message": "ጥቁር አረንጓዴ-ሰማያዊ"
   },
   "4085493778209859942": {
      "message": "ለማንኛውም አጫውት"
   },
   "4086409218932829944": {
      "message": "መለያ ስሞችን ያርትዑ"
   },
   "4087289538934418537": {
      "message": "አንድ ጊዜ ከተሰረዘ በኋላ እርስዎ የፈጠሯቸው ማስታወሻዎች ለማንም ሰው አይታዩም። ለእርስዎ የተጋሩ ማስታወሻዎች መዳረሻ ላላቸው የሚታዩ እንደሆኑ ይቀጥላሉ።"
   },
   "4095714830819118951": {
      "message": "እገዛ"
   },
   "4097921967754832323": {
      "message": "ሰረዝ"
   },
   "411137507354526852": {
      "message": "ወር"
   },
   "4111452225725405610": {
      "message": "ኮከብ ከ«$1​» ተወግዷል።"
   },
   "4117632433281998979": {
      "message": "ወርሃዊ"
   },
   "4122858386674768321": {
      "message": "ከዚህ ውሰድ $3​$2​$1​"
   },
   "4155905925766040098": {
      "message": "ምንም ቅድመ እይታ አይገኝም"
   },
   "4157091150222353401": {
      "message": "አስተያየቶች ወደ የDOCX፣ PPTX እና XLSX ፋይሎች የሚቀመጡ ሲሆኑ በMicrosoft Office ላይ ይታያሉ"
   },
   "4174786386751618325": {
      "message": "የፎቶ ማስታወሻ"
   },
   "4182427157920112948": {
      "message": "tilde"
   },
   "4186465168527990324": {
      "message": "በተሳካ ሁኔታ ከ«$1​»  ወደ $2​ እንዲወጣ ተደርጓል"
   },
   "4204345954541079744": {
      "message": "ይህ መሰየሚያ ያላቸው ማስታወሻዎች ገና የሉም"
   },
   "4206529410529166231": {
      "message": "{NUM_ITEMS,plural, =1{በ{NUM_PARENTS} አቃፊዎች ውስጥ የሚገኝ ንጥል እየወሰዱ ነው}one{በ{NUM_PARENTS} አቃፊዎች ውስጥ የሚገኙ ንጥሎችን እየወሰዱ ነው}other{በ{NUM_PARENTS} አቃፊዎች ውስጥ የሚገኙ ንጥሎችን እየወሰዱ ነው}}"
   },
   "4209658291185545281": {
      "message": "እርምጃ ሊቀለበስ አልቻለም"
   },
   "4211182812451835307": {
      "message": "አርትዕ ማድረግ ይችላል"
   },
   "4214190403999219403": {
      "message": "አጉላ"
   },
   "4214427276033711472": {
      "message": "ቅንብሮች"
   },
   "4216242742234357612": {
      "message": "ሁሉንም ማስታወሻዎች ይምረጡ"
   },
   "4216628828665009319": {
      "message": "አቮካዶ አረንጓዴ"
   },
   "4227767243455123953": {
      "message": "ባህሪ ዘርዝር"
   },
   "4228870062013120023": {
      "message": "ወደ ቀጣይ/ቀዳሚ ማስታወሻ ይሂዱ"
   },
   "4230101516585408149": {
      "message": "አዲስ ማስታወሻ ይፃፉ"
   },
   "4239183034054216803": {
      "message": "ቡናማ"
   },
   "4243437721135025638": {
      "message": "ፋይሎችን ወደዚህ የቡድን Drive የመውሰድ ፈቃድ የለዎትም።"
   },
   "4248787844477062707": {
      "message": "አዲስ መሰየሚያ ፍጠር"
   },
   "4267845092591696061": {
      "message": "የተመረጡ ንጥሎች ላይ ኮከብ ያደርጋል/ኮከብ ያነሳል"
   },
   "4269096876505546324": {
      "message": "ግብረመልስ ላክ"
   },
   "426927371216979233": {
      "message": "ደንቦች"
   },
   "4280747719095153198": {
      "message": "አስተያየቱ ተቀርፏል"
   },
   "4286663890332754386": {
      "message": "ሰቀላ አልተሳካም።"
   },
   "4293996570221590891": {
      "message": "ነጭ"
   },
   "4296310694082659873": {
      "message": "የመደምሰሻ መሣሪያ"
   },
   "4299690446455033653": {
      "message": "Works"
   },
   "4310202846681054741": {
      "message": "{numberOfPreviews,plural, =1{የአገናኝ ቅድመ-እይታ ተወግዷል።}one{የ# አገናኝ ቅድመ-እይታዎች ተወግደዋል}other{የ# አገናኝ ቅድመ-እይታዎች ተወግደዋል}}"
   },
   "4318861667254318892": {
      "message": "Google ቪድዮ"
   },
   "4320831042030778": {
      "message": "ይቅር"
   },
   "4320942249997687388": {
      "message": "መጨረሻ"
   },
   "4321382260116636620": {
      "message": "ማስታወሻ ይምረጡ"
   },
   "4332252081504252077": {
      "message": "ውይ!"
   },
   "4343825450663233452": {
      "message": "ማየት ይችላል"
   },
   "4343836986248234462": {
      "message": "ንጥል ዘርዝር"
   },
   "4343848624651344174": {
      "message": "ከሰዓት"
   },
   "435214284915110062": {
      "message": "የፍለጋ አሞሌውን ክፈት"
   },
   "435444400175963053": {
      "message": "$1​ ንጥሎች ወደ $2​ ተወስደዋል።"
   },
   "4356312843186491987": {
      "message": "ውሰድ"
   },
   "4391715930031906467": {
      "message": "ቀጣዩን አግኝ"
   },
   "4397482594800054550": {
      "message": "«$1​»ን ዳግም መሰየም ላይ አንድ ችግር ነበር።"
   },
   "4412626362660239325": {
      "message": "Drive ውስጥ ያደራጁ"
   },
   "4421168692772991468": {
      "message": "መጣያ"
   },
   "4422985761498356257": {
      "message": "ክፈት በ"
   },
   "4429542915339609008": {
      "message": "ይቅርታ፣ በርካታ ፋይሎችን በዚህ መተግበሪያ መክፈት አይደገፍም።"
   },
   "4439831283519683004": {
      "message": "ግራጫ"
   },
   "4444571967705751871": {
      "message": "መጣያ"
   },
   "4448871104213529122": {
      "message": "ዝርዝሮችን ደብቅ"
   },
   "4457424709416639982": {
      "message": "ወደ የእኔ Drive አክል"
   },
   "4462389610494427551": {
      "message": "ሴንቲሜትሮች"
   },
   "4466605492523079635": {
      "message": "አስቀምጥ"
   },
   "4486429060311743289": {
      "message": "ምርጫን አጽዳ"
   },
   "4494250072784000771": {
      "message": "ስታይለስ ተገኝቷል። በንክኪ ማንፏቀቅ ነቅቷል።"
   },
   "45228242181482134": {
      "message": "አጫውት"
   },
   "4524999513489942668": {
      "message": "ቅድሚያ የሚሰጧቸውን ነገሮች በአንዲት ጠቅታ ለማስቀመጥ $2​የ«Google Keep» Chrome ቅጥያውን ይጫኑ$1​።"
   },
   "4533605085334699862": {
      "message": "ጥቅሶች"
   },
   "4543077011795639870": {
      "message": "ንጥሉ ገብ ተቀንሶለታል።"
   },
   "4550209323331625907": {
      "message": "$2​የበለጠ ለመረዳት$1​"
   },
   "4557086341175267918": {
      "message": "ከመስመር ውጪ ማጋራት አይቻልም"
   },
   "4558568516353053251": {
      "message": "የዚህ ፋይል ተመልካቾች አስተያየቶችን እና ጥቆማዎችን ማየት ይችላሉ።"
   },
   "4561316395348814504": {
      "message": "የመተግበሪያ ውርዶች"
   },
   "4564682305303579317": {
      "message": "ቀጥል"
   },
   "456512308416555173": {
      "message": "መጽሐፍት"
   },
   "4566838580250578446": {
      "message": "{every,plural, =1{በየዓመቱ ይደገማል}one{በየ# ዓመቶች ይደገማል}other{በየ# ዓመቶች ይደገማል}}"
   },
   "4583714435275461910": {
      "message": "የወላጅ ዝርዝር ንጥል"
   },
   "4586373282767984140": {
      "message": "ቢጫ"
   },
   "4595551195988564947": {
      "message": "የGoogle ረዳት ግዢ ዝርዝር እየተቀየረ ነው።"
   },
   "4607656353105320648": {
      "message": "{count,plural, =1{ማስታወሻ እስከመጨረሻው ይሰረዝ?}one{ማስታወሻዎች እስከመጨረሻው ይሰረዙ?}other{ማስታወሻዎች እስከመጨረሻው ይሰረዙ?}}"
   },
   "4607802784047113873": {
      "message": "ተባባሪ አክል"
   },
   "4608848277887462246": {
      "message": "ተጨማሪ ሉሆች"
   },
   "461126197624379601": {
      "message": "በዚህ ፋይል ላይ ከሌሎች ጋር ለመወያየት እዚህ መታ ያድርጉ"
   },
   "4620034373159179678": {
      "message": "ገጽ $1​ ከ$2​"
   },
   "4632830890362652221": {
      "message": "{NUM_ITEMS,plural, =1{በአንድ አቃፊ ውስጥ የሚገኝ ንጥል እየወሰዱ ነው}one{በአንድ አቃፊ ውስጥ የሚገኙ ንጥሎችን እየወሰዱ ነው}other{በአንድ አቃፊ ውስጥ የሚገኙ ንጥሎችን እየወሰዱ ነው}}"
   },
   "4634925432725098930": {
      "message": "ፒክሰል"
   },
   "4643940860676429496": {
      "message": "በማስቀመጥ ላይ..."
   },
   "4675792829115971960": {
      "message": "ይህን ማስታወሻ ጥቆማ እናደርግለትና ከመለያዎ እናስወግደዋለን።"
   },
   "4685321580747790677": {
      "message": "{every,plural, =1{በየሳምንቱ {days} ላይ ይደገማል}one{በየ# ሳምንቶች {days} ላይ ይደገማል}other{በየ# ሳምንቶች {days} ላይ ይደገማል}}"
   },
   "4690120479780049536": {
      "message": "ነጥቦች"
   },
   "4691283408020124345": {
      "message": "የዝርዝር እይታ"
   },
   "4697169479015785830": {
      "message": "የካሊግራፊ መሣሪያ ቀለም እና መጠን መራጭን ይክፈቱ"
   },
   "4697673185436885400": {
      "message": "የ$1​ አሳሹ$2​ ቁልፍ ሰሌዳ አቋራጭ በሉሆች ተሽሯል"
   },
   "4698144269846224816": {
      "message": "መጠን 1"
   },
   "4722167255291887189": {
      "message": "መጠን 2"
   },
   "4727507448375670209": {
      "message": "ተባባሪዎች"
   },
   "4738612839683751348": {
      "message": "ንጥሉ ከዚህ ወዲህ ገብ ሊጨመርበት አይችልም።"
   },
   "4740100782728373253": {
      "message": "Drive ላይ አስቀምጥ"
   },
   "4748046231232264180": {
      "message": "Google ቅጾች"
   },
   "4751202914935960324": {
      "message": "ይህ ኢሜይል አስቀድሞ አለ"
   },
   "4752655540567953719": {
      "message": "ቦታ $1​"
   },
   "4762625944764691132": {
      "message": "ዋናው ምናሌ"
   },
   "47670360985205683": {
      "message": "«$1​» ($2​) Google መቃኘት ከሚችለው ከፍተኛው የፋይል መጠን ይበልጣል። ይህ ፋይል ኮምፒውተርዎን ሊጎዳ ይችላል፣ ስለዚህ አደጋዎቹን ከተረዱ ብቻ ይህንን ፋይል ያጫውቱ።"
   },
   "4767722428137216885": {
      "message": "ይቅር"
   },
   "477328789314249432": {
      "message": "ማስታወሻዎችን ፈልግ..."
   },
   "4773737319879079980": {
      "message": "በመተግበሪያው አማካኝነት ማስታወሻዎችን በበለጠ ፍጥነት ይጻፉ"
   },
   "4775368111547931093": {
      "message": "መግለጫ የለም"
   },
   "4805047680716507619": {
      "message": " - ውሰድ ወደ፦"
   },
   "4806763987633034948": {
      "message": "PKCS7 Signature"
   },
   "4807444103404336088": {
      "message": "ኮከብ ወደ «$1​» ማከል ላይ አንድ ችግር ነበር።"
   },
   "4821130290026382049": {
      "message": "ታዋቂ የቁልፍ ሰሌዳ አቋራጮች"
   },
   "4833214200453019325": {
      "message": "$1​ ከ$2​"
   },
   "4840513623749850224": {
      "message": "ፊልሞች"
   },
   "4847795993918486929": {
      "message": "የምስል ጽሑፍን ማምጣት አልተቻለም። ቆይተው እንደገና ይሞክሩ።"
   },
   "4853788427396558692": {
      "message": "$1​ ሜባ"
   },
   "4858389278403807208": {
      "message": "ማስታወሻ በመጣያ ውስጥ ነው"
   },
   "4863652737159067460": {
      "message": "ግባ"
   },
   "4864051612562026766": {
      "message": "{count,plural, =1{1 ተመርጧል}one{# ተመርጠዋል}other{# ተመርጠዋል}}"
   },
   "4878012031550736317": {
      "message": "{NUM_ITEMS,plural, =0{ጥቅም ላይ ያልዋለ ብዙ ቁጥር}=1{ሰዎች የ«{TEAM_DRIVE_NAME}» አባላት ካልሆኑ የዚህን ፋይል መዳረሻ ያጣሉ።}one{ሰዎች የ«{TEAM_DRIVE_NAME}» አባላት ካልሆኑ የእነዚህን ፋይሎች መዳረሻ ያጣሉ።}other{ሰዎች የ«{TEAM_DRIVE_NAME}» አባላት ካልሆኑ የእነዚህን ፋይሎች መዳረሻ ያጣሉ።}}"
   },
   "4888104357342241891": {
      "message": "አስታዋሾች"
   },
   "490045476479394048": {
      "message": "አስተያየት የሚሰጡበትን ጽሑፍ ያድምቁ"
   },
   "4901386320110714275": {
      "message": "ትክክል ያልሆነ የይለፍ ቃል። እባክዎ እንደገና ይሞክሩ።"
   },
   "4906669330059413958": {
      "message": "የይለፍ ቃል ያስገቡ"
   },
   "4907349694646937491": {
      "message": "ማስታወሻ ወደ መረጃ ጠቋሚ $1​ ተወስዷል"
   },
   "4915450884407029247": {
      "message": "መለያ ስም $1​ ታክሏል።"
   },
   "4918998818369420588": {
      "message": "ያለ አግባብ መጠቀምን ሪፖርት አድርግ"
   },
   "4930422592340561418": {
      "message": "የእኔ Drive"
   },
   "4948512233726694061": {
      "message": "$4​ገጽ$1​$5​$3​$1​$7​/$2​$6​$8​$1​"
   },
   "4955094356920130803": {
      "message": "አምበር"
   },
   "4957674814179289955": {
      "message": "ወደ የሚቀጥለው/ቀዳሚው የዝርዝር ንጥል ይዳሱ"
   },
   "4963784280521435720": {
      "message": "በማስቀመጥ ላይ..."
   },
   "4974059227183970715": {
      "message": "እንዲሁም «#»ን በመተየብ መሰየሚያዎችን ማከል ይችላሉ።"
   },
   "4982284738093713321": {
      "message": "አስተባባሪ"
   },
   "4988132901627446385": {
      "message": "የዝርዝሮች ፓነል ተዘርግቷል።"
   },
   "5006765610090288212": {
      "message": "ቀለም $1​ ተተግብሯል"
   },
   "5008901799534614532": {
      "message": "ሰርዝ"
   },
   "5009448218905630614": {
      "message": "አስወግድ"
   },
   "5011858093760184160": {
      "message": "ኮከብ አስወግድ"
   },
   "5013331898336483156": {
      "message": "በአዲስ ጎራ ውስጥ ወደ የእኔ Drive ይወሰድ?"
   },
   "501475221876543407": {
      "message": "የሚያክሏቸው ማስታወሻዎች እዚህ ይታያሉ"
   },
   "5023623739220371850": {
      "message": "ማረጋገጥ አልተሳካም። ሲገቡ ለውጦች ይሰምራሉ።"
   },
   "5041572047197549869": {
      "message": "በየወሩ በተመሳሳይ ቀን"
   },
   "5045725997997672553": {
      "message": "{weekNumber,plural, =1{በወሩ መጀመሪያ {day} ላይ}=2{በወሩ ሁለተኛ {day} ላይ}=3{በወሩ ሶስተኛ {day} ላይ}=4{በወሩ አራተኛ {day} ላይ}one{በወሩ መጨረሻ {day} ላይ}other{በወሩ መጨረሻ {day} ላይ}}"
   },
   "5046219519278664288": {
      "message": "iPhone እና iPad"
   },
   "5046371569383796818": {
      "message": "አስቀምጥ"
   },
   "5052461293250181960": {
      "message": "ታች ገጽ"
   },
   "5054818452036081005": {
      "message": "$2​ግላዊነት$1​"
   },
   "5060107422621709815": {
      "message": "ማደስ አልተሳካም"
   },
   "5078184843381528205": {
      "message": "ማስታወሻን ሰካ"
   },
   "5085332075590890665": {
      "message": "ቀልብስ"
   },
   "5086862627563516607": {
      "message": "{NUM_ITEMS,plural, =0{ጥቅም ላይ ያልዋለ ብዙ ቁጥር}=1{የ«{TEAM_DRIVE_NAME}» አባላት የዚህ ንጥል መዳረሻ ይኖራቸዋል።}one{የ«{TEAM_DRIVE_NAME}» አባላት የእነዚህ ንጥሎች መዳረሻ ይኖራቸዋል።}other{የ«{TEAM_DRIVE_NAME}» አባላት የእነዚህ ንጥሎች መዳረሻ ይኖራቸዋል።}}"
   },
   "5094400861508407603": {
      "message": "ነጥበ ምልክት ተወግዷል"
   },
   "5095987896933771566": {
      "message": "ሰነዱን አትም"
   },
   "509815948423424872": {
      "message": "ዳሰሳ"
   },
   "5098941979861776792": {
      "message": "አስገባ"
   },
   "5121976648047240846": {
      "message": "መለያን አስወግድ"
   },
   "5130903421326358933": {
      "message": "ዓባሪውን Google Drive ላይ ማስቀመጥ ላይ አንድ ችግር ነበር።"
   },
   "5134649253619244584": {
      "message": "መሰየሚያውን ሰርዝ"
   },
   "5140285776541296873": {
      "message": "ብጁ"
   },
   "5140450179685369890": {
      "message": "{NUM_ITEMS_1,plural, =0{ጥቅም ላይ ያልዋለ ብዙ ቁጥር}=1{{NUM_ITEMS_2} አቃፊ ወደ {XXX_1} ተወስዷል።}one{{NUM_ITEMS_2} አቃፊዎች ወደ {XXX_2} ተወስደዋል።}other{{NUM_ITEMS_2} አቃፊዎች ወደ {XXX_2} ተወስደዋል።}}"
   },
   "5151247077945318396": {
      "message": "የሚያስወጡበትን አቃፊ መምረጥ ላይ አንድ ስህተት ተከስቷል።"
   },
   "5159511879001144721": {
      "message": "በራ ያለ ውሃ ሰማያዊ"
   },
   "5167365673547406876": {
      "message": "{NUM_ITEMS,plural, =0{ጥቅም ላይ ያልዋለ ብዙ ቁጥር}=1{የ«{TEAM_DRIVE_NAME}» አባላት መዳረሻ ያገኛሉ።}one{የ«{TEAM_DRIVE_NAME}» አባላት መዳረሻ ያገኛሉ።}other{የ«{TEAM_DRIVE_NAME}» አባላት መዳረሻ ያገኛሉ።}}"
   },
   "5178674191443894176": {
      "message": "መለያዎች"
   },
   "5180454621500142444": {
      "message": "እንደነበር መልስ"
   },
   "5180989337128758117": {
      "message": "ግራ ቅንፍ"
   },
   "5182569285908080938": {
      "message": "የመጨረሻ ቀን አማራጮች"
   },
   "5184692850089055965": {
      "message": "የምስል ጽሁፍ ያዝ"
   },
   "5184785218378634051": {
      "message": "ንጥሉ ከእንግዲህ ወዲያ አልጎላም።"
   },
   "5197718200713913936": {
      "message": "C++"
   },
   "5201670213497642487": {
      "message": "የዝርዝሮች ፓነል ትር አሞሌ። በትሮች መካከል ለመለዋወጥ የግራ እና የቀኝ ቀስት ቁልፎችን ይጫኑ።"
   },
   "5202835861850747976": {
      "message": "$2​የበለጠ ለመረዳት$1​"
   },
   "5204391636475413312": {
      "message": "አስቀምጥ"
   },
   "5238284741118437734": {
      "message": "ቀልብስ"
   },
   "5238307666527496111": {
      "message": "እሺ"
   },
   "5238371081785912565": {
      "message": "በ$1​ ይክፈቱ"
   },
   "5253765183290980485": {
      "message": "እርስዎ በ«$1​» ውስጥ ያሉትን ንጥሎች ለማከል እና ለማርትዕ ብቻ ነው ፈቃድ ያለዎት፣ ስለዚህ ይህን እርምጃ መቀልበስ አይችሉም።"
   },
   "5255388116256536182": {
      "message": "አስተያየት የሚሰጡባቸው ሕዋሶችን ለመምረጥ የአቅጣጫ ቁልፎቹን ይጠቀሙ። ምርጫውን ለመዘርጋት ቀስቱን እየጫኑ ሳለ shiftን ይያዙ። አስተያየት ለመፍጠር Enterን ይጫኑ፣ ወይም ለመሰረዝ Escapeን ይጫኑ።"
   },
   "5259541708332520733": {
      "message": "ምንጭ ተወግዷል"
   },
   "5271615049826004958": {
      "message": "የአገናኝ ቅድመ-እይታ አማራጮች"
   },
   "5281121179861637423": {
      "message": "$1​ን ለመድረስ የይለፍ ቃል ያስፈልጋል። እባክዎ የይለፍ ቃሉን ያስገቡ።"
   },
   "5288037028604092288": {
      "message": "XPS"
   },
   "5299648222246616124": {
      "message": "backtick"
   },
   "5300527252159851865": {
      "message": "የፋይሉ ይዘት ከተጠበቀው የፋይል ቅርጸት ጋር አይዛመድም።"
   },
   "5320475549855398784": {
      "message": "ይህ ስዕል እርስዎ መስመር ላይ ሲሆኑ የሚገኝ ይሆናል።"
   },
   "5321772883765574323": {
      "message": "«$1​» ከ$2​ ወደ $3​ ተወስዷል።"
   },
   "5334959887390704534": {
      "message": "ይህን መሰየሚያ እንሰርዘውና ከሁሉም የKeep ማስታወሻዎችዎ እናስወግደዋለን። የእርስዎ ማስታወሻዎች አይሰረዙም።"
   },
   "5336801339221383042": {
      "message": "ጃቫስክሪፕት"
   },
   "5336924963122494935": {
      "message": "ይህን ምረጥ"
   },
   "534191528712675978": {
      "message": "ለአፍታ አቁም"
   },
   "534228323125524312": {
      "message": "አሳንስ"
   },
   "5353129315502554762": {
      "message": "የቅጥ ሉህ"
   },
   "5353173068672429342": {
      "message": "መሣሪያዎችን አርም"
   },
   "5362962746518601227": {
      "message": "{NUM_ITEMS,plural, =1{በአንድ አቃፊ ውስጥ የሚገኝ ፋይል እየወሰዱ ነው}one{በአንድ አቃፊ ውስጥ የሚገኙ ፋይሎችን እየወሰዱ ነው}other{በአንድ አቃፊ ውስጥ የሚገኙ ፋይሎችን እየወሰዱ ነው}}"
   },
   "5363853533596749934": {
      "message": "የመለያ ስም ያስገቡ"
   },
   "5372143986724491245": {
      "message": "ከ$1​ ቀን በፊት"
   },
   "5372160981898991853": {
      "message": "Publisher"
   },
   "5385273191513151655": {
      "message": "ድንክዬን በመፍጠር ላይ..."
   },
   "5392844646168201484": {
      "message": "መጠን 3"
   },
   "5394695048211047984": {
      "message": "ቀን አክል"
   },
   "5398036630337418486": {
      "message": "ሰነድ ክፈት"
   },
   "5399553230649155346": {
      "message": "በ$1​ ሰዓት ውስጥ"
   },
   "5403636185480096151": {
      "message": "ቲቪ"
   },
   "540596856674438371": {
      "message": "ማጋራት ስለጠፋ ማጋራት አይቻልም።"
   },
   "5408091115193390231": {
      "message": "AutoCAD"
   },
   "5413225497191133249": {
      "message": "ማስታወሻዎችን ይሰኩ ወይም ይንቀሉ"
   },
   "5423742603774911808": {
      "message": "ዝርዝሩ በጣም ትልቅ ነው።"
   },
   "5435749276779042277": {
      "message": "+ $1​ ተጨማሪ"
   },
   "5447119197363232006": {
      "message": "በDrive ውስጥ አሳይ"
   },
   "5455566801812656827": {
      "message": "ያነሰ"
   },
   "5465081454525683943": {
      "message": "ይህ ማስታወሻ ከአሁን በኋላ ከእርስዎ መለያ ጋር አይጋራም። ባለቤቱ መዳረሻ እንዲሰጡዎት ይጠይቋቸው ወይም ፍቃድ ወዳለው መለያ ይቀይሩ።"
   },
   "5467649767578147801": {
      "message": "{NUM_ITEMS,plural, =0{ጥቅም ላይ ያልዋለ ብዙ ቁጥር}=1{ሰዎች የ«{TEAM_DRIVE_NAME}» አባላት ካልሆኑ ወይም ከ{DOMAIN_NAME} ውጪ ከሆኑ የዚህን ፋይል መዳረሻ ያጣሉ።}one{ሰዎች የ«{TEAM_DRIVE_NAME}» አባላት ካልሆኑ ወይም ከ{DOMAIN_NAME} ውጪ ከሆኑ የእነዚህን ፋይሎች መዳረሻ ያጣሉ።}other{ሰዎች የ«{TEAM_DRIVE_NAME}» አባላት ካልሆኑ ወይም ከ{DOMAIN_NAME} ውጪ ከሆኑ የእነዚህን ፋይሎች መዳረሻ ያጣሉ።}}"
   },
   "5472312735475866917": {
      "message": "የ$1​ አስተያየት።"
   },
   "547865385964196102": {
      "message": "ከ$1​ ደቂቃዎች በፊት"
   },
   "5478662967017843220": {
      "message": "ደማቅ ሰማያዊ"
   },
   "5480497191725157666": {
      "message": "Esc ቁልፍ"
   },
   "5482604275203517054": {
      "message": "ግራ"
   },
   "5503885447744017882": {
      "message": "ከ$2​ ውጭ ወደ $1​ ይወሰድ?"
   },
   "5506390497558702263": {
      "message": "{count,plural, =1{ማስታወሻ ከማህደር ወጥቶ ተሰክቷል}one{# ማስታወሻዎች ከማህደር ወጥተው ተሰክተዋል}other{# ማስታወሻዎች ከማህደር ወጥተው ተሰክተዋል}}"
   },
   "5520112019886360037": {
      "message": "ዝጋ"
   },
   "5539958940810433464": {
      "message": "ማስታወሻ ይጣሉ"
   },
   "5542817571710587822": {
      "message": "ፋይሉ በጣም ብዙ ምስሎች አሉት።"
   },
   "5545146751578623220": {
      "message": "አቢያት ማርጊያ"
   },
   "5555182241047709329": {
      "message": "ቦታ ይምረጡ"
   },
   "5555599189512365009": {
      "message": "ገባኝ"
   },
   "556742419793425318": {
      "message": "ጣለው"
   },
   "5581834527128285229": {
      "message": "«$1​»ን ወደ የእኔ Drive መውሰድ ላይ አንድ ችግር ነበር።"
   },
   "5598649706113950710": {
      "message": "አርታዒ"
   },
   "5627470193961862490": {
      "message": "በቅርብ ጊዜ የሚመጡ አስታዋሾች ያላቸው ማስታወሻዎች እዚህ ይታያሉ"
   },
   "564165666160590723": {
      "message": "Windows Media Player"
   },
   "5657974964218523724": {
      "message": "መጣያውን አጽዳ"
   },
   "566719933273904590": {
      "message": "ወደ መሰየሚያ ቀጥል"
   },
   "5670235154099791694": {
      "message": "ኢንች"
   },
   "5672326933907786881": {
      "message": "የማያ ገጽ ቁልፎች ማስታወሻዎች በራስ-ሰር ወደ Google Keep ይቀመጣሉ።"
   },
   "5678095606167600931": {
      "message": "ነጥበ ምልክት ገብቷል"
   },
   "568072913338360182": {
      "message": "ኤችቲኤምኤል"
   },
   "5707549724380589079": {
      "message": "ምልክት የተደረገባቸው ንጥሎች ይሰረዙ?"
   },
   "5713014647314396479": {
      "message": "በኋላ"
   },
   "5714240424645614611": {
      "message": "Android ጥቅል"
   },
   "5714760273477184428": {
      "message": "አስተያየት የሚሰጡበትን አካባቢ ለማድመቅ ቀስቶችን ይጠቀሙ፣ ከዚያ አስገባ የሚለውን ይጫኑ"
   },
   "5738003914096572768": {
      "message": "የተቀሰቀሱ"
   },
   "5755541943799933389": {
      "message": "ኮከብ ወደ «$1​» ታክሏል።"
   },
   "577619047319778196": {
      "message": "ምርጫን አጽዳ"
   },
   "5801257863595278616": {
      "message": "ምርጫ ወደ ግራ ተወስዷል።"
   },
   "5820033033803019104": {
      "message": "አደራጅ"
   },
   "5826302153453971149": {
      "message": "ፈካ ያለ ሮዝ"
   },
   "5840202488368071194": {
      "message": "አዲስ ማስታወሻ ከምስል ጋር"
   },
   "5840330517914556080": {
      "message": "አሳንስ"
   },
   "5854158607727111728": {
      "message": "ትር"
   },
   "585503297543253590": {
      "message": "በ"
   },
   "5870134033985574990": {
      "message": "በማውጣት ላይ...."
   },
   "5871966496153339793": {
      "message": "የቪዲዮ $1​ ጥፍር አክል በማሳየት ላይ"
   },
   "5895666393386604578": {
      "message": "ገብ ለማስገባት በዝርዝርዎ ላይ ያሉ ንጥሎችን ይጎትቱ ወይም የ$1​ አቋራጩን ይጠቀሙ።"
   },
   "5909490544352162901": {
      "message": "ባለቤቱ የዚህ ማስታወሻ መዳረሻ እንዲሰጡዎት ይጠይቋቸው ወይም ፈቃድ ወዳለው መለያ ይቀይሩ። እንደ $1​ ሆነው በመለያ ገብተዋል።"
   },
   "5911012384539794869": {
      "message": "የማውጣት ስራውን መጀመር አልተሳካም።"
   },
   "591481266986424156": {
      "message": "ይህ የቁልፍ ሰሌዳ አቋራጭ በአሁኑ ጊዜ በ$1​ አሳሽ ለ$2​ ጥቅም ላይ ውሏል።"
   },
   "5916010927050975496": {
      "message": "$1​ ኪባ"
   },
   "5917528552332886959": {
      "message": "መፍትሔ የተገኘላቸውን አስተያየቶች አሳይ"
   },
   "5947790263929501779": {
      "message": "ወደ ነጥበ ምልክት ተቀይሯል"
   },
   "5949528478488617689": {
      "message": "የማውረድ ፍቃድ"
   },
   "5950887255133612666": {
      "message": "አልተጀመረም።"
   },
   "5954965790623966933": {
      "message": "ክሪምሶን"
   },
   "5961981688037913870": {
      "message": "$1​ ታክሏል"
   },
   "5965683144165568126": {
      "message": "የዝርዝር ንጥልን ዳግም ደርድር"
   },
   "5969696744752069015": {
      "message": "ምንም ቅድመ እይታ አይገኝም።"
   },
   "597927944425927829": {
      "message": "ባለቤትነት ከ«$1​» ወደ እርስዎ ይተላለፋል።"
   },
   "5984398071085567332": {
      "message": "Google Fusion ሰንጠረዦች"
   },
   "5987609488177213747": {
      "message": "መሰየሚያ ፍጠር"
   },
   "5989809255170931770": {
      "message": "{time,plural, =1{Keep በ# ሰከንድ ውስጥ ይዘመናል}one{Keep በ# ሰከንዶች ውስጥ ይዘመናል}other{Keep በ# ሰከንዶች ውስጥ ይዘመናል}}"
   },
   "6005084567691342649": {
      "message": "አስታዋሾች"
   },
   "6009962986062136164": {
      "message": "$1​ን በመጫን ላይ።"
   },
   "6011637630664474614": {
      "message": "ክፍተት"
   },
   "6030537159236285525": {
      "message": "የዝርዝር ንጥልን ወደ ቀጣዩ/ቀዳሚው ቦታ ይወስዳል"
   },
   "60305871484579258": {
      "message": "Alt"
   },
   "6033916931543811803": {
      "message": "{NUM_ITEMS_1,plural, =0{ጥቅም ላይ ያልዋለ ብዙ ቁጥር}=1{{NUM_ITEMS_2} አቃፊ ከ{XXX_1} ወደ {XXX_2} ተወስዷል።}one{{NUM_ITEMS_2} አቃፊዎች ከ{XXX_3} ወደ {XXX_4} ተወስደዋል።}other{{NUM_ITEMS_2} አቃፊዎች ከ{XXX_3} ወደ {XXX_4} ተወስደዋል።}}"
   },
   "6043578784980337112": {
      "message": "$1​ ፋይሎች ወደ $2​ ተወስደዋል።"
   },
   "6062216008944363143": {
      "message": "{weekNumber,plural, =1{በወሩ መጀመሪያ {day} ላይ በየ{every} ወሩ ይደገማል}=2{በወሩ ሁለተኛ {day} ላይ በየ{every} ወሩ ይደገማል}=3{በወሩ ሶስተኛ {day} ላይ በየ{every} ወሩ ይደገማል}=4{በወሩ አራተኛ {day} ላይ በየ{every} ወሩ ይደገማል}one{በወሩ መጨረሻ {day} ላይ በየ{every} ወሩ ይደገማል}other{Rበወሩ መጨረሻ {day} ላይ በየ{every} ወሩ ይደገማል።}}"
   },
   "6069780031254134657": {
      "message": "እንደተከናወነ ምልክት አድርግበት"
   },
   "6087078248621415351": {
      "message": "$1​ ተቀይሯል"
   },
   "6100883940579706314": {
      "message": "የአገናኝ ቅድመ-እይታ"
   },
   "6105571474005679446": {
      "message": "በቅድመ-እይታው ላይ ችግር ነበር።"
   },
   "6113237889871930608": {
      "message": "ባዶ ማስታወሻ"
   },
   "6118623991445349480": {
      "message": "ገጽ $1​"
   },
   "6122643025527543706": {
      "message": "Ctrl"
   },
   "6127325177382263770": {
      "message": "ዩአርኤሎች"
   },
   "6128550071219729739": {
      "message": "ምስል ተሰርዟል"
   },
   "6131822680770571276": {
      "message": "PowerPoint"
   },
   "6140634664402328750": {
      "message": "የመተግበሪያዎች ዝርዝር"
   },
   "6149175749937815029": {
      "message": "ሁሉንም ንጥሎች ይመልከቱ"
   },
   "616807262818311711": {
      "message": "አይነት"
   },
   "6185886893933834031": {
      "message": "የተመረጡትን አስቀምጥ"
   },
   "6186753450686672643": {
      "message": "{every,plural, =1{በየቀኑ ይደግማል}one{በየ # ቀኖች ይደግማል}other{በየ # ቀኖች ይደግማል}}"
   },
   "6201176165479907499": {
      "message": "{count,plural, =1{ማስታወሻ ተሰክቷል}one{# ማስታወሻዎች ተሰክተዋል}other{# ማስታወሻዎች ተሰክተዋል}}"
   },
   "6203260615455347677": {
      "message": "Numbers"
   },
   "6209117354086898503": {
      "message": "ተመለስ"
   },
   "6211895332551673425": {
      "message": "ወደ $2​የእኔ Drive$1​ ታክለዋል"
   },
   "6212070333807533570": {
      "message": "ወደ $2​የእኔ Drive$1​ በማከል ላይ..."
   },
   "6223207695466118454": {
      "message": "YouTube"
   },
   "6224687211096863620": {
      "message": "ማንኛውም ሰው"
   },
   "6252259197986158120": {
      "message": "ትላንት"
   },
   "6263940822259442857": {
      "message": "አመልካች ሳጥኖችን ደብቅ"
   },
   "628140343505892786": {
      "message": "ቅንብሮች"
   },
   "6286379137937560558": {
      "message": "ጽሑፍ"
   },
   "6286806453721792102": {
      "message": "Drive ውስጥ ያደራጁ"
   },
   "6305748545202493254": {
      "message": "የዝርዝሮች ንጥል አሳይ/ደብቅ"
   },
   "6306268376900894985": {
      "message": "እስከ {endDate} ድረስ ይከሰታል"
   },
   "6324768448533022780": {
      "message": "$1​$2​"
   },
   "6336194821483049583": {
      "message": "ነባሪ ቤተኛ መተግበሪያ"
   },
   "6347484050944915390": {
      "message": "ጥያቄ ተልኳል። ሲፈቀድ ኢሜይል ይደርሰዎታል።"
   },
   "6352952829934775705": {
      "message": "ተጨማሪ"
   },
   "6366376928558090914": {
      "message": "ምግብ"
   },
   "6375244206466599493": {
      "message": "ዓመት"
   },
   "6375395544374251820": {
      "message": "ተጨማሪ ገጾችን መጫን ላይ አንድ ችግር ነበር። ዳግም በመሞከር ላይ..."
   },
   "6377664889539934": {
      "message": "በንክኪ ይሳሉ"
   },
   "6381941041429900831": {
      "message": "ተባባሪ አክል"
   },
   "6386587519843563719": {
      "message": "ሁለትዮሽ ፋይል"
   },
   "639451288140270562": {
      "message": "ወደ Google ሰነዶች ተቀድቷል"
   },
   "6394816510866826521": {
      "message": "የሙከራ ስሪት"
   },
   "6413404795391222793": {
      "message": "አዲስ ዝርዝር ይጻፉ"
   },
   "6416495701611778255": {
      "message": "የተጠቆሙ የሶስተኛ ወገን መተግበሪያዎች"
   },
   "6419411265907669340": {
      "message": "ዛሬ"
   },
   "6424277546995954045": {
      "message": "የቁልፍ ሰሌዳ መሻር በአሁኑ አሳሽ ላይ አይገኝም።\nይህን ባህሪ ለማንቃት ወደ Chrome፣ Firefox፣ IE/Edge ወይም Safari ይቀይሩ"
   },
   "6428000916830484004": {
      "message": "ቡናማ"
   },
   "6432019580434957057": {
      "message": "ኦዲዮ"
   },
   "6443615802319581315": {
      "message": "{NUM_ITEMS,plural, =1{ይህን ፋይል አሁን ካለባቸው አቃፊዎች ውስጥ ለመውሰድ ፍቃድ የለዎትም። በምትኩ ፋይሉን ወደ {START_SPAN_1}{NAME}{END_SPAN} ያክሉት።}one{እነዚህን ፋይሎች አሁን ካሉባቸው አቃፊዎች ውስጥ ለመውሰድ ፍቃድ የለዎትም። በምትኩ ፋይሎቹን ወደ {START_SPAN_2}{NAME}{END_SPAN} ያክሏቸው።}other{እነዚህን ፋይሎች አሁን ካሉባቸው አቃፊዎች ውስጥ ለመውሰድ ፍቃድ የለዎትም። በምትኩ ፋይሎቹን ወደ {START_SPAN_2}{NAME}{END_SPAN} ያክሏቸው።}}"
   },
   "6450508807204492448": {
      "message": "የ$1​ አዶ"
   },
   "6457802200418354862": {
      "message": "ተመልካቾች ማውረድ ይችላሉ"
   },
   "6459405233858728718": {
      "message": "Google ስላይዶች"
   },
   "6464761738227651511": {
      "message": "ከ$1​ ደቂቃ በፊት"
   },
   "6466736813846482957": {
      "message": "ቀዳሚ"
   },
   "6466858417983764649": {
      "message": "በማስታወሻዎች ላይ ለቦታዎች እና ለሰዓቶች አስታዋሾችን ያዘጋጁ፣ የድምጽ ማስታወሻዎችን ይውሰዱ፣ እና መስመር ላይ ወይም ከመስመር ውጪ ይስሩ።"
   },
   "6472238195689960152": {
      "message": "ነጭ"
   },
   "6473102097014191455": {
      "message": "የስዕል ማስታወሻ"
   },
   "6477306554098527424": {
      "message": "Google ረዳት"
   },
   "6480376252068839019": {
      "message": "የፍርግርግ አማራጮችን ክፈት"
   },
   "6496683100661104868": {
      "message": "$2​የክፍት ምንጭ ፈቃዶች$1​"
   },
   "6497197865876438261": {
      "message": "ሙዚቃ"
   },
   "6507257480072167483": {
      "message": "የመለያ ስም ወ $1​ ተለውጧል።"
   },
   "6510131849363684615": {
      "message": "ነገ"
   },
   "6513721414466645971": {
      "message": "ተወግዷል"
   },
   "6522917155620379865": {
      "message": "አውርድ"
   },
   "6524849072392100692": {
      "message": "Google Drive አቃፊ"
   },
   "653160061888539741": {
      "message": "የሂደት መቆጣጠሪያ"
   },
   "6571686604846453345": {
      "message": "ይህን ንጥል ወደ Drive ማከል ላይ አንድ ችግር ነበር።"
   },
   "6578339688410021742": {
      "message": "ሁሉም የ«$1​» አባላት ንጥሎችን መድረስ ይችላሉ።"
   },
   "6579707685908557993": {
      "message": "ምሽት"
   },
   "6582286158693833652": {
      "message": "ተጨማሪ ለመረዳት"
   },
   "6588176324871799870": {
      "message": "የGoogle መተግበሪያዎች ስክሪፕት"
   },
   "6618562607681757575": {
      "message": "ከማንኛውም አቃፊ አይውሰዱ፣ በቀላሉ ወደ $3​$2​$1​ ያክሉት"
   },
   "6622304228074863427": {
      "message": "መተግበሪያ"
   },
   "6627510416186113122": {
      "message": "ፈካ ያለ አረንጓዴያማ ሰማያዊ"
   },
   "6650600936729710500": {
      "message": "ምላሽች።"
   },
   "6664835828596108553": {
      "message": "አማራጭ"
   },
   "670419277288558500": {
      "message": "ቪድዮ/ኦዲዮ"
   },
   "6707173584987026005": {
      "message": "ዛሬ"
   },
   "6710728478489145370": {
      "message": "ዝጋ"
   },
   "6713235295664405475": {
      "message": "በ|ለ"
   },
   "6715985122107380503": {
      "message": "ቀረጻዎች"
   },
   "6726462693927865256": {
      "message": "ዝርዝሮች"
   },
   "6726879257388338969": {
      "message": "አትም"
   },
   "6732800471045353930": {
      "message": "ይህ ማስታወሻ ለሚፈቀደው ከፍተኛ የሰዎች ብዛት ተጋርቷል።"
   },
   "673551770550324419": {
      "message": "በስፋት ልክ መጥን"
   },
   "6747379635033535953": {
      "message": "አዲስ ንጥሎችን ወደ ታች ያክሉ"
   },
   "6747528043814108113": {
      "message": "ወደ $1​ ተቀይሯል"
   },
   "6749829802551750923": {
      "message": "ላይ"
   },
   "6750600017746655174": {
      "message": "አማራጭ"
   },
   "6750827506231593056": {
      "message": "መለያዎችን ይቀይሩ"
   },
   "6761622351199419182": {
      "message": "ማስታወሻ በማህደር ውስጥ አለ"
   },
   "6773222938695237983": {
      "message": "{NUM_ITEMS,plural, =0{ስራ ላይ ያልዋለ}=1{ይህ ንጥል ይጋራ?}one{እነዚህ ንጥሎች ይጋሩ?}other{እነዚህ ንጥሎች ይጋሩ?}}"
   },
   "6778577079172085976": {
      "message": "ተሰክተዋል"
   },
   "678660085936036852": {
      "message": "ምስሎችን በመስራት ላይ..."
   },
   "6787580031482277539": {
      "message": "በጭራሽ"
   },
   "6797862596948579998": {
      "message": "የChrome መተግበሪያ"
   },
   "6798055902819777633": {
      "message": "በንክኪ ያንፏቅቁ"
   },
   "6801348618370627980": {
      "message": "ስያሜ $1​ ተፈጥሯል።"
   },
   "6815042072535422726": {
      "message": "ኦዲዮ ተሰርዟል"
   },
   "681598652078493281": {
      "message": "ተጨማሪ ይወቁ"
   },
   "6822520214440117457": {
      "message": "ስራ"
   },
   "6823109315717909214": {
      "message": "ይሞክሩት"
   },
   "6831650827360444197": {
      "message": "ማስታወሻ አልተጋራም።"
   },
   "6833062695195555756": {
      "message": "የመደምሰሻ መሣሪያ አማራጮች ምናሌን ይክፈቱ"
   },
   "6833760103261954639": {
      "message": "ይህን ገጽ መጫን ላይ አንድ ችግር ነበር። ዳግም በመሞከር ላይ..."
   },
   "6861978427131390279": {
      "message": "ግብረመልስ ላክ"
   },
   "687402923448150707": {
      "message": "ምልክት አልተደረገበትም"
   },
   "689017442055275529": {
      "message": "የ$1​ የቤተሰብ ቡድን"
   },
   "6891563484025164308": {
      "message": "ቀዳሚ"
   },
   "6898823203505321799": {
      "message": "ዝርዝሮች"
   },
   "6904351530369058983": {
      "message": "ባለቤት"
   },
   "691041991673354191": {
      "message": "እራሴን አስወግድ"
   },
   "6918505531548047245": {
      "message": "የማድመቂያ መሣሪያ"
   },
   "6921237745237410511": {
      "message": "አስተያየት ያክሉ"
   },
   "6922953828399110511": {
      "message": "መመልከቻውን ዝጋ"
   },
   "693770783324368110": {
      "message": "ማስታወሻዎች ተነቅለው እና ተጥለዋል"
   },
   "695253297035211081": {
      "message": "መጣያውን አጽዳ"
   },
   "6980199665979997122": {
      "message": "ወደነበረበት መልስ"
   },
   "6982682101118067511": {
      "message": "በማደራጀት ላይ…"
   },
   "701276785305022936": {
      "message": "የተበላሸ ሰነድ። እባክዎ ፋይሉ በቅርብ ጊዜው ቅርጸት ውስጥ መሆኑን ያረጋግጡ።"
   },
   "7017485862232001373": {
      "message": "«$1​» ወደ $2​ ታክሏል።"
   },
   "7019002927048576918": {
      "message": "$1​ የፍለጋ ማጣሪያዎች"
   },
   "7030308038380934896": {
      "message": "ወደ Google ሰነዶች መቅዳት አልተሳካም"
   },
   "7050021021988648361": {
      "message": "ዩአርኤል ቅዳ"
   },
   "7050898523853841537": {
      "message": "የተደጋጋሚነት አማራጮች"
   },
   "7054631817922169541": {
      "message": "Google Keep ያልተቀመጡ ለውጦች አሉት። ገጹን መልቀቅ እና ለውጦችዎን ማስወገድ ይፈልጋሉ?"
   },
   "705714112650622350": {
      "message": "ንጥሉን ወደ Google Drive ማከል ላይ አንድ ችግር ነበር።"
   },
   "7059437903473652416": {
      "message": "የYouTube ቪድዮ $1​ን አጫውት"
   },
   "7065454163742312322": {
      "message": "ተጨማሪ ቀለማት"
   },
   "7066744251212631722": {
      "message": "ሎሚ ቀለም"
   },
   "7084324152376766809": {
      "message": "ከ$1​ ቀኖች በፊት"
   },
   "7084991134824194740": {
      "message": "አስታውሰኝ"
   },
   "7086801490719148597": {
      "message": "ይህን አትምረጥ"
   },
   "7094548885298700726": {
      "message": "ደማቅ ቡናማ"
   },
   "7120211249329066227": {
      "message": "ረዳት አለዎት!"
   },
   "7121259585839664942": {
      "message": "ይቅር"
   },
   "7126326627883991568": {
      "message": "የአሁኑን ስዕል ሰርዝ"
   },
   "7126535013613878060": {
      "message": "አስፈላጊ ማስታወሻዎችዎን አናት ላይ ይሰኩ።"
   },
   "7135182401951359795": {
      "message": "ባለቤትነት ወደ እርስዎ ይተላለፋል።"
   },
   "7141983486405549971": {
      "message": "አስገባ"
   },
   "7145753028985071097": {
      "message": "ማስታወሻን ዳግም በመደርደር ላይ"
   },
   "7146242673022399081": {
      "message": "ጽሁፍ"
   },
   "7148992630785407972": {
      "message": "ይህ ፋይል በይለፍ ቃል የተጠበቀ ነውና ቅድሚያ መታየት አይችልም።"
   },
   "7153847618034547771": {
      "message": "አንቃ"
   },
   "7161134329606048317": {
      "message": "ዝጋ"
   },
   "7161718175684624843": {
      "message": "መለያ አስወግድ"
   },
   "7164532930742017984": {
      "message": "አገናኙ ላለው ማንኛውም ሰው"
   },
   "7166989725427500881": {
      "message": "የተጣለ ማስታወሻን ምረጥ"
   },
   "7174189954350964804": {
      "message": "እንደገና ይሞክሩ"
   },
   "7174908348310449675": {
      "message": "የአስታዋሽ ነባሪዎችዎን ያብጁ"
   },
   "7181961085183734135": {
      "message": "ማተም ለዚህ ፋይል ተሰናክሏል"
   },
   "7201188472754345797": {
      "message": "{NUM_ITEMS,plural, =0{ጥቅም ላይ ያልዋለ ብዙ ቁጥር}=1{ሰዎች ከ«{DESTINATION_DOMAIN}» ውጪ ከሆኑ የዚህን ፋይል መዳረሻ ያጣሉ።}one{ሰዎች ከ«{DESTINATION_DOMAIN}» ውጪ ከሆኑ የእነዚህን ፋይሎች መዳረሻ ያጣሉ።}other{ሰዎች ከ«{DESTINATION_DOMAIN}» ውጪ ከሆኑ የእነዚህን ፋይሎች መዳረሻ ያጣሉ።}}"
   },
   "7218693060378095915": {
      "message": "አዲስ"
   },
   "722264179594523168": {
      "message": "ይቅር"
   },
   "7225445911355686176": {
      "message": "በማህደር የተቀመጠ ማስታወሻን ምረጥ"
   },
   "722702934847795304": {
      "message": "ፕሮጀክት"
   },
   "7231231875581131930": {
      "message": "{NUM_ITEMS,plural, =0{ስራ ላይ ያልዋለ}=1{ይህ ንጥል ተመልሶ ወደ «{TEAM_DRIVE_NAME}» ሊወሰድ አይችልም፣ ስለዚህ ይህን እርምጃ መቀልበስ አይችሉም።}one{ቢያንስ አንድ ንጥል ተመልሶ ወደ «{TEAM_DRIVE_NAME}» ሊወሰድ አይችልም፣ ስለዚህ ይህን እርምጃ መቀልበስ አይችሉም።}other{ቢያንስ አንድ ንጥል ተመልሶ ወደ «{TEAM_DRIVE_NAME}» ሊወሰድ አይችልም፣ ስለዚህ ይህን እርምጃ መቀልበስ አይችሉም።}}"
   },
   "723223692006219983": {
      "message": "ነጥብ"
   },
   "7247530225058410142": {
      "message": "$2​ $1​"
   },
   "7247965266239591227": {
      "message": "ከ«$1​» በማውጣት ላይ ችግር ነበር።"
   },
   "7251490702980298031": {
      "message": "የማድመቂያ መሣሪያ ቀለም እና መጠን መራጭን ይክፈቱ"
   },
   "7265183966796883739": {
      "message": "መፍትሔ የተገኘላቸውን አስተያየቶች ደብቅ"
   },
   "7278398674737413598": {
      "message": "ሰነዱን መቀየር አልተቻለም።"
   },
   "7278859550373246865": {
      "message": "{count,plural, =1{ማስታወሻ በማህደር ተቀምጧል}one{# ማስታወሻዎች በማህደር ተቀምጠዋል}other{# ማስታወሻዎች በማህደር ተቀምጠዋል}}"
   },
   "7290932540630116546": {
      "message": "አስታዋሽ ተዘጋጅቷል። $1​"
   },
   "7295254213841803546": {
      "message": "ለውጦች ይወገዱ?  የእርስዎ ለውጦች አይቀመጡም።"
   },
   "7299749713933143099": {
      "message": "ወይን ጠጅ"
   },
   "7304355547638486270": {
      "message": "ኦዲዮውን አውርድ ($1​)"
   },
   "7306962184871750459": {
      "message": "ባለቤትነት በ$3​ ውስጥ ከ«$4​» በ$1​ ውስጥ ወደ «$2​» ይተላለፋል።"
   },
   "7337660181466605745": {
      "message": "«$1​»ን Drive ላይ ማዘመን አልተሳካም።"
   },
   "7342923890755029722": {
      "message": "ዝጋ"
   },
   "7344507440412470266": {
      "message": "ምርጫ ተዘርግቷል።"
   },
   "734478884582426793": {
      "message": "የተሰበሰበ ማህደር"
   },
   "7353547650196788656": {
      "message": "ቀይ"
   },
   "7364571366369083618": {
      "message": "ቪድዮ"
   },
   "7376703418960184879": {
      "message": "ቅዳ"
   },
   "7377239345926788722": {
      "message": "እርምጃዎች"
   },
   "7382688299146249119": {
      "message": "ንጥልን አውርድ"
   },
   "7388342865555961406": {
      "message": "በ$1​ ቀን ውስጥ"
   },
   "7393771571081973549": {
      "message": "C"
   },
   "7420117636241237177": {
      "message": "ከ$1​ የመጡ መልዕክቶች ወደ የእርስዎ ደብዳቤ መለያ «አስመጣ፦ $2​» መለያ ስር እንዲወጡ ተደርገዋል።"
   },
   "7426603384368095928": {
      "message": "እባክዎ እንደገና ለመግባት እና መስራት ለመቀጠል ገጹን እንደገና ይጫኑ።"
   },
   "7427333772418801813": {
      "message": "+ $1​ ተጨማሪ አዝራር ተዘርግቷል"
   },
   "7429084719905985261": {
      "message": "Objective C"
   },
   "7432956605646331928": {
      "message": "SQL"
   },
   "7440735091552109962": {
      "message": "$2​ (አርትዖት የተደረገው $1​ ላይ)"
   },
   "7441891675459021164": {
      "message": "Drive ላይ በማስቀመጥ ላይ"
   },
   "744753705925710199": {
      "message": "ይቅርታ፣ ይህን መተግበሪያ ለመክፈት ለሞከሯቸው ፋይሎች ሁሉ ልንፈቅድ አልቻልንም። እባክዎ እንደገና ይሞክሩ።"
   },
   "7452116603589558390": {
      "message": "የተሰካ ማስታወሻን አትምረጥ"
   },
   "7453297286571818554": {
      "message": "ወደ Google ሰነዶች ቅዳ"
   },
   "7453307802804717178": {
      "message": "ፈካ ያለ ሰማያዊ"
   },
   "7458942806393710991": {
      "message": "በማህደር የተቀመጠ ማስታወሻን አትምረጥ"
   },
   "7464780237502381438": {
      "message": "ተጨማሪ መተግበሪያዎችን አገናኝ"
   },
   "7468842863971844562": {
      "message": "አዲስ ዝርዝር"
   },
   "7469895656894091562": {
      "message": "ይህ ኢሜይል ልክ ያልሆነ ነው"
   },
   "7482924911694634213": {
      "message": "{weekNumber,plural, =1{በወሩ መጀመሪያ {day} ላይ በየወሩ ይደገማል}=2{በወሩ ሁለተኛ {day} ላይ በየወሩ ይደገማል}=3{በወሩ ሶስተኛ {day} ላይ በየወሩ ይደገማል}=4{በወሩ አራተኛ {day} ላይ በየወሩ ይደገማል}one{በወሩ መጨረሻ {day} ላይ በየወሩ ይደገማል}other{በወሩ መጨረሻ {day} ላይ በየወሩ ይደገማል}}"
   },
   "7483088916037874359": {
      "message": "ፋይሉ በጣም ትልቅ ነው። "
   },
   "7488945223835574498": {
      "message": "Postscript"
   },
   "7503234138288940590": {
      "message": "ይፈልጉ"
   },
   "7507827375601925075": {
      "message": "ማስታወሻን ወደ ቀጣዩ/ቀዳሚው ቦታ ይወስዳል"
   },
   "7516769578943800930": {
      "message": "ምልክት ተደርጎበታል"
   },
   "7528204871156404767": {
      "message": "Safari"
   },
   "7529683448345488779": {
      "message": "የገባው የይለፍ ቃል የተሳሳተ ነው፤ እባክዎ የተለየ የይለፍ ቃል ያስገቡ።"
   },
   "7530677128711603655": {
      "message": "የ«$1​» ፍለጋ ውጤቶች"
   },
   "754367112212424716": {
      "message": "ዛሬ በኋላ ላይ"
   },
   "7564771400033548584": {
      "message": "{selectedCount,plural, =1{# ተመርጧል}one{# ተመርጠዋል}other{# ተመርጠዋል}}"
   },
   "7565383798249439151": {
      "message": "በ$1​ ቀኖች ውስጥ"
   },
   "7579280421767578228": {
      "message": "ለሆነ ቀን አስታዋሽ"
   },
   "7586291841734385643": {
      "message": "ለይተህ አውጣ"
   },
   "7587936635257676112": {
      "message": "$1​ ታክለዋል"
   },
   "7598582624136632660": {
      "message": "የፍለጋ አሞሌውን ይክፈቱ / ቀጣዩን አግኝ"
   },
   "7598850438299201663": {
      "message": "«$1​»ን በመክፈት ላይ..."
   },
   "7599358608613738069": {
      "message": "ሰርዝ"
   },
   "7604275940271852148": {
      "message": "ወደ የእርስዎ መልዕክት መለያ ያውጡ"
   },
   "7604400308311739073": {
      "message": "ሰካ"
   },
   "7610628906656867728": {
      "message": "ማህደር"
   },
   "7610654194202731772": {
      "message": "ሰርዝ"
   },
   "7624042048123264803": {
      "message": "ማስታወሻን ክፈት"
   },
   "7629685876277801112": {
      "message": "ይህን የካርታዎች ፋይል ማሳየት ላይ አንድ ችግር ነበር።"
   },
   "7630723924002267143": {
      "message": "የቁልፍ ሰሌዳ አቋራጮች ነቅተዋል።"
   },
   "7631302417932873160": {
      "message": "ፋይሉ ቫይረሶች ካሉበት መቃኘት አይቻልም"
   },
   "7648759818896108920": {
      "message": "+$1​"
   },
   "7649506133540465463": {
      "message": "እርምጃ ሊቀለበስ አልቻለም።"
   },
   "7653702763016575386": {
      "message": "ሰማያዊ"
   },
   "7656983816661099886": {
      "message": "ነገሮች"
   },
   "7659047104232758352": {
      "message": "ያ|ይሄ"
   },
   "7669677145513127809": {
      "message": "በቡድን Drives መካከል ይወሰዱ?"
   },
   "7669846901402551021": {
      "message": "ዛሬ"
   },
   "7690349821507417537": {
      "message": "የዝርዝር ንጥል ተወግዷል፣ $1​"
   },
   "7690355160889785521": {
      "message": "አረንጓዴ"
   },
   "7691521283331762131": {
      "message": "በማህደር የተቀመጡ ማስታወሻዎች እዚህ ይመጣሉ"
   },
   "7709557808259730054": {
      "message": "ማጽደቆች"
   },
   "7709889936233398701": {
      "message": "አስወግድ"
   },
   "7715735412192018288": {
      "message": "እገዛ"
   },
   "7715892737835649602": {
      "message": "እንዲሁም «#»ን በመተየብ መለያዎችን ማከል ይችላሉ።"
   },
   "772000107335590599": {
      "message": "በ$1​ ደቂቃዎች ውስጥ"
   },
   "7724602581120994002": {
      "message": "ብርቱካናማ"
   },
   "7728066040934031356": {
      "message": "ሐምራዊ"
   },
   "7734578122414851725": {
      "message": "PHP"
   },
   "7735981667219692675": {
      "message": "{resultCount,plural, =1{# የፍለጋ ውጤት}one{# የፍለጋ ውጤቶች}other{# የፍለጋ ውጤቶች}}"
   },
   "774390292128857049": {
      "message": "ፈልግ"
   },
   "7751981235297474273": {
      "message": "ቀልብስ"
   },
   "7754093419850121316": {
      "message": "⌘"
   },
   "7757440777278143092": {
      "message": "ጠቆር ያለ ግራጫ"
   },
   "7772544658778579390": {
      "message": "በሰነድ ውስጥ ያግኙ"
   },
   "777546328624962090": {
      "message": "ይህን ፋይል መስቀል አይቻልም። እኛ መጠናቸው $2​ሜባ እና $3​ ሜጋፒክስሎች በታች የሆኑ $1​ ፋይሎችን እንቀበላለን።"
   },
   "778181404304502404": {
      "message": "ንጥልን አሳንሷል።"
   },
   "7791050524692390574": {
      "message": "ቀለማት"
   },
   "7800318069267901681": {
      "message": "የተቀየረበት ቀን"
   },
   "7814778057875152792": {
      "message": "ዓባሪውን በGoogle Drive ውስጥ ወዳለው የተመረጠ አቃፊ መውሰድ ላይ አንድ ችግር ነበር።"
   },
   "7821512290975371360": {
      "message": "ሞቅ ያለ ሮዝ"
   },
   "7828886646639771557": {
      "message": "ማስታወሻ ይያዙ…"
   },
   "7830513726270865588": {
      "message": "ቀን መቁጠሪያ"
   },
   "7842164552344536314": {
      "message": "በማደራጀት ላይ..."
   },
   "7844842290699524598": {
      "message": "የመለያ ስም ገደብ ላይ ተደርሷል። አዲስ ለማከል ከዚህ ቀደም ያለን የመለያ ስም ይሰርዙ።"
   },
   "7845751753397906805": {
      "message": "የሚጋጩ አርትዕ የተደረጉ ተገኝተዋል"
   },
   "785840448809859989": {
      "message": "የሰዓት አማራጮች"
   },
   "7865240075542402013": {
      "message": "ኮከብ አክል"
   },
   "7868324478160174739": {
      "message": "ሰማያዊ"
   },
   "7873060817438017568": {
      "message": "$2​ · $1​"
   },
   "7873698934773957560": {
      "message": "ምንም"
   },
   "787773550893657271": {
      "message": "ቀዳሚ ስዕል ተከፍቷል"
   },
   "7888520165977111723": {
      "message": "ወደ የቡድን Drive ይወሰድ?"
   },
   "7895643887742936844": {
      "message": "ሰሚኮሎን"
   },
   "7906726367011430855": {
      "message": "አገናኝ"
   },
   "7910887984113996757": {
      "message": "ማጋራትን ያብሩ"
   },
   "7922692430438844436": {
      "message": "አውጣ"
   },
   "792315196550007047": {
      "message": "ምንም የሚዛመዱ ውጤቶች የሉም።"
   },
   "7943657844420237650": {
      "message": "OpenOffice Impress"
   },
   "7946114032014914338": {
      "message": "{repeatSentence}። {endSentence}"
   },
   "7947001788143789176": {
      "message": "በመጫን ላይ…"
   },
   "7959130747647079558": {
      "message": "{selectedCount,plural, =1{ማስተወሻ ተመርጧል}one{# ማስታወሻዎች ተመርጠዋል}other{# ማስታወሻዎች ተመርጠዋል}}"
   },
   "7976461426527138085": {
      "message": "ዝርዝሮች"
   },
   "7988058806865329896": {
      "message": "ቀን እና ሰዓት ይምረጡ"
   },
   "7991475666499751798": {
      "message": "አስታዋሹ እንደተከናወነ ምልክት ያድርጉ"
   },
   "7996360883730444101": {
      "message": "ይቅርታ፣ ይህንን ፋይል በመክፈት ላይ አንድ ስህተት ተከስቷል። እባክዎ እንደገና ይሞክሩ።"
   },
   "7998118521140187915": {
      "message": "መፍትሔ የተገኘላቸው አስተያየቶች ተደብቀዋል"
   },
   "8003252582874834655": {
      "message": "ንጥሎችን ወደ የቡድን Drive መውሰድ መዳረሻን እና ባለቤትነትን ይቀይራል።"
   },
   "8010075936095394680": {
      "message": "የፋይል ስሪቱ በጣም የቆየ ነው። እባክዎ ፋይሉ በቅርብ ጊዜው ቅርጸት ውስጥ መሆኑን ያረጋግጡ። "
   },
   "8011497727123874703": {
      "message": "የ$1​ አቃፊ አዝራር"
   },
   "8013687642711017862": {
      "message": "{NUM_ITEMS_1,plural, =0{ጥቅም ላይ ያልዋለ ብዙ ቁጥር}=1{አንድ ንጥል ከተጋሩ አቃፊዎች እያስወጡ ነው፣ ይህም በመሆኑ ሰዎች መዳረሻ ያጣሉ።}one{{NUM_ITEMS_2} ንጥሎችን ከተጋሩ አቃፊዎች እያስወጡ ነው፣ ይህም በመሆኑ ሰዎች መዳረሻ ያጣሉ።}other{{NUM_ITEMS_2} ንጥሎችን ከተጋሩ አቃፊዎች እያስወጡ ነው፣ ይህም በመሆኑ ሰዎች መዳረሻ ያጣሉ።}}"
   },
   "8019402848412685977": {
      "message": "የ«$2​» ስም ወደ «$1​» ተቀይሯል።"
   },
   "802668096552856965": {
      "message": "{checkedItemCount,plural, =1{# የተጠናቀቀ ንጥል}one{# የተጠናቀቁ ንጥሎች}other{# የተጠናቀቁ ንጥሎች}}"
   },
   "8043514121228710092": {
      "message": "ምስል ያክሉ"
   },
   "8044700199531805239": {
      "message": "$3​$1​$2​ ተገናኝቷል።"
   },
   "8046884224424523922": {
      "message": "{NUM_ITEMS_1,plural, =0{ጥቅም ላይ ያልዋለ ብዙ ቁጥር}=1{{NUM_ITEMS_2} ፋይል ከ{XXX_1} ወደ {XXX_2} ተወስዷል።}one{{NUM_ITEMS_2} ፋይሎች ከ{XXX_3} ወደ {XXX_4} ተወስደዋል።}other{{NUM_ITEMS_2} ፋይሎች ከ{XXX_3} ወደ {XXX_4} ተወስደዋል።}}"
   },
   "8063817953234049242": {
      "message": "የመምረጫ መሣሪያ"
   },
   "8066398070826666542": {
      "message": "{count,plural, =1{+ # የተጠናቀቀ ንጥል}one{+ # የተጠናቀቁ ንጥሎች}other{+ # የተጠናቀቁ ንጥሎች}}"
   },
   "8069384932934428393": {
      "message": "በ$1​ ደቂቃ ውስጥ"
   },
   "807840433749698811": {
      "message": "ሳያን"
   },
   "8080583426915938264": {
      "message": "በእርስዎ ኮምፒውተር ላይ ያሉ መተግበሪያዎች"
   },
   "8085493757603803516": {
      "message": "ምርጫ አርትዕ"
   },
   "8090743714060857028": {
      "message": "ተመልካቾች ማውረድ አይችሉም"
   },
   "8095838445486198080": {
      "message": "{FILE_SIZE,plural, =0{0 ባይት}=1{1 ባይት}one{# ባይት}other{# ባይት}}"
   },
   "8111632928339277375": {
      "message": "{NUM_FOLDERS,plural, =1{ከአንድ አቃፊ አንቀሳቅስ}=2{ከሁለቱም አቃፊዎች አንቀሳቅስ}one{ከሁሉም # አቃፊዎች አንቀሳቅስ}other{ከሁሉም # አቃፊዎች አንቀሳቅስ}}"
   },
   "8125425371755035523": {
      "message": "ቀልብስ"
   },
   "8133866583554546341": {
      "message": "$1​፣ $2​"
   },
   "8135145577663029437": {
      "message": "ሁለቱንም አስቀምጥ"
   },
   "8139785559888164453": {
      "message": "የበለጠ ለመረዳት"
   },
   "8144512434938656483": {
      "message": "ወይም"
   },
   "8146560259680897627": {
      "message": "ተወው"
   },
   "8149439558305434788": {
      "message": "$1​፣ $2​"
   },
   "8159493406018222636": {
      "message": "ግብረመልስ ይላኩ"
   },
   "8163781449224244510": {
      "message": "ምርጫ ተሰብስቧል።"
   },
   "8174654098152723289": {
      "message": "ማብራሪያ ያርትዑ"
   },
   "818217888086545352": {
      "message": "ቢጫ"
   },
   "8189126656205301402": {
      "message": "ወደ Google ሰነዶች ቅዳ"
   },
   "8194941811853358224": {
      "message": "ኮከብ ከ«$1​» ማስወገድ ማስወገድ ላይ አንድ ችግር ነበር።"
   },
   "821942580510564685": {
      "message": "ይህን ሰነድ ለማየት እባክዎ የይለፍ ቃሉን ያስገቡ።"
   },
   "8223878224920694193": {
      "message": "በየ"
   },
   "8224193807932432983": {
      "message": "እርምጃዎች"
   },
   "8225614702924834215": {
      "message": "ተጨማሪ አማራጮች"
   },
   "8231449936104909428": {
      "message": "«$1​»ን በDrive ውስጥ ወደተመረጠው አቃፊ መውሰድ ላይ አንድ ችግር ነበር።"
   },
   "8233945959714786736": {
      "message": "ቀዳሚ"
   },
   "8242655297101700529": {
      "message": "የእኔ Drive"
   },
   "826433162451399549": {
      "message": "ነገ"
   },
   "8273434617910595878": {
      "message": "ታች"
   },
   "8281141013543828574": {
      "message": "ጥሬ ምስል"
   },
   "8292708563843446267": {
      "message": "ንጥሎች በ«$1​» ባለቤትነት የሚያዙ ይሆናሉ።"
   },
   "8304474373444239435": {
      "message": "የ$1​ ምላሽ።"
   },
   "8305505634689906340": {
      "message": "በ«$1​» ውስጥ ይፈልጉ"
   },
   "8322416564157128458": {
      "message": "ማጋራት"
   },
   "8332720954679654953": {
      "message": "የመተግበሪያ ውርዶች"
   },
   "8337582740675387693": {
      "message": "ጃቫ"
   },
   "8342620486324515462": {
      "message": "አሰናብት"
   },
   "837692854094319105": {
      "message": "የሚከተሉት ተጠቃሚዎች አስተዳዳሪ ከጎራቸው ውጭ ማጋራትን ስላሰናከሉ ለእነሱ ማጋራት አይቻልም።"
   },
   "8379952094517631162": {
      "message": "አይ"
   },
   "8409190394690387796": {
      "message": "አስተያየት ያክሉ"
   },
   "8412098268689886334": {
      "message": "አዋህድ"
   },
   "8412733496413412439": {
      "message": "ከመስመር ውጭ"
   },
   "84334343973701810": {
      "message": "መነሻ"
   },
   "8452647597930138120": {
      "message": "አስተያየት የሚሰጡበትን ሕዋስ ያድምቁ"
   },
   "8453627484113670693": {
      "message": "ፈካ ያለ ብርትኳናማ"
   },
   "8467894483369467251": {
      "message": "ፍላሽ"
   },
   "8471029293590878384": {
      "message": "ለአፍታ አቁም"
   },
   "8493378997610580289": {
      "message": "ተጨማሪ አቋራጮች"
   },
   "8505989225387082493": {
      "message": "መሰየሚያ ያክሉ"
   },
   "8509270263487836281": {
      "message": "በመለያ ይግቡ"
   },
   "8517148045938431718": {
      "message": "ስህተቶችን አርም"
   },
   "8535303351837089357": {
      "message": "እንዲሁም ለውጦችን በ{modifierKey}+Z እና {modifierKey}+Y መቀልበስ እና መድገም ይችላሉ።"
   },
   "8562196940800756925": {
      "message": "ምልክት ማድረጊያ መሣሪያ"
   },
   "8589423377647285975": {
      "message": "የ$1​ $2​ ዝርዝር ንጥል $3​።"
   },
   "8591848339430983053": {
      "message": "ማስታወሻዎች"
   },
   "8595175575778060149": {
      "message": "ተጨማሪ"
   },
   "8596279649507974639": {
      "message": "ወደዚህ አንቀሳቅስ"
   },
   "8602525917014156029": {
      "message": "ቦታዎች"
   },
   "8616342546716995946": {
      "message": "ገባኝ"
   },
   "8621067185485606452": {
      "message": "ECMAScript"
   },
   "8621178077822096827": {
      "message": "የዝርዝር ንጥል ገብቷል፣ $1​"
   },
   "8626694988569301667": {
      "message": "ስዕል አይገኝም"
   },
   "8637215430007224613": {
      "message": "ቀጣይ ስዕል ተከፍቷል"
   },
   "8646821180780920830": {
      "message": "መለያዎች"
   },
   "8652657235429996594": {
      "message": "በቅርቡ"
   },
   "8660016472468563221": {
      "message": "ኮሎን"
   },
   "8663507590720636709": {
      "message": "$1​ +$2​ ተጨማሪ"
   },
   "8663993454460982287": {
      "message": "አመልካች ሳጥን ተደብቋል"
   },
   "8674222789100049233": {
      "message": "ዝጋ"
   },
   "86815590954366945": {
      "message": "በማህደር የተቀመጠ የይዘት ዝርዝር"
   },
   "8708723278154759600": {
      "message": "ማስታወሻዎች በማህደር ተቀምጠዋል"
   },
   "8726038895018570620": {
      "message": "ወደ አገናኝ ይሂዱ"
   },
   "8734569874711220205": {
      "message": "የአሰሳ ምናሌ"
   },
   "8738345098829705526": {
      "message": "መጠን 12"
   },
   "8742388056829916665": {
      "message": "የበለጸጉ የአገናኝ ቅድመ-እይታዎችን አሳይ"
   },
   "8773943264600860531": {
      "message": "Internet Explorer"
   },
   "8775097441636640256": {
      "message": "$2​-$1​"
   },
   "8781837301864053001": {
      "message": "የበለጸገ ጽሑፍ"
   },
   "8786673003584562680": {
      "message": "ገጽ ወደ ላይ"
   },
   "8792038552136453044": {
      "message": "ውይ! የሆነ ችግር ተፈጥሯል"
   },
   "8793166064242077041": {
      "message": "ይህን ምስል ማሳየት ላይ አንድ ችግር ነበር።"
   },
   "8822326207328431952": {
      "message": "የምስል ሰቀላዎቹ አይገኙም"
   },
   "8825353897919495748": {
      "message": "{NUM_ITEMS,plural, =0{ጥቅም ላይ ያልዋለ ብዙ ቁጥር}=1{እርግጠኛ ነዎት ይህን ፋይል መውሰድ ይፈልጋሉ?}one{እርግጠኛ ነዎት እነዚህን ፋይሎች መውሰድ ይፈልጋሉ?}other{እርግጠኛ ነዎት እነዚህን ፋይሎች መውሰድ ይፈልጋሉ?}}"
   },
   "8845176264121061589": {
      "message": "ሁሉንም ንጥሎች የመመረጣቸውን ምልክት ያጥፉ"
   },
   "8851252390780816895": {
      "message": "የደንበኛ ምዝግብ ማስታወሻ"
   },
   "8852550049823214385": {
      "message": "ከዚያ"
   },
   "8860658114732392347": {
      "message": "አስታዋሽ ሰርዝ"
   },
   "8867634760949689122": {
      "message": "ፋይሉ ሊለወጥ አልቻለም፦ ልወጣ ለጊዜው ተቋርጧል። እባክዎ ቆይተው እንደገና ይሞክሩ።"
   },
   "8868758864963683383": {
      "message": "ማስታወሻን አትምረጥ"
   },
   "8869202143464930500": {
      "message": "ባለቤትነት ወደ $1​ ይተላለፍ?"
   },
   "887001400549949730": {
      "message": "በአዲስ መስኮት ውስጥ ክፈት"
   },
   "888015650266122140": {
      "message": "ክስተቶች"
   },
   "8889019648958415451": {
      "message": "ያልታወቀ ፋይል"
   },
   "8917554093651202032": {
      "message": "$1​ን አጫውት"
   },
   "8919660666733306860": {
      "message": "Image"
   },
   "8923591894816841670": {
      "message": "ምርጫ ወደ ታች ተወስዷል።"
   },
   "8925842014466254066": {
      "message": "ወደ Google ሰነዶች በመቅዳት ላይ"
   },
   "8930959387403789939": {
      "message": "አስታዋሽ"
   },
   "8931267220766224111": {
      "message": "የGoogle Keep አስታዋሾችን ያብሩ? የአሳሽ ማሳወቂያዎችን መፍቀድ ሊኖርብዎ ይችላል።"
   },
   "8938626240031421092": {
      "message": "የአመልካች ሳጥኖችን ይቀያይሩ"
   },
   "8943760679396635042": {
      "message": "$1​ን በማሳየት ላይ።"
   },
   "8953555255469284376": {
      "message": "ምስሎችን እዚህ ይጣሉ"
   },
   "8962132866274125834": {
      "message": "ድገም"
   },
   "896590342186332268": {
      "message": "መጠን 16"
   },
   "8975305711699693093": {
      "message": "የአስተያየቶች አምድን ደብቅ"
   },
   "8978442832029227748": {
      "message": "Google Jamboard"
   },
   "8979104019474011578": {
      "message": "{every,plural, =1{በየሳምንቱ ይደግማል}one{በየ # ሳምንቶች ይደግማል}other{በየ # ሳምንቶች ይደግማል}}"
   },
   "8979615310931291676": {
      "message": "አርትዕ የተደረገው $1​"
   },
   "8988925599985431446": {
      "message": "ንቀል"
   },
   "900086393693234779": {
      "message": "ቤት"
   },
   "9003585743562048321": {
      "message": "በአውታረ መረብ ስህተት ምክንያት አስተያየቶችን ማሳመር አልተሳካም።"
   },
   "9012753183662045049": {
      "message": "ያጠረ የመሰየሚያ ስም ያስገቡ"
   },
   "9021945828354340363": {
      "message": "{count,plural, =1{ይህ ማስታወሻ ከአሁን በኋላ ከእርስዎ ጋር አይጋራም።}one{እነዚህ ማስታወሻዎች ከአሁን በኋላ ከእርስዎ ጋር አይጋሩም።}other{እነዚህ ማስታወሻዎች ከአሁን በኋላ ከእርስዎ ጋር አይጋሩም።}}"
   },
   "9024023699330078373": {
      "message": "ይህን ንጥል መክፈት ወደ የእርስዎ Drive ያክለዋል"
   },
   "9058308423774656474": {
      "message": "Hangul Word Processor"
   },
   "9063863448028905602": {
      "message": "ከውጤቶች አስወግድ"
   },
   "9072994494820207560": {
      "message": "ምልክት የተደረገበት ንጥል"
   },
   "9083935734710258396": {
      "message": "ከልክል"
   },
   "9094248058931620597": {
      "message": "የዝርዝሮች ፓነል ተሰብስቧል።"
   },
   "911586799466052745": {
      "message": "OpenOffice Draw"
   },
   "911698676339750373": {
      "message": "የቤተሰብ ቡድን"
   },
   "9121915169985572840": {
      "message": "ቀለም ለውጥ"
   },
   "9124422680181020503": {
      "message": "ስዕል ተሰርዟል"
   },
   "9131268871618792263": {
      "message": "{NUM_ITEMS,plural, =0{ጥቅም ላይ ያልዋለ ብዙ ቁጥር}=1{ጥቅም ላይ ያልዋለ ብዙ ቁጥር}one{እነዚህ ንጥሎች ለእነሱ እስካልተጋሩ ድረስ የቡድን Drives አባላት መዳረሻ ያጣሉ።}other{እነዚህ ንጥሎች ለእነሱ እስካልተጋሩ ድረስ የቡድን Drives አባላት መዳረሻ ያጣሉ።}}"
   },
   "9149141099919589043": {
      "message": "በኮማ የተለዩ እሴቶች"
   },
   "9155213204821633067": {
      "message": "$1​ አልተመረጠም።"
   },
   "9180910903828232576": {
      "message": "{NUM_ITEMS_1,plural, =0{ጥቅም ላይ ያልዋለ ብዙ ቁጥር}=1{{NUM_ITEMS_2} አቃፊ ወደ {XXX_1} ታክሏል።}one{{NUM_ITEMS_2} አቃፊዎች ወደ {XXX_2} ታክለዋል።}other{{NUM_ITEMS_2} አቃፊዎች ወደ {XXX_2} ታክለዋል።}}"
   },
   "9197837492705576727": {
      "message": "ወደ ቀጣዩ ንጥል ሂድ"
   },
   "919969969251998566": {
      "message": "ይህን ማህደር ወደ የመልዕክት መለያዎ ያውጡት።"
   },
   "9203454763088526300": {
      "message": "ጽሑፍን ለይቶ ማወቅ አልተቻለም።"
   },
   "9208632284144316801": {
      "message": "ድገም"
   },
   "9213031420087755232": {
      "message": "ገጽን አጽዳ"
   },
   "9220412150349575379": {
      "message": "ኢንችዎች"
   },
   "938074023403688885": {
      "message": "አስወግድ"
   },
   "951963820437151566": {
      "message": "የGoogle ድረገጾች"
   },
   "960732173870658714": {
      "message": "የGoogle Keep ሰነድ"
   },
   "969509857504028202": {
      "message": "ንጥሎችን ከየቡድን Drive ውጪ መውሰድ መዳረሻን እና ባለቤትነትን ይቀይራል።"
   },
   "976103457024703736": {
      "message": "«$1​»ን መክፈት አልቻለም።"
   },
   "985197728509875956": {
      "message": "Chemical Model"
   },
   "991852286447868510": {
      "message": "$1​ን በመፈለግ ላይ"
   },
   "99635082918315028": {
      "message": "የምስል ጽሁፍ ተይዟል"
   },
   "996381410993745580": {
      "message": "Photoshop"
   },
   "996406443443155276": {
      "message": "«$1​»ን መክፈት አልተቻለም።"
   },
   "appDesc": {
      "description": "App description",
      "message": "በሐሳብዎ ውስጥ ያለውን ነገር ወዲያውኑ ይያዙትና እነዚያን ሐሳቦች ለጓደኝዎችዎ እና ቤተሰብ ያጋሩ።"
   },
   "appName": {
      "description": "App name",
      "message": "Google Keep - ማስታወሻዎች እና ዝርዝሮች"
   },
   "shortName": {
      "description": "App short name",
      "message": "Google Keep"
   }
}
