{
   "1001407065815272462": {
      "message": "$2​എന്റെ ഡ്രൈവിലേക്ക്$1​ ചേർക്കാനാവുന്നില്ല"
   },
   "1013939682284715002": {
      "message": "ഓര്‍ഗനൈസുചെയ്യുക"
   },
   "1029576232144989689": {
      "message": "ലിങ്കുകൾ പിന്നീട് ഉപയോഗിക്കുന്നതിന്, $2​Google Keep Chrome വിപുലീകരണം$1​ ഉപയോഗിച്ചും നിങ്ങൾക്ക് അവ സംരക്ഷിക്കാം."
   },
   "1039394921418415681": {
      "message": "സൈൻ ഇൻ ചെയ്യുക"
   },
   "1040405721361467195": {
      "message": "കമന്റ് ചെയ്യാൻ വാക്കുകൾ തിരഞ്ഞെടുക്കുന്നതിന് അമ്പടയാള കീകൾ ഉപയോഗിക്കുക. തിരഞ്ഞെടുക്കൽ വികസിപ്പിക്കാനായി അമ്പടയാള കീകൾ അമർത്തുമ്പോൾ Shift അമർത്തിപ്പിടിക്കുക. ഒരു കമന്റ് സൃഷ്‌ടിക്കാൻ Enter അമർത്തുക, അല്ലെങ്കിൽ റദ്ദാക്കാൻ എസ്‌കേപ്പ് ഉപയോഗിക്കുക."
   },
   "1061011362310586469": {
      "message": "പങ്കിടൽ"
   },
   "1083918249169198626": {
      "message": "കീബോർഡ് കുറുക്കുവഴികൾ പ്രവർത്തനരഹിതമാക്കി."
   },
   "1101371910696766077": {
      "message": "പകർപ്പ് സൃഷ്ടിക്കുക"
   },
   "1105774658609209931": {
      "message": "Chrome വിപുലീകരണം"
   },
   "1122146167985532789": {
      "message": "ഇന്നലെ"
   },
   "1127320433256851404": {
      "message": "വീഡിയോ പ്ലേയർ"
   },
   "1131044617724567645": {
      "message": "PDF-കളിലെ കമന്‍റുകൾ ഫയലിലേക്ക് സംരക്ഷിക്കുകയും മറ്റ് ആപ്പുകളിൽ ദൃശ്യമാകുകയും ചെയ്യും"
   },
   "1137446830169628669": {
      "message": "ഇനം ഇൻഡന്റ് ചെയ്‌തു."
   },
   "1158660505977623040": {
      "message": "ശാശ്വതമായി ഇല്ലാതാക്കുക"
   },
   "1162642135048988280": {
      "message": "പ്രമാണത്തിന്റെ പേരുമാറ്റുക"
   },
   "1163324543881570799": {
      "message": "Google ഡോക്സ്"
   },
   "1166244120191806795": {
      "message": "ഫീഡ്‌ബാക്ക് നൽകുക"
   },
   "1177768120450365955": {
      "message": "ചെക്കുചെയ്‌ത ഇനങ്ങൾ ചുവടേക്ക് നീക്കുക"
   },
   "1179891706526242218": {
      "message": "അടുത്തത്"
   },
   "1185164838496022543": {
      "message": "പേജ് വീണ്ടും ലോഡുചെയ്യുന്നതിന് ഇവിടെ ക്ലിക്കുചെയ്യുക."
   },
   "1213005208968286932": {
      "message": "പരിഹരിച്ചതായി അടയാളപ്പെടുത്തി"
   },
   "124010372300613445": {
      "message": "{numNotes,plural, =1{ആർക്കൈവ് ചെയ്യാത്ത കുറിപ്പ് സൃഷ്‌ടിച്ചു}other{ആർക്കൈവ് ചെയ്യാത്ത # കുറിപ്പുകൾ സൃഷ്‌ടിച്ചു}}"
   },
   "124900027451629830": {
      "message": "പ്ലേ ചെയ്യുക"
   },
   "125608713654167241": {
      "message": "ടീൽ"
   },
   "1256362146573583104": {
      "message": "എക്‌സ്ട്രാക്‌റ്റുചെയ്യുക"
   },
   "1259492729704800881": {
      "message": "കുറിപ്പ് ആർക്കൈവുചെയ്യുക"
   },
   "1263685395252160366": {
      "message": "LaTeX"
   },
   "1271038294394884640": {
      "message": "റദ്ദാക്കുക"
   },
   "12768758038718216": {
      "message": "ആർക്കൈവുചെയ്‌ത കുറിപ്പ് പിൻ ചെയ്യുക"
   },
   "1280430284217153733": {
      "message": "സമയം ചേർക്കുക"
   },
   "1330083198022464084": {
      "message": "പുതിയ കുറിപ്പ് സൃഷ്‌ടിക്കുക"
   },
   "1333255388111908292": {
      "message": "പലചരക്ക് സാധനങ്ങൾ"
   },
   "1335763707789999819": {
      "message": "{NUM_ITEMS,plural, =1{ഈ ഇനം, അതിന്റെ നിലവിലെ ഫോൾഡറുകളിൽ നിന്ന് നീക്കാൻ നിങ്ങൾക്ക് അനുമതിയില്ല. പകരം ഇനം {START_SPAN_1}{NAME}{END_SPAN} എന്നതിൽ ചേർക്കുക.}other{ഈ ഇനങ്ങളെ, അവയുടെ നിലവിലെ ഫോൾഡറുകളിൽ നിന്ന് നീക്കാൻ നിങ്ങൾക്ക് അനുമതിയില്ല. പകരം {START_SPAN_2}{NAME}{END_SPAN} എന്നതിലേക്ക് ഇനങ്ങൾ ചേർക്കുക.}}"
   },
   "1338300799355131761": {
      "message": "ശീർഷകമില്ലാത്ത കുറിപ്പ്"
   },
   "1349697396109290623": {
      "message": "$1​ എന്നതിന്റെ ഉയർന്ന മിഴിവിലുള്ളവ പ്രദർശിപ്പിക്കുന്നു"
   },
   "1359937199332190522": {
      "message": "{NUM_ITEMS_1,plural, =0{unused plural form}=1{{NUM_ITEMS_2} ഫയൽ {XXX_1} എന്നതിലേക്ക് ചേർത്തു.}other{{NUM_ITEMS_2} ഫയലുകൾ {XXX_2} എന്നതിലേക്ക് ചേർത്തു.}}"
   },
   "136335357683289450": {
      "message": "അടയ്‌ക്കുക"
   },
   "1368808491835583439": {
      "message": "ഇരുണ്ട പർപ്പിൾ നിറം"
   },
   "1379850360723600538": {
      "message": "പാസ്‌വേഡ് പരിരക്ഷിത ഫയലുകളെ പിന്തുണയ്‌ക്കുന്നില്ല."
   },
   "1397887822627488928": {
      "message": "പങ്കിടുന്നതിനുള്ള വ്യക്തി അല്ലെങ്കിൽ ഇമെയിൽ"
   },
   "139942704574044780": {
      "message": "അംഗീകരിക്കുക"
   },
   "1419896259743862406": {
      "message": "ഇത് ഉപയോഗിച്ച് തുറക്കുക"
   },
   "1432850707344442376": {
      "message": "$1​ ലേബൽ സൃഷ്‌ടിക്കുക"
   },
   "1434081385486479995": {
      "message": "ഇപ്പോൾ പങ്കിടൽ ലഭ്യമല്ല"
   },
   "1439211265324766071": {
      "message": "ട്രാഷിലെ കുറിപ്പ്"
   },
   "1441487391064925653": {
      "message": "സഹായ കേന്ദ്രത്തിലെ എല്ലാ കുറുക്കുവഴികളും കാണുക"
   },
   "1441712877952841568": {
      "message": "$1​-ന് എഡിറ്റുചെയ്തു"
   },
   "1442722292947881614": {
      "message": "തരങ്ങൾ"
   },
   "1446829548948002072": {
      "message": "കോമ"
   },
   "1453330983536591773": {
      "message": "ഇളം ചാരനിറം"
   },
   "1463389029497634261": {
      "message": "ശബ്‌ദം കുറയ്‌ക്കുക"
   },
   "1465828580966685215": {
      "message": "അക്കൗണ്ട് മായ്‌ക്കുക"
   },
   "1466663154000252842": {
      "message": "ചിലർക്ക് ആക്‌സസ്സ് നഷ്‌ടമായേക്കാം"
   },
   "1467797923781828000": {
      "message": "$1​ ഇനങ്ങളെ $2​ എന്നതിൽ ചേർത്തു."
   },
   "1473312930157933007": {
      "message": "ഡൊമെയ്‌നിന് പുറത്തുള്ള പങ്കിടലിനെ നിങ്ങളുടെ അഡ്‌മിൻ പ്രവർത്തനരഹിതമാക്കിയതിനാൽ ഇനിപ്പറയുന്ന ഉപയോക്താക്കളുമായി പങ്കിടാനാവില്ല."
   },
   "1475258635371833968": {
      "message": "$2​, $1​"
   },
   "1475261522522402536": {
      "message": "സ്ഥലം തിരഞ്ഞെടുക്കുക"
   },
   "1478393252643397554": {
      "message": "ഓറഞ്ച്"
   },
   "1482452362096735080": {
      "message": "{numOccurrences} തവണ സംഭവിക്കുന്നു"
   },
   "1499433769420882987": {
      "message": "$1​ പ്രദർശിപ്പിക്കുന്നു"
   },
   "1505876360160857231": {
      "message": "$1​ TB"
   },
   "1507063529674142853": {
      "message": "മാസത്തിലെ അവസാന ദിവസം"
   },
   "1507445189431379166": {
      "message": "ഇല്ലാതാക്കുക"
   },
   "1512114410402431831": {
      "message": "പുതുക്കിയെടുക്കുക"
   },
   "1512454807955173272": {
      "message": "ഓൺലൈനിലായിരിക്കുമ്പോൾ Keep അപ്ഡേറ്റ് ചെയ്യും"
   },
   "1513178578981188988": {
      "message": "Edge"
   },
   "1532717559893630620": {
      "message": "$1​ ലേബൽ $2​ ലേബലിൽ ലയിപ്പിച്ചു."
   },
   "1536051766421561160": {
      "message": "സമചിഹ്നങ്ങൾ"
   },
   "153659275234722804": {
      "message": "ഡിസ്മിസ് ചെയ്യുക"
   },
   "1543499632005215694": {
      "message": "{NUM_ITEMS,plural, =0{ununsed plural form}=1{\"{ADDED_PARENT_NAME}\" എന്നതിലേക്ക് നീക്കിക്കൊണ്ടിരിക്കുന്ന ഫയലിൽ DLP തിരിച്ചറിയലുകൾ ട്രിഗർ ചെയ്‌തു. ഈ ഫയലിനുള്ളിൽ രഹസ്യാത്മക വിവരങ്ങളുണ്ടാകാം.}other{\"{ADDED_PARENT_NAME}\" എന്നതിലേക്ക് നീക്കിക്കൊണ്ടിരിക്കുന്ന ചില ഫയലുകളിൽ DLP തിരിച്ചറിയലുകൾ ട്രിഗർ ചെയ്‌തു. ഈ ഫയലുകൾക്കുള്ളിൽ രഹസ്യാത്മക വിവരങ്ങളുണ്ടാകാം.}}"
   },
   "1568379678795589771": {
      "message": "ചതുരം"
   },
   "1586968957182554447": {
      "message": "പ്രവർത്തനരഹിതമാക്കുക"
   },
   "1588268697057804046": {
      "message": "$1​ മണിക്കൂർ മുമ്പ്"
   },
   "1606998668553414638": {
      "message": "ആക്സസ്സ് അഭ്യര്‍ത്ഥിക്കുക"
   },
   "1612117309990202511": {
      "message": "ഡോട്ടുകൾ"
   },
   "1623657263486883050": {
      "message": "സെമി"
   },
   "1633798963327779260": {
      "message": "നാളെ"
   },
   "1655692513689044870": {
      "message": "നിങ്ങൾ സൈൻ ഔട്ട് ചെയ്‌തു."
   },
   "1656911987308166143": {
      "message": "ഇല്ലാതാക്കുക"
   },
   "1661251023749398110": {
      "message": "ഓഡിയോ ഡൗൺലോഡുചെയ്യുക"
   },
   "1665821947855814052": {
      "message": "വലുപ്പം"
   },
   "1675900304699098572": {
      "message": "{count,plural, =1{കുറിപ്പ് അൺപിൻ ചെയ്‌തു}other{# കുറിപ്പുകൾ അൺപിൻ ചെയ്‌തു}}"
   },
   "1680617124502957636": {
      "message": "ഇപ്പോൾ കണക്റ്റുചെയ്യാനാവില്ല. പിന്നീട് വീണ്ടും ശ്രമിക്കുക."
   },
   "1680818623013843452": {
      "message": "Lucidchart"
   },
   "1683762293389974494": {
      "message": "ഇല്ലാതാക്കുക"
   },
   "1694896269813520248": {
      "message": "ഡ്രോയിംഗ് ചേർക്കുക"
   },
   "1697160643589236962": {
      "message": "$1​ PB"
   },
   "1703175513040690135": {
      "message": "$1​ എന്നതിലെ ആർക്കും"
   },
   "1704004075228783011": {
      "message": "{every,plural, =1{മാസംതോറും, മാസത്തിന്റെ അവസാന ദിവസത്തിൽ ആവർത്തിക്കുന്നു}other{ഓരോ # മാസത്തിലും മാസത്തിന്റെ അവസാന ദിവസത്തിൽ ആവർത്തിക്കുന്നു}}"
   },
   "1711424025297585662": {
      "message": "ഒരു|ഒരു|ഈ"
   },
   "171683163267149669": {
      "message": "$1​ GB"
   },
   "1730171019350750807": {
      "message": "കറുപ്പ്"
   },
   "1737240194537729525": {
      "message": "ആഴ്‌ച തോറും"
   },
   "1738407623218213194": {
      "message": "അജ്ഞാതം"
   },
   "1739900012825270238": {
      "message": "മുൻ ഇനത്തിലേക്ക് പോകുക"
   },
   "1740371341228065086": {
      "message": "വീണ്ടും ലോഡുചെയ്യുക"
   },
   "1745782414562966515": {
      "message": "\"$1​\" ലേബലിനെ \"$2​\" ലേബലുമായി ലയിപ്പിക്കണോ? \"$1​\" എന്ന് ലേബൽ ചെയ്‌തിരിക്കുന്ന എല്ലാ കുറിപ്പുകളും \"$2​\" എന്ന് ലേബൽ ചെയ്‌ത് \"$1​\" ലേബലിനെ ഇല്ലാതാക്കും."
   },
   "1746512984326924716": {
      "message": "ഈ പ്രവർത്തനം പഴയപടിയാക്കാനാവില്ല."
   },
   "1783719421893050637": {
      "message": "അളവുകൾ"
   },
   "178927681797742562": {
      "message": "സൈൻ ഇൻ"
   },
   "1791115075948268631": {
      "message": "കീബോർഡ് കുറുക്കുവഴി സഹായം തുറക്കുക"
   },
   "179545118447015250": {
      "message": "ഗ്രിഡ് കാഴ്‌ച"
   },
   "1803966010993357655": {
      "message": "മറ്റുള്ളവ"
   },
   "1808245543551507519": {
      "message": "ഓഡിയോ"
   },
   "1808500458645743749": {
      "message": "ലോക്ക് സ്‌ക്രീൻ കുറിപ്പുകൾ സ്വമേധയാ Google Keep-ൽ സംരക്ഷിക്കും. ഏറ്റവും പുതിയ കുറിപ്പ് ലോക്ക് സ്‌ക്രീനിൽ തന്നെ നിലനിൽക്കും."
   },
   "1810354345035313773": {
      "message": "മാർക്കർ ടൂൾ വർണ്ണവും വലുപ്പ സെലക്‌ടറും തുറക്കുക"
   },
   "1819225489062185613": {
      "message": "മറ്റുള്ളവ"
   },
   "1823222042913714987": {
      "message": "പാസ്‌വേഡ് സമർപ്പിക്കുക"
   },
   "1829174126565818591": {
      "message": "ഫയര്‍ഫോക്സ്"
   },
   "1830157062072535681": {
      "message": "$1​ പ്രദർശിപ്പിക്കുന്നു"
   },
   "1852745815330163711": {
      "message": "Google ഡ്രോയിംഗ്"
   },
   "1857224091554117760": {
      "message": "ചുവപ്പ്"
   },
   "1870691479127746185": {
      "message": "വലത് അമ്പടയാളം"
   },
   "187077078156858455": {
      "message": "ഓഡിയോ കുറിപ്പ്"
   },
   "189303170370862360": {
      "message": "$1​ / $2​ ഇനങ്ങൾ"
   },
   "1900571668686750716": {
      "message": "vCard"
   },
   "1901215424950227523": {
      "message": "$1​ ലേബൽ നിലവിലില്ല"
   },
   "1918176455405610789": {
      "message": "പൂർത്തിയായി"
   },
   "1936219394601788126": {
      "message": "രക്ഷിതാവ്"
   },
   "1938115711058331119": {
      "message": "കമന്റ് കോളം കാണിക്കുക"
   },
   "195154114623528341": {
      "message": "ലൊക്കേഷൻ ചേർക്കുക"
   },
   "1956794332842050061": {
      "message": "അടുത്ത പേജ്"
   },
   "1965626377712226216": {
      "message": "കീനോട്ട്"
   },
   "1967536906522187719": {
      "message": "ഈ ഷീറ്റിന്റെ പ്രിവ്യൂ കാണുന്നതിൽ ഒരു പ്രശ്നമുണ്ടായി."
   },
   "1968405748623909021": {
      "message": "ഈ ഇനം തുറക്കാനോ എഡിറ്റുചെയ്യാനോ ചുവടെയുള്ള അപ്ലിക്കേഷനുകളിൽ ഒന്ന് പരീക്ഷിക്കുക"
   },
   "1969531182936822963": {
      "message": "പ്രവർത്തനം പഴയപടിയാക്കി"
   },
   "1973454937875679500": {
      "message": "ലേബലിന്റെ പേര് നൽകുക"
   },
   "1975630610063119352": {
      "message": "{charsRemaining,plural, =1{# പ്രതീകം ശേഷിക്കുന്നു}other{# പ്രതീകം ശേഷിക്കുന്നു}}"
   },
   "1980209166254310911": {
      "message": "ദിവസം"
   },
   "1988244842147989817": {
      "message": "ട്രാഷിലുള്ള കുറിപ്പുകൾ 7 ദിവസത്തിനുശേഷം ഇല്ലാതാക്കപ്പെടും."
   },
   "200005227964332868": {
      "message": "കൂടുതൽ"
   },
   "2003845117979929469": {
      "message": "വിശദാംശങ്ങൾ"
   },
   "200488920523496447": {
      "message": "ഇനത്തിലേക്ക് സൂം ചെയ്‌‌തു."
   },
   "2039757863628752523": {
      "message": "ഫ്രീക്വെൻസി ഓപ്‌ഷനുകൾ"
   },
   "205876860571942679": {
      "message": "Google എന്റെ മാപ്പ്"
   },
   "2059084517358086391": {
      "message": "കണ്ടെത്തുക ബാർ അടയ്‌ക്കുക"
   },
   "2061440050632248160": {
      "message": "ആര്‍ക്കൈവുചെയ്യുക"
   },
   "2068023589621557589": {
      "message": "TrueType ഫോണ്ട്"
   },
   "2073322475696388995": {
      "message": "മുന്നിലേക്ക് പോകുക"
   },
   "2074454463201225704": {
      "message": "സൂം റീസെറ്റുചെയ്യുക"
   },
   "207810168108507460": {
      "message": "$1​ മണിക്കൂർ മുമ്പ്"
   },
   "2085048987351765091": {
      "message": "മനസ്സിലായി"
   },
   "2091811447965921066": {
      "message": "അവരെ നീക്കംചെയ്യുക"
   },
   "2107379241532042955": {
      "message": "ലൊക്കേഷൻ"
   },
   "2107589831642088814": {
      "message": "\"$3​$2​$1​\" സൃഷ്‌ടിക്കുക"
   },
   "2109979457438465538": {
      "message": "ലേബൽ പിക്കർ മെനു തുറന്നു"
   },
   "2113092209746357267": {
      "message": "ക്രോം"
   },
   "2118635459760443566": {
      "message": "അടുത്തത്"
   },
   "2119255452378336327": {
      "message": "ബുള്ളറ്റ് $1​-ലേക്ക് പുനഃസ്ഥാപിച്ചു"
   },
   "212796670323571824": {
      "message": "ശരി"
   },
   "213665695896111861": {
      "message": "കുറിപ്പുകള്‍"
   },
   "2138593281154109183": {
      "message": "ആര്‍ക്കൈവുചെയ്‌തവ"
   },
   "214517458278879973": {
      "message": "$1​ എന്ന പേരിൽ സൈൻ ഇൻ ചെയ്യുക"
   },
   "2147952938331523160": {
      "message": "പേരുമാറ്റുക..."
   },
   "2154372123324862271": {
      "message": "സ്ലാഷ്"
   },
   "2166966123760559393": {
      "message": "പുതിയ ലേബൽ സൃഷ്ടിക്കൂ"
   },
   "2168461275182666804": {
      "message": "എഡിറ്റുചെയ്യുക"
   },
   "2181197458532159304": {
      "message": "{numberOfNotes,plural, =1{കുറിപ്പ് ട്രാഷ് ചെയ്‌തു}other{# കുറിപ്പുകൾ ട്രാഷ് ചെയ്‌തു}}"
   },
   "2184278444368405837": {
      "message": "$1​ ഇനങ്ങൾ"
   },
   "2187239650627580457": {
      "message": "സമര്‍പ്പിക്കൂ"
   },
   "2189621188983913867": {
      "message": "കൂടുതൽ ആപ്പുകൾ കണക്‌റ്റ് ചെയ്യുക"
   },
   "2190049738646901760": {
      "message": "{count,plural, =1{കുറിപ്പ് ഇല്ലാതാക്കണോ?}other{കുറിപ്പുകൾ ഇല്ലാതാക്കണോ?}}"
   },
   "2195440644060728966": {
      "message": "{NUM_ITEMS,plural, =1{ഒരു ഫോൾഡറിൽ ഉള്ള ഒരു ഫോൾഡർ നിങ്ങൾ നീക്കുകയാണ്}other{ഒരു ഫോൾഡറിൽ ഉള്ള ഫോൾഡറുകൾ നിങ്ങൾ നീക്കുകയാണ്}}"
   },
   "2198096971937872560": {
      "message": "ഓർമ്മപ്പെടുത്തൽ:"
   },
   "220168959069469607": {
      "message": "കൂടുതൽ പ്രവർത്തനങ്ങൾ"
   },
   "2202265279234683999": {
      "message": "കീബോർഡ് കുറുക്കുവഴികൾ"
   },
   "2203926649090909861": {
      "message": "$1​ സൂചികയിലേക്ക് ലിസ്‌റ്റ് ഇനം നീക്കി"
   },
   "2215890921415017560": {
      "message": "പൂർണ്ണ സ്‌ക്രീൻ മോഡ്"
   },
   "2216904725760458480": {
      "message": "ദിവസം തോറും"
   },
   "221715292685577880": {
      "message": "ഉണ്ട്"
   },
   "2226562046914098941": {
      "message": "പ്രിവ്യു ചെയ്യാനാവുന്നതിലും വളരെ വലുതാണ് ഈ ഫയൽ"
   },
   "2226937423434054727": {
      "message": "$1​, $2​ മുതൽ $3​, $4​ വരെ തിരഞ്ഞെടുത്തു"
   },
   "223198388381606871": {
      "message": "ഇളം വയലറ്റ്"
   },
   "2264311811697505466": {
      "message": "പുതുക്കുക"
   },
   "2270469222412517777": {
      "message": "ടെക്‌സ്റ്റ് തിരിച്ചറിയാനാകുന്നില്ല"
   },
   "2270633624888102832": {
      "message": "കുറിപ്പ് അൺപിൻ ചെയ്യുക"
   },
   "2280650195464600721": {
      "message": "നാവിഗേഷന്‍"
   },
   "2282423663539387332": {
      "message": "വരാൻ പോകുന്നത്"
   },
   "2285069188138705005": {
      "message": "കണക്റ്റുചെയ്‌ത ആപ്സ്"
   },
   "2286685488296851497": {
      "message": "{NUM_ITEMS_1,plural, =0{ununsed plural form}=1{\"{SHARED_FOLDER_NAME}\" എന്ന പങ്കിട്ട ഫോൾഡറിൽ നിന്ന് നിങ്ങൾ ഒരു ഇനം നീക്കുകയാണ്, അതിനാൽ ആളുകൾക്ക് അതിലേക്കുള്ള ആക്സസ് നഷ്ടപ്പെടും.}other{ \"{SHARED_FOLDER_NAME}\" എന്ന പങ്കിട്ട ഫോൾഡറിൽ നിന്ന് നിങ്ങൾ {NUM_ITEMS_2} ഇനങ്ങൾ നീക്കുകയാണ്, അതിനാൽ ആളുകൾക്ക് അവയിലേക്കുള്ള ആക്സസ് നഷ്ടപ്പെടും.}}"
   },
   "228741435562395266": {
      "message": "പ്രിന്റിംഗ് ഇതുവരെ ലഭ്യമല്ല"
   },
   "2289534534793293486": {
      "message": "ആർക്കൈവുചെയ്‌തത് മാറ്റുക"
   },
   "2289812403593835836": {
      "message": "പേജുകള്‍"
   },
   "229177484946387188": {
      "message": "Google Earth"
   },
   "2292696732672795285": {
      "message": "ശബ്‌ദം കൂട്ടുക"
   },
   "2299671629154778581": {
      "message": "കുറിപ്പുകൾ അൺപിൻ ചെയ്‌ത്, ആർക്കൈവുചെയ്‌തു"
   },
   "2308018963132768704": {
      "message": "വലുപ്പം 4"
   },
   "2310145944356900158": {
      "message": "ചെക്കുചെയ്‌തവ"
   },
   "2311880726221661199": {
      "message": "ഉയർന്ന മിഴിവുകൾ ലോഡുചെയ്യുന്നു"
   },
   "2324955914430674498": {
      "message": "\"$1​\" എന്നതിന് തിരയൽ ഫലങ്ങൾ ഒന്നുമില്ല"
   },
   "2329167963662998826": {
      "message": "ലൊക്കേഷൻ ഓർമ്മപ്പെടുത്തലുകൾക്കായി സ്ഥല നിർദ്ദേശങ്ങൾ മെച്ചപ്പെടുത്തുന്നതിന് നിങ്ങളുടെ ലൊക്കേഷൻ ഉപയോഗിക്കാൻ Google Keep താൽപ്പര്യപ്പെടുന്നു."
   },
   "2346361265476305332": {
      "message": "ഈ ഓഡിയോ ഫയൽ ഡൗൺലോഡുചെയ്യുന്നത് ഉടമ തടഞ്ഞിരിക്കുന്നു."
   },
   "2357623745116912085": {
      "message": "{NUM_ITEMS,plural, =0{ununsed plural form}=1{\"{TEAM_DRIVE_NAME}\" ടീം ഡ്രൈവിലെ അംഗങ്ങളുമായി ഈ ഇനം പങ്കിടുന്നില്ലെങ്കിൽ അവർക്ക് ആക്‌സസ്‌ നഷ്‌ടപ്പെടും.}other{ \"{TEAM_DRIVE_NAME}\" ടീം ഡ്രൈവിലെ അംഗങ്ങളുമായി ഈ ഇനങ്ങൾ പങ്കിടുന്നില്ലെങ്കിൽ അവർക്ക് ആക്‌സസ്‌ നഷ്‌ടപ്പെടും.}}"
   },
   "2357761837816388330": {
      "message": "ഓഫ്‌ലൈൻ"
   },
   "2359614137862708172": {
      "message": "Shift"
   },
   "2364374826543847335": {
      "message": "ഉറവിടം നീക്കംചെയ്യുക"
   },
   "236689092839978781": {
      "message": "ആവർത്തിക്കുന്നില്ല"
   },
   "2370656573843123707": {
      "message": "വലത് ബ്രാക്കറ്റ്"
   },
   "2373760032138505521": {
      "message": "ലേബൽ ഇതിനകം നിലവിലുണ്ട്"
   },
   "2386536768112358461": {
      "message": "pg-down"
   },
   "2396804279177914769": {
      "message": "ടീം ഡ്രൈവിലേക്ക് ഉടമസ്ഥത കൈമാറണോ?"
   },
   "2405795704816921421": {
      "message": "$1​ ഫയൽ"
   },
   "2408383448126741628": {
      "message": "സമയ ദൈർഘ്യം"
   },
   "2408933271548524782": {
      "message": "ലോക്ക് ചെയ്‌തത്"
   },
   "2423877407428530040": {
      "message": "ഫയലിൽ നിരവധി ചാർട്ടുകളുണ്ട്."
   },
   "2433429041384246549": {
      "message": "മ്യൂട്ടുചെയ്യുക"
   },
   "2444198666025646119": {
      "message": "വയലറ്റ്"
   },
   "2449254824382583885": {
      "message": "പോപ്പ് ഔട്ട്"
   },
   "2452145367257933677": {
      "message": "പഴയപടിയാക്കുക"
   },
   "2452522051596946166": {
      "message": "ക്ഷമിക്കണം! $1​ എന്നതിന്റെ പ്രിവ്യൂ കാണിക്കുന്നതിൽ ഒരു പ്രശ്‌നമുണ്ടായി. വീണ്ടും ശ്രമിക്കുന്നു."
   },
   "2454642351139428112": {
      "message": "പഴയപടിയാക്കുക"
   },
   "2466251465475184755": {
      "message": "ട്രാഷ് ശൂന്യമാക്കണോ? ട്രാഷിലെ എല്ലാ കുറിപ്പുകളും ശാശ്വതമായി ഇല്ലാതാക്കപ്പെടും."
   },
   "2475181823688399272": {
      "message": "അടുത്തത്"
   },
   "2478862372619762755": {
      "message": "കമന്റിടേണ്ട ഭാഗം ഹൈലൈറ്റുചെയ്യുക"
   },
   "2483363439634684283": {
      "message": "വലുപ്പം 20"
   },
   "2504232652631703202": {
      "message": "കണക്റ്റുചെയ്‌തു"
   },
   "251025074207413762": {
      "message": "ഒരു വിവരണം ചേര്‍ക്കുക"
   },
   "2525633490863427854": {
      "message": "വീണ്ടും ചെയ്യുക"
   },
   "2527534830196374788": {
      "message": "Ctrl"
   },
   "2532280782491328445": {
      "message": "മുമ്പത്തെ കണ്ടെത്തുക"
   },
   "2555961950726197809": {
      "message": "കാഴ്‌ച്ചക്കാരനെ കാണിക്കുന്നു."
   },
   "2562881166530755046": {
      "message": "ഡ്രോയിംഗുകൾ"
   },
   "257317112834806705": {
      "message": "ലിസ്റ്റ്, ഗ്രിഡ് കാഴ്‌ചയ്‌ക്കിടയിൽ ടോഗിൾ ചെയ്യുക"
   },
   "2579261044590673579": {
      "message": "എന്റെ ഡ്രൈവ്"
   },
   "2579679351920691492": {
      "message": "പിന്നിലേക്ക് പോകുക"
   },
   "2581526424350930407": {
      "message": "എഡിറ്റുചെയ്യുക"
   },
   "2584557103820423944": {
      "message": "ഇൻഡന്റ്/ഡിഡെന്റ് ലിസ്‌റ്റ് ഇനം"
   },
   "2600731575260427177": {
      "message": "ഫയൽ നിലവിലില്ല, ഒരുപക്ഷേ അത് ഇല്ലാതാക്കിയിട്ടുണ്ടാകാം. ഫയൽ വീണ്ടും അപ്‌ലോഡുചെയ്യുന്നത് പരീക്ഷിക്കുക."
   },
   "2601304136110057215": {
      "message": "പുതിയ ഡ്രോയിംഗ്"
   },
   "2604527707881848686": {
      "message": "ഇനം കൂടുതൽ ഡിഡന്റ് ചെയ്യാനാവില്ല."
   },
   "2609409316752026806": {
      "message": "PDF"
   },
   "2609767652209789035": {
      "message": "ലേബലുകൾ"
   },
   "2623861453769098676": {
      "message": "ഈ പ്രമാണത്തിന്റെ പ്രിവ്യൂ കാണിക്കുന്നതിൽ ഒരു പ്രശ്‌നമുണ്ടായി."
   },
   "2626653026098396543": {
      "message": "{NUM_ITEMS,plural, =0{Unused}=1{ഈ ഇനം നീക്കുന്നത്‌, \"{SHARED_FOLDER_NAME}\" എന്ന പങ്കിട്ട ഫോൾഡർ കാണാനാകുന്ന എല്ലാവരുമായും ഇത് പങ്കിടുന്നതിനിടയാക്കും.}other{ഈ ഇനങ്ങൾ നീക്കുന്നത്‌, \"{SHARED_FOLDER_NAME}\"എന്ന ഫോൾഡർ കാണാനാകുന്ന എല്ലാവരുമായും ഇവ പങ്കിടുന്നതിനിടയാക്കും.}}"
   },
   "2630254198275172065": {
      "message": "ഇതിലേക്ക് നീക്കുക..."
   },
   "2632263751512428257": {
      "message": "വർഷം തോറും"
   },
   "2645469029410848421": {
      "message": "{noteCount,plural, =1{ലേബൽ കുറിപ്പ്}other{ലേബൽ കുറിപ്പുകൾ}}"
   },
   "2661850177130037208": {
      "message": "ഇനം തുറക്കുക"
   },
   "2680303811435018716": {
      "message": "കൂടുതൽ ഇനങ്ങൾ ചേർക്കാനാവില്ല"
   },
   "2681830832355823748": {
      "message": "എല്ലാ കുറുക്കുവഴികളും തിരയുക"
   },
   "268402507078609011": {
      "message": "{imagesAdded,plural, =1{ചിത്രം ചേര്‍ത്തു}other{# ചിത്രങ്ങൾ ചേര്‍ത്തു}}"
   },
   "2702485557996900362": {
      "message": "വൈരുദ്ധ്യമുള്ള എഡിറ്റുകൾ പരിഹരിക്കുക"
   },
   "2704959686524436777": {
      "message": "ലോഡുചെയ്യുന്നു"
   },
   "2715199780155065699": {
      "message": "ഫയലിൽ നിരവധി രൂപങ്ങളോ ടെക്‌സ്‌റ്റ് ബോക്‌സുകളോ ഡ്രോയിംഗുകളോ ഉണ്ട്."
   },
   "2716433087531258659": {
      "message": "പേജ് മുകളിലേക്ക്"
   },
   "2719125961689709460": {
      "message": "കുറിപ്പ്"
   },
   "2742719907061406418": {
      "message": "XML"
   },
   "2758125083752925237": {
      "message": "(ഉടമ)"
   },
   "2760106082595028595": {
      "message": "കുറിപ്പ് വളരെ വലുതാണ്."
   },
   "277430914014962533": {
      "message": "ക്ഷമിക്കണം! $1​ എന്നതിന്റെ പ്രിവ്യൂ കാണിക്കുന്നതിൽ ഒരു പ്രശ്‌നമുണ്ടായി."
   },
   "2777453609143551768": {
      "message": "ശബ്‌ദ നിയന്ത്രണം"
   },
   "2793841261389879255": {
      "message": "മുന്‍ പേജ്"
   },
   "2794676336056877832": {
      "message": "{every,plural, =1{മാസംതോറും, ഒരേ ദിവസത്തിൽ ആവർത്തിക്കുന്നു}other{ഓരോ # മാസവും, എല്ലാ മാസത്തിലെയും ഒരേ ദിവസത്തിൽ ആവർത്തിക്കുന്നു}}"
   },
   "2798322202738486782": {
      "message": "{HOURS,plural, =0{0 മണിക്കൂർ }=1{ഒരു മണിക്കൂർ }other{# മണിക്കൂർ }}{MINUTES,plural, =0{0 മിനിറ്റ് }=1{ഒരു മിനിറ്റ് }other{# മിനിറ്റ് }}{SECONDS,plural, =0{0 സെക്കൻഡ്.}=1{1 സെക്കൻഡ്.}other{# സെക്കൻഡ്.}}"
   },
   "2803553109654833664": {
      "message": "പിങ്ക്"
   },
   "2818020101821669029": {
      "message": "സൃഷ്‌ടിച്ചത്"
   },
   "2820045170951016567": {
      "message": "റിമൈൻഡറുകൾ"
   },
   "2823533464825550362": {
      "message": "ഡോക്യുമെന്റ് നിയന്ത്രണങ്ങൾ"
   },
   "2827039933590757722": {
      "message": "Windows കുറുക്കുവഴി"
   },
   "2828060233316503200": {
      "message": "{NUM_ITEMS_1,plural, =0{unused plural form}=1{{NUM_ITEMS_2} ഇനം, {XXX_1} എന്നതിൽ നിന്ന് {XXX_2} എന്നതിലേക്ക് നീക്കി.}other{{NUM_ITEMS_2} ഇനങ്ങളെ {XXX_3} എന്നതിൽ നിന്ന് {XXX_4} എന്നതിലേക്ക് നീക്കി.}}"
   },
   "2829226075651806940": {
      "message": "സൂം ഇന്‍ ചെയ്യുക"
   },
   "2842462703735289745": {
      "message": "പങ്കിട്ട ഫോൾഡർ \"$1​\" കാണാൻ കഴിയുന്ന എല്ലാവർക്കും ആക്‌സസ് ലഭിക്കും."
   },
   "2853036885874864031": {
      "message": "$1​ ഡൊമെയ്‌നിലേക്ക്‌ ഉടമസ്ഥത കൈമാറും."
   },
   "2854717396594966319": {
      "message": "OpenOffice റൈറ്റർ"
   },
   "2858566870229558873": {
      "message": "$2​നിബന്ധനകൾ$1​"
   },
   "2862675909830094845": {
      "message": "പുതിയ ലേബല്‍ സൃഷ്ടിക്കൂ"
   },
   "2873089307546162154": {
      "message": "ശരി"
   },
   "2877285560485318801": {
      "message": "താൽക്കാലികമായി നിർത്തുക"
   },
   "2879276552944958066": {
      "message": "$1​ ഫോൾഡറിലേക്ക് തിരികെ പോകുക."
   },
   "2886313667612471214": {
      "message": "പുതുക്കൽ ആവശ്യമാണ്. ഇതിന് കുറച്ച് സമയമെടുത്തേക്കാം."
   },
   "2893055432094515558": {
      "message": "ചെക്ക്‌ബോക്‌സുകൾ കാണിച്ചിരിക്കുന്നു"
   },
   "289798573180023043": {
      "message": "ശരി"
   },
   "2901360496423912565": {
      "message": "റിപ്പോർട്ടുചെയ്യുക"
   },
   "2902570047322934912": {
      "message": "പങ്കിടൽ പ്രവർത്തനക്ഷമമാക്കുക"
   },
   "2908917161758545146": {
      "message": "{count,plural, =1{കുറിപ്പ് അൺപിൻ ചെയ്‌ത്, ആർക്കൈവുചെയ്‌തു}other{# കുറിപ്പുകൾ അൺപിൻ ചെയ്‌ത്, ആർക്കൈവുചെയ്‌തു}}"
   },
   "292972929665636688": {
      "message": "Keep-ൽ പുതിയ കുറിപ്പുകളും ചെക്ക്‌ലിസ്‌റ്റുകളും സൃഷ്‌ടിക്കാൻ നിങ്ങൾക്കിപ്പോൾ Google അസിസ്‌റ്റന്റ് ഉപയോഗിക്കാനാവും."
   },
   "2935193106137642160": {
      "message": "സൂം ചെയ്യാനാകില്ല"
   },
   "2942094715879803305": {
      "message": "ചെക്കുചെയ്‌ത ഇനങ്ങൾ ഇല്ലാതാക്കുക"
   },
   "295331174171409695": {
      "message": "\"$1​\" എന്നതിന്റെ ഡൗൺലോഡുചെയ്യൽ അനുമതി അപ്ഡേറ്റുചെയ്യുന്നതിൽ ഒരു പ്രശ്‌നമുണ്ടായി."
   },
   "2960516445247616550": {
      "message": "പ്രിന്റിംഗ് ലഭ്യമല്ല"
   },
   "296391753033307868": {
      "message": "$1​ ലേബൽ സൃഷ്‌ടിക്കുകയും ഒരു കുറിപ്പ് ചേർക്കുകയും ചെയ്‌തു."
   },
   "2964778642459027786": {
      "message": "ട്രാഷിൽ കുറിപ്പുകളൊന്നുമില്ല"
   },
   "2971623719720688041": {
      "message": "പ്രവർത്തനം പഴയപടിയാക്കി"
   },
   "2971780287153684447": {
      "message": "Android ഉപകരണങ്ങൾ"
   },
   "2973306402585941108": {
      "message": "രാവിലെ"
   },
   "298817883481775869": {
      "message": "ലോഡുചെയ്യുന്നു..."
   },
   "2990497076082409431": {
      "message": "$2​ എന്നതിലേക്ക് \"$1​\"നീക്കി."
   },
   "2993901764282547916": {
      "message": "ആപ്പ് മേക്കർ"
   },
   "3005058076425755361": {
      "message": "ബാക്ക്‌സ്‍പെയ്‍സ്"
   },
   "3018905429279095639": {
      "message": "{NUM_ITEMS,plural, =1{ഈ ഫോൾഡറിനെ, അതിന്റെ നിലവിലെ ഫോൾഡറുകളിൽ നിന്ന് നീക്കാൻ നിങ്ങൾക്ക് അനുമതിയില്ല. പകരം {START_SPAN_1}{NAME}{END_SPAN} എന്നതിലേക്ക് ഫോൾഡർ ചേർക്കുക}other{ഈ ഫോൾഡറുകളെ, അവയുടെ നിലവിലെ ഫോൾഡറുകളിൽ നിന്ന് നീക്കാൻ നിങ്ങൾക്ക് അനുമതിയില്ല. പകരം, {START_SPAN_2}{NAME}{END_SPAN} എന്നതിലേക്ക് ഫോൾഡറുകൾ ചേർക്കുക.}}"
   },
   "3043961722025425136": {
      "message": "വിവരണം"
   },
   "3045997283325725532": {
      "message": "Google Keep-ൽ പുതിയതായി എന്താണുള്ളത്"
   },
   "306516303501625305": {
      "message": "പ്രമാണീകരണം പരാജയപ്പെട്ടു."
   },
   "3108098439469164127": {
      "message": "പുതിയ ഡ്രോയിംഗ് തുറന്നു"
   },
   "3109321241584918345": {
      "message": "കൂടുതൽ അപ്ലിക്കേഷനുകൾ കണക്റ്റുചെയ്യുക..."
   },
   "3121560585545725724": {
      "message": "$1​, $2​"
   },
   "3140236589681731084": {
      "message": "$1​ മണിക്കൂറിനുള്ളിൽ"
   },
   "3147722095652727387": {
      "message": "ഇനിപ്പറയുന്ന ഉപയോക്താക്കളുടെ ഡൊമെയ്‌നിലേക്കുള്ള പങ്കിടലിനെ അവരുടെ അഡ്‌മിൻ പ്രവർത്തനരഹിതമാക്കിയതിനാലോ നിങ്ങളുടെ ഡൊമെയ്‌നിന് പുറത്തുള്ള പങ്കിടലിനെ നിങ്ങളുടെ അഡ്‌മിൻ പ്രവർത്തനരഹിതമാക്കിയതിനാലോ അവരുമായി പങ്കിടാനാവില്ല."
   },
   "3149135495425830054": {
      "message": "സൈൻ ഇൻ ചെയ്‌ത ശേഷം നിർദ്ദേശവും സ്വയം പൂർത്തികരിക്കലും ലഭ്യമാകും"
   },
   "3150651996344750990": {
      "message": "{count,plural, =1{കുറിപ്പ് ആർക്കൈവുചെയ്‌തത് മാറ്റി}other{# കുറിപ്പുകൾ ആർക്കൈവുചെയ്‌തത് മാറ്റി}}"
   },
   "3167198321908629554": {
      "message": "നിങ്ങളുടെ കുറിപ്പുകൾ പുതുക്കി, റീലോഡ് ചെയ്യുന്നു..."
   },
   "3176246635438298155": {
      "message": "ഇല്ലാതാക്കുക"
   },
   "3187117482772485385": {
      "message": "ലഘുചിത്രം സൃഷ്‌ടിക്കുന്നു..."
   },
   "3189854932778515441": {
      "message": "ആർക്കൈവിലെ കുറിപ്പ്"
   },
   "3190546672187601036": {
      "message": "രാത്രി"
   },
   "3195812604657128345": {
      "message": "എക്‌സ്‌ട്രാക്റ്റുചെയ്യേണ്ട ഒരു ഡ്രൈവ് ഫോൾഡർ തിരഞ്ഞെടുക്കുക"
   },
   "32059145043728507": {
      "message": "{numberOfNotes,plural, =1{കുറിപ്പ് പുനഃസ്ഥാപിച്ചു}other{# കുറിപ്പുകൾ പുനഃ‌സ്ഥാപിച്ചു}}"
   },
   "3207650089232728475": {
      "message": "ലേബലുകൾ മാറ്റുക"
   },
   "3211163842850942567": {
      "message": "സൂം ഇന്‍ ചെയ്യുക"
   },
   "3217354672216773127": {
      "message": "$1​ ഫയർ ചെയ്‌തു"
   },
   "3220641589840600333": {
      "message": "$1​ കാഴ്‌ചയിലേക്ക് മാറി"
   },
   "3241696131593027453": {
      "message": "കുറിപ്പ് തിരഞ്ഞെടുക്കുക"
   },
   "3243916603465112517": {
      "message": "ചുരുക്കുക"
   },
   "3249966726137025950": {
      "message": "സഹകാരിയുടെ കുടുംബ ഗ്രൂപ്പ്"
   },
   "3250489229749307913": {
      "message": "ഇലക്‌ട്രോണിക് പ്രസിദ്ധീകരണം"
   },
   "3258100527833044153": {
      "message": "ശൂന്യമായ ഡ്രോയിംഗ് നിരസിച്ചു"
   },
   "3261131345401321392": {
      "message": "അഭിപ്രായമിടാനാകും"
   },
   "3266448715145955862": {
      "message": "കുറിപ്പുകളെ ആർക്കൈവുചെയ്‌തത് മാറ്റി, പിൻ ചെയ്‌തു"
   },
   "3268028083415317236": {
      "message": "വേണ്ട, നന്ദി"
   },
   "3272496516667407797": {
      "message": "വിശദാംശങ്ങൾ ലോഡുചെയ്യുന്നതിൽ ഒരു പ്രശ്‌നമുണ്ടായി."
   },
   "3278046126264096288": {
      "message": "ആഴ്‌ച"
   },
   "3281684668260174833": {
      "message": "{numberOfNotes,plural, =1{കുറിപ്പ് അൺപിൻ ചെയ്‌ത് ട്രാഷ് ചെയ്‌തു}other{# കുറിപ്പുകൾ അൺപിൻ ചെയ്‌ത് ട്രാഷ് ചെയ്‌തു}}"
   },
   "3288498486633948368": {
      "message": "Google ഡ്രൈവിൽ \"$1​\" എന്നത് ചേർത്തു."
   },
   "330603631583186798": {
      "message": "Word"
   },
   "3308935528045767909": {
      "message": "ഡ്രോയിംഗുള്ള പുതിയ കുറിപ്പ്"
   },
   "3312545971976531405": {
      "message": "സന്ദേശം"
   },
   "3326410145104517459": {
      "message": "ഏത് ഉപകരണത്തിൽ നിന്നും $1​ നിങ്ങളുടെ ആശയങ്ങൾ മനസ്സിലാക്കുക"
   },
   "3345567742278474807": {
      "message": "ഈ കുറിപ്പ് അനുചിതമെന്ന് ഫ്‌ലാഗു‌ചെ‌യ്‌തതിനാൽ പങ്കിടാനാകില്ല."
   },
   "3348057264663626000": {
      "message": "തിരഞ്ഞെടുക്കൽ മുകളിലേക്ക് നീക്കി."
   },
   "3354260708176476985": {
      "message": "ലോഡുചെയ്യുന്നു&hellip;"
   },
   "3362903141674317449": {
      "message": "സഹകാരി"
   },
   "336772567640975291": {
      "message": "അടുത്ത ആഴ്‌ച"
   },
   "3371033609268806242": {
      "message": "$1​ ലേബൽ ഇല്ലാതാക്കി."
   },
   "3381619429606029445": {
      "message": "Visio"
   },
   "3382236845597426718": {
      "message": "തുറക്കുക"
   },
   "3385831848537487538": {
      "message": "യാത്ര"
   },
   "3409257542937182842": {
      "message": "വീണ്ടും ശ്രമിക്കുന്നു..."
   },
   "3409483962000136213": {
      "message": "പ്ലേ ചെയ്യുക/താൽക്കാലികമായി നിർത്തുക"
   },
   "3418767079436101103": {
      "message": "ഈ പേജ് ലോഡുചെയ്യുന്നതിൽ ഒരു പ്രശ്‌നമുണ്ടായി."
   },
   "3419821606494999471": {
      "message": "കമന്റ് അറിയിപ്പുകൾ മാനേജുചെയ്യുക"
   },
   "3435089737264042207": {
      "message": "ഓണാക്കുക"
   },
   "3447704623213039325": {
      "message": "പലചരക്ക് ഇനം"
   },
   "3448234415275521882": {
      "message": "പൊതുവിവരം"
   },
   "3451851833460018584": {
      "message": "{NUM_COMMENTS,plural, =0{അഭിപ്രായങ്ങളൊന്നുമില്ല}=1{ ഒരു കമന്റ്}other{# കമന്റുകൾ}}"
   },
   "3455405209271884570": {
      "message": "എക്‌സ്ട്രാക്‌റ്റുചെയ്യുക"
   },
   "345585899501260401": {
      "message": "പിക്‌സലുകൾ"
   },
   "345718983715470367": {
      "message": "ഉറവിടം"
   },
   "3468441711253011521": {
      "message": "Google ഷീറ്റ്"
   },
   "3473620774713000513": {
      "message": "പരിഹരിച്ചു"
   },
   "3485469306694683931": {
      "message": "നിങ്ങളുടെ ഡ്രൈവ് അക്കൗണ്ടിലേക്ക് എക്‌സ്ട്രാക്‌റ്റുചെയ്യുക"
   },
   "3487924397596265480": {
      "message": "$1​ തിരഞ്ഞെടുത്തു."
   },
   "3488766808236147068": {
      "message": "$1​ ആണ് വർണ്ണം. കുറിപ്പിൽ ഇത് ബാധകമാക്കാൻ മറ്റൊരു വർണ്ണം തിരഞ്ഞെടുക്കുക."
   },
   "3496410038494993160": {
      "message": "പ്രചാരമേറിയ കീബോർഡ് കുറുക്കുവഴികൾ"
   },
   "3518073392823563581": {
      "message": "കീ‌ബോർഡ് കുറുക്കുവഴികൾ"
   },
   "3528739824697875943": {
      "message": "ലിസ്‌റ്റ് ഇനം"
   },
   "3549581437554274388": {
      "message": "തിരഞ്ഞെടുക്കൽ വലത്തേയ്ക്ക് നീക്കി."
   },
   "3551522853788442530": {
      "message": "മടങ്ങുക"
   },
   "3551608745198442336": {
      "message": "$1​/$2​ ഡ്രോയിംഗ്"
   },
   "3553997866738769437": {
      "message": "ഡ്രോയിംഗ് എഡിറ്റുചെയ്യുക"
   },
   "3555017093330694286": {
      "message": "ഇനിപ്പറയുന്നയാളിൽ നിന്ന് പങ്കിട്ടത്"
   },
   "3555297636767750285": {
      "message": "പച്ച"
   },
   "3561658662634401836": {
      "message": "ശീർഷകം"
   },
   "3569884090205828853": {
      "message": "OpenOffice കാൽക്"
   },
   "3570074492517305433": {
      "message": "സൈന്‍ അപ്പ് ചെയ്യുക"
   },
   "3571704286086017611": {
      "message": "ഓർമ്മപ്പെടുത്തൽ ഇല്ലാതാക്കി"
   },
   "3574963906259719128": {
      "message": "നിങ്ങളുടെ ബ്രൗസറിന് ഈ ഓഡിയോ ഫയൽ പ്ലേ ചെയ്യാനാവുന്നില്ല."
   },
   "3580293729117872545": {
      "message": "അവസാനിക്കുന്നത്"
   },
   "3595000514985906359": {
      "message": "Excel"
   },
   "3595562664731337243": {
      "message": "ലേബലിന്റെ പേര് മാറ്റുക"
   },
   "3603931013946597836": {
      "message": "{NUM_ITEMS,plural, =1{{NUM_PARENTS} ഫോൾഡറുകളിൽ ഉള്ള ഒരു ഫയൽ നിങ്ങൾ നീക്കുകയാണ്}other{{NUM_PARENTS} ഫോൾഡറുകളിൽ ഉള്ള ഫയലുകൾ നിങ്ങൾ നീക്കുകയാണ്}}"
   },
   "3608606849109645545": {
      "message": "പ്രമാണത്തിന് ഒരു പുതിയ പേര് നല്‍‌‌കുക:"
   },
   "3609912631958780352": {
      "message": "കാലിഗ്രഫി ടൂൾ"
   },
   "3611573349633408445": {
      "message": "ഡൗൺലോഡുചെയ്യുക"
   },
   "3612936866865912552": {
      "message": "ലോഡുചെയ്യുന്നു..."
   },
   "3617727970098875990": {
      "message": "എല്ലാ കുറുക്കുവഴികളും തിരയുക"
   },
   "362521762755836201": {
      "message": "$1​-ന് സൃഷ്‌ടിച്ചു"
   },
   "3634885664399305142": {
      "message": "ഡ്രോയിംഗ്‌ ലഭ്യമല്ല"
   },
   "3651893685901703652": {
      "message": "..."
   },
   "3657386785336906042": {
      "message": "ബാക്ക്സ്ലാഷ്"
   },
   "3659554681396757189": {
      "message": "ഞാന്‍ തുറന്നത്"
   },
   "366289214151975122": {
      "message": "$1​ എന്നതിലെ, ലിങ്കുള്ള ആർക്കും"
   },
   "3663571259791438207": {
      "message": "ദുരുപയോഗം റിപ്പോര്‍ട്ടുചെയ്യുക"
   },
   "3664842788764635265": {
      "message": "ഒന്നുമില്ല"
   },
   "3666123569747918021": {
      "message": "ഈ പ്രമാണത്തില്‍ സംരക്ഷിക്കാത്ത മാറ്റങ്ങള്‍ ഉണ്ട്. പേജില്‍ നിന്നും പുറത്തു പോകാനും നിങ്ങളുടെ മാറ്റങ്ങള്‍ നിരസിക്കാനും താല്‍‌‌‌‌‌പ്പര്യമുണ്ടോ?"
   },
   "3678477908297567934": {
      "message": "അടിവര"
   },
   "3690515530505404607": {
      "message": "ഈ വീഡിയോ പ്ലേ ചെയ്യുന്നതിൽ ഒരു പ്രശ്‌നമുണ്ടായി."
   },
   "369764661829607970": {
      "message": "{NUM_ITEMS,plural, =0{ഇനങ്ങളൊന്നുമില്ല}=1{ഒരു ഇനം}other{# ഇനങ്ങൾ}}"
   },
   "3707311099386068778": {
      "message": "എല്ലാം നീക്കം ചെയ്യുക"
   },
   "3712215972250917265": {
      "message": "അഭിപ്രായങ്ങൾ"
   },
   "3721649886572275931": {
      "message": "വലുപ്പം 8"
   },
   "372633345629975481": {
      "message": "കുറിപ്പുകൾ പിൻ ചെയ്‌തു"
   },
   "372823375470132483": {
      "message": "ട്രാഷ്‌ ചെയ്‌ത കുറിപ്പ് തിരഞ്ഞെടുത്തത് മാറ്റുക"
   },
   "3734444903221631913": {
      "message": "{NUM_ITEMS_1,plural, =0{ununsed plural form}=1{unusedpluralform}other{ടീം ഡ്രൈവുകളിൽ നിന്നും പങ്കിട്ട ഫോൾഡറുകളിൽ നിന്നും നിങ്ങൾ {NUM_ITEMS_2} ഇനങ്ങൾ നീക്കുകയാണ്, അതിനാൽ ആളുകൾക്ക് അവയിലേക്കുള്ള ആക്സസ് നഷ്ടപ്പെടും.}}"
   },
   "3751183760611784323": {
      "message": "സ്‌ക്രീനിന്റെ വീതിയ്ക്ക് അനുസൃതമായി ഇനം സൂം ചെയ്‌‌തു."
   },
   "3793086499925031123": {
      "message": "തിരയൽ ബാർ തുറക്കുക/ മുമ്പത്തേത് കണ്ടെത്തുക"
   },
   "3796511349428373407": {
      "message": "തീയതി ഓപ്‌ഷനുകൾ"
   },
   "37992665410817181": {
      "message": "വീണ്ടും-തുറന്നു"
   },
   "3801617971018550169": {
      "message": "ഇന്നലെ"
   },
   "381100310424863459": {
      "message": "Illustrator"
   },
   "3827179818223863356": {
      "message": "ഇളം പച്ച"
   },
   "3845302429676793049": {
      "message": "\"$1​\" എന്നതിന്റെ വിവരണം അപ്ഡേറ്റുചെയ്യുന്നതിൽ ഒരു പ്രശ്‌നമുണ്ടായി."
   },
   "3856960241878617076": {
      "message": "കമന്റുകൾ ലോഡ് ചെയ്യുന്നു, കാത്തിരിക്കുക"
   },
   "3858324058837632381": {
      "message": "ഈ ഓഡിയോ ഫയൽ പ്ലേ ചെയ്യുന്നതിൽ ഒരു പ്രശ്‌നമുണ്ടായി."
   },
   "3869166581651870488": {
      "message": "എഡിറ്റുചെയ്യൽ പൂർത്തിയാക്കുക"
   },
   "3874597373619381607": {
      "message": "പരിഹരിച്ച കമന്റുകൾ കാണിക്കുന്നു"
   },
   "3877974536163446728": {
      "message": "$1​, $2​ തിരഞ്ഞെടുത്തു"
   },
   "3888733084985311515": {
      "message": "കുടുംബ ഗ്രൂപ്പ് ലഭ്യമാണ്."
   },
   "3897281533382850749": {
      "message": "അൺമ്യൂട്ടുചെയ്യുക"
   },
   "3907816292084809686": {
      "message": "പ്രവർത്തനം വീണ്ടും ചെയ്‌തു"
   },
   "3909380459614154542": {
      "message": "ലിങ്കിലേക്ക് പോകുക"
   },
   "3930910469078167425": {
      "message": "ആർക്കൈവ്"
   },
   "3952341864324097024": {
      "message": "തിരയൽ മായ്‌ക്കുക"
   },
   "3955575370175991097": {
      "message": "$1​ ലേബൽ കാഴ്‌ചയിലേക്ക് മാറി"
   },
   "3974822583047850066": {
      "message": "റദ്ദാക്കുക"
   },
   "3977699855735576796": {
      "message": "കൂടുതൽ പേജുകൾ ലോഡുചെയ്യുന്നതിൽ ഒരു പ്രശ്‌നമുണ്ടായി."
   },
   "3981269900634596036": {
      "message": "{numberOfNotes,plural, =1{കുറിപ്പ് ഇല്ലാതാക്കുക}other{കുറിപ്പുകൾ ഇല്ലാതാക്കുക}}"
   },
   "3988418762222300024": {
      "message": "വിരാമം"
   },
   "4005725939358875643": {
      "message": "പ്രവർത്തനം പഴയപടിയാക്കി."
   },
   "4020393055976236243": {
      "message": "$1​ ഡൊമെയ്‌നിലേക്ക് $2​ ഡൊമെയ്‌നിലെ \"$3​\" ഡ്രൈവിൽ നിന്ന് ഉടമസ്ഥത കൈമാറും."
   },
   "4023299615382814997": {
      "message": "ട്രാഷിൽ എഡിറ്റുചെയ്യാനാകില്ല"
   },
   "4030906186910275934": {
      "message": "കാണുക"
   },
   "4036523543547629779": {
      "message": "ചിത്രങ്ങൾ"
   },
   "4044915502415235332": {
      "message": "പിൻ ചെയ്‌ത കുറിപ്പ് തിരഞ്ഞെടുക്കുക"
   },
   "4052960606031736645": {
      "message": "{NUM_ITEMS,plural, =1{{NUM_PARENTS} ഫോൾഡറുകളിൽ ഉള്ള ഒരു ഫോൾഡർ നിങ്ങൾ നീക്കുകയാണ്}other{{NUM_PARENTS} ഫോൾഡറുകളിൽ ഉള്ള ഫോൾഡറുകൾ നിങ്ങൾ നീക്കുകയാണ്}}"
   },
   "4061102590585232601": {
      "message": "$1​ എന്നയാളെ നീക്കംചെയ്തു"
   },
   "4064820890482961434": {
      "message": "ചെക്ക്‌ബോക്‌സുകൾ കാണിക്കുക"
   },
   "4072353527895477784": {
      "message": "ആളുകൾ"
   },
   "407982090576503781": {
      "message": "എന്റെ ഡ്രൈവിലേക്ക് നീക്കണോ?"
   },
   "4081524305222967804": {
      "message": "ടീൽ"
   },
   "4085493778209859942": {
      "message": "എന്തായാലും പ്ലേചെയ്യുക"
   },
   "4086409218932829944": {
      "message": "ലേബലുകൾ എഡിറ്റുചെയ്യുക"
   },
   "4087289538934418537": {
      "message": "ഇല്ലാതാക്കിക്കഴിഞ്ഞാൽ, നിങ്ങൾ സൃഷ്‌ടിച്ച കുറിപ്പുകൾ ആർക്കും കാണാനാവില്ല. ആക്‌സസ്സ് ഉള്ളവർക്ക്, നിങ്ങളുമായി പങ്കിട്ട കുറിപ്പുകൾ കാണാനാകും."
   },
   "4095714830819118951": {
      "message": "സഹായം"
   },
   "4097921967754832323": {
      "message": "ഹൈഫൻ"
   },
   "411137507354526852": {
      "message": "മാസം"
   },
   "4111452225725405610": {
      "message": "\"$1​\" എന്നതിൽ നിന്നും നക്ഷത്രചിഹ്നം നീക്കംചെയ്തു."
   },
   "4117632433281998979": {
      "message": "മാസം തോറും"
   },
   "4122858386674768321": {
      "message": "$3​$2​$1​ ഫോൾഡറിൽ നിന്ന് നീക്കുക"
   },
   "4155905925766040098": {
      "message": "പ്രിവ്യൂ ഒന്നും ലഭ്യമല്ല"
   },
   "4157091150222353401": {
      "message": "കമന്‍റുകൾ DOCX, PPTX, XLSX ഫയലുകളിലേക്ക് സംരക്ഷിക്കപ്പെടുകയും Microsoft Office-ൽ ദൃശ്യമാകുകയും ചെയ്യും"
   },
   "4174786386751618325": {
      "message": "ഫോട്ടോ കുറിപ്പ്"
   },
   "4182427157920112948": {
      "message": "ടിൽഡ്"
   },
   "4186465168527990324": {
      "message": "$2​ എന്നതിലേക്ക് \"$1​\" എക്‌സ്‌ട്രാക്‌റ്റുചെയ്‌തു"
   },
   "4204345954541079744": {
      "message": "ഈ ലേബലിൽ ഇതുവരെ കുറിപ്പുകളൊന്നുമില്ല"
   },
   "4206529410529166231": {
      "message": "{NUM_ITEMS,plural, =1{{NUM_PARENTS} ഫോൾഡറുകളിലെ ഒരു ഇനം നിങ്ങൾ നീക്കുന്നു}other{{NUM_PARENTS} ഫോൾഡറുകളിലെ ഇനങ്ങൾ നീക്കുന്നു}}"
   },
   "4209658291185545281": {
      "message": "പ്രവർത്തനം പഴയപടിയാക്കാനായില്ല"
   },
   "4211182812451835307": {
      "message": "എഡിറ്റുചെയ്യാനാകും"
   },
   "4214190403999219403": {
      "message": "സൂം ചെയ്യുക"
   },
   "4214427276033711472": {
      "message": "ക്രമീകരണം"
   },
   "4216242742234357612": {
      "message": "എല്ലാ കുറിപ്പുകളും തിരഞ്ഞെടുക്കുക"
   },
   "4216628828665009319": {
      "message": "പച്ച കലർന്ന മഞ്ഞ"
   },
   "4227767243455123953": {
      "message": "ലിസ്‌റ്റിന്റെ സ്വഭാവം"
   },
   "4228870062013120023": {
      "message": "അടുത്ത/മുമ്പത്തെ കുറിപ്പിലേക്ക് നാവിഗേറ്റുചെയ്യുക"
   },
   "4230101516585408149": {
      "message": "ഒരു പുതിയ കുറിപ്പ് രചിക്കുക"
   },
   "4239183034054216803": {
      "message": "തവിട്ടുനിറം"
   },
   "4243437721135025638": {
      "message": "ഈ ടീം ഡ്രൈവിലെ ഫയലുകൾ നീക്കാൻ നിങ്ങൾക്ക് അനുമതിയില്ല."
   },
   "4248787844477062707": {
      "message": "പുതിയ ലേബൽ സൃഷ്ടിക്കൂ"
   },
   "4267845092591696061": {
      "message": "തിരഞ്ഞെടുത്ത ഇനങ്ങൾക്ക് നക്ഷത്ര ചിഹ്നമിടുക/നക്ഷത്ര ചിഹ്നമിട്ടത് മാറ്റുക"
   },
   "4269096876505546324": {
      "message": "ഫീഡ്‌ബാക്ക് അയയ്‌ക്കുക"
   },
   "426927371216979233": {
      "message": "നിയമങ്ങള്‍‌"
   },
   "4280747719095153198": {
      "message": "അഭിപ്രായം തീർച്ചപ്പെടുത്തി"
   },
   "4286663890332754386": {
      "message": "അപ്‌ലോഡ് പരാജയപ്പെട്ടു."
   },
   "4293996570221590891": {
      "message": "വെളുപ്പ്"
   },
   "4296310694082659873": {
      "message": "ഇറേസർ ടൂൾ"
   },
   "4299690446455033653": {
      "message": "Works"
   },
   "4310202846681054741": {
      "message": "{numberOfPreviews,plural, =1{ലിങ്ക് പ്രിവ്യൂ നീക്കംചെയ്‌തു}other{# ലിങ്ക് പ്രിവ്യൂകൾ നീക്കംചെയ്‌തു}}"
   },
   "4318861667254318892": {
      "message": "Google വീഡിയോ"
   },
   "4320831042030778": {
      "message": "റദ്ദാക്കുക"
   },
   "4320942249997687388": {
      "message": "എൻഡ്"
   },
   "4321382260116636620": {
      "message": "കുറിപ്പ് തിരഞ്ഞെടുക്കുക"
   },
   "4332252081504252077": {
      "message": "ക്ഷമിക്കണം!"
   },
   "4343825450663233452": {
      "message": "കാണാനാകും"
   },
   "4343836986248234462": {
      "message": "ലിസ്‌റ്റ് ഇനം"
   },
   "4343848624651344174": {
      "message": "ഉച്ചതിരിഞ്ഞ്"
   },
   "435214284915110062": {
      "message": "തിരയൽ ബാർ തുറക്കുക"
   },
   "435444400175963053": {
      "message": "$2​ എന്നതിലേക്ക് $1​ ഇനങ്ങൾ നീക്കി."
   },
   "4356312843186491987": {
      "message": "നീക്കുക"
   },
   "4391715930031906467": {
      "message": "അടുത്തത് കണ്ടെത്തുക"
   },
   "4397482594800054550": {
      "message": "\"$1​\" എന്നതിന്റെ പേരുമാറ്റുന്നതിൽ ഒരു പ്രശ്‌നമുണ്ടായി."
   },
   "4412626362660239325": {
      "message": "ഡ്രൈവിൽ ഓർഗനൈസുചെയ്യുക"
   },
   "4421168692772991468": {
      "message": "ട്രാഷ്"
   },
   "4422985761498356257": {
      "message": "ഇത് ഉപയോഗിച്ച് തുറക്കുക"
   },
   "4429542915339609008": {
      "message": "ക്ഷമിക്കണം, ഈ ആപ്പ് ഉപയോഗിച്ച് ഒന്നിലധികം ഫയലുകൾ തുറക്കാനാകില്ല."
   },
   "4439831283519683004": {
      "message": "ചാരനിറം"
   },
   "4444571967705751871": {
      "message": "ട്രാഷ്"
   },
   "4448871104213529122": {
      "message": "വിശദാംശങ്ങൾ മറയ്‌ക്കുക‍‌"
   },
   "4457424709416639982": {
      "message": "എന്റെ ഡ്രൈവിലേക്ക് ചേർക്കുക"
   },
   "4462389610494427551": {
      "message": "സെന്റീമീറ്റർ"
   },
   "4466605492523079635": {
      "message": "സംരക്ഷിക്കുക"
   },
   "4486429060311743289": {
      "message": "തിരഞ്ഞെടുക്കൽ മായ്‌ക്കുക"
   },
   "4494250072784000771": {
      "message": "സ്റ്റൈലസ് കണ്ടെത്തി. ടച്ച് ഉപയോഗിച്ചുള്ള പാൻ പ്രവർത്തന‌ക്ഷമമാക്കി."
   },
   "45228242181482134": {
      "message": "പ്ലേ ചെയ്യുക"
   },
   "4524999513489942668": {
      "message": "ഒരേയൊരു ക്ലിക്കിലൂടെ നിങ്ങൾ സൂക്ഷിക്കാൻ താൽപ്പര്യപ്പെടുന്ന ഉള്ളടക്കം സംരക്ഷിക്കാൻ $2​Google Keep Chrome വിപുലീകരണം ഇൻസ്‌റ്റാളുചെയ്യുക$1​."
   },
   "4533605085334699862": {
      "message": "ഉദ്ധരണികൾ"
   },
   "4543077011795639870": {
      "message": "ഇനം ഡിഡന്റ് ചെയ്‌തു."
   },
   "4550209323331625907": {
      "message": "$2​കൂടുതലറിയുക$1​"
   },
   "4557086341175267918": {
      "message": "ഓഫ്‌ലൈനിൽ പങ്കിടാനാകില്ല"
   },
   "4558568516353053251": {
      "message": "ഈ ഫയൽ കാ‌ണുന്നവർക്ക് കമന്‍റുകളും നിർദ്ദേശങ്ങളും കാണാൻ കഴിയും."
   },
   "4561316395348814504": {
      "message": "ആപ്പ് ഡൗൺലോഡുകൾ"
   },
   "4564682305303579317": {
      "message": "തുടരുക"
   },
   "456512308416555173": {
      "message": "പുസ്‌തകങ്ങൾ"
   },
   "4566838580250578446": {
      "message": "{every,plural, =1{വർഷം തോറും ആവർത്തിക്കുന്നു}other{എല്ലാ # വർഷത്തിലും ആവർത്തിക്കുന്നു}}"
   },
   "4583714435275461910": {
      "message": "രക്ഷാകർതൃ ലിസ്‌റ്റ് ഇനം"
   },
   "4586373282767984140": {
      "message": "മഞ്ഞ"
   },
   "4595551195988564947": {
      "message": "Google അസിസ്‌റ്റന്റ് ഷോപ്പിംഗ് ലിസ്‌റ്റ് മാറ്റുന്നു."
   },
   "4607656353105320648": {
      "message": "{count,plural, =1{കുറിപ്പ് ശാശ്വതമായി ഇല്ലാതാക്കണോ?}other{കുറിപ്പുകൾ ശാശ്വതമായി ഇല്ലാതാക്കണോ?}}"
   },
   "4607802784047113873": {
      "message": "സഹകാരിയെ ചേര്‍ക്കുക"
   },
   "4608848277887462246": {
      "message": "കൂടുതൽ ഷീറ്റുകൾ"
   },
   "461126197624379601": {
      "message": "ഈ ഫയലിനെ കുറിച്ച് മറ്റുള്ളവരുമായി ചർച്ച ചെയ്യാൻ ഇവിടെ ടാപ്പുചെയ്യുക"
   },
   "4620034373159179678": {
      "message": "$1​ / $2​"
   },
   "4632830890362652221": {
      "message": "{NUM_ITEMS,plural, =1{ഒരു ഫോൾഡറിൽ ഉള്ള ഒരിനം നിങ്ങൾ നീക്കുകയാണ്}other{ഒരു ഫോൾഡറിൽ ഉള്ള ഇനങ്ങൾ നിങ്ങൾ നീക്കുകയാണ്}}"
   },
   "4634925432725098930": {
      "message": "പിക്‌സൽ"
   },
   "4643940860676429496": {
      "message": "സംരക്ഷിക്കുന്നു..."
   },
   "4675792829115971960": {
      "message": "ഞങ്ങൾ ഈ കുറിപ്പ് ഫ്ലാഗുചെയ്‌ത് നിങ്ങളുടെ അക്കൗണ്ടിൽ നിന്ന് അത് നീക്കംചെയ്യും."
   },
   "4685321580747790677": {
      "message": "{every,plural, =1{ആഴ്‌ച തോറും {days} ദിവസം ആവർത്തിക്കുന്നു}other{ഓരോ # ആഴ്‌ചയിലും {days} ദിവസം ആവർത്തിക്കുന്നു}}"
   },
   "4690120479780049536": {
      "message": "പോയിന്റ്"
   },
   "4691283408020124345": {
      "message": "ലിസ്റ്റ് കാഴ്‌ച"
   },
   "4697169479015785830": {
      "message": "കാലിഗ്രഫി ടൂൾ വർണ്ണവും വലുപ്പ സെലക്‌ടറും തുറക്കുക"
   },
   "4697673185436885400": {
      "message": "$1​ ബ്രൗസർ$2​ കീബോർഡ് കുറുക്കുവഴിയെ ഷീറ്റുകൾ അസാധുവാക്കിയിരിക്കുന്നു"
   },
   "4698144269846224816": {
      "message": "വലുപ്പം 1"
   },
   "4722167255291887189": {
      "message": "വലുപ്പം 2"
   },
   "4727507448375670209": {
      "message": "സഹകാരികൾ‍"
   },
   "4738612839683751348": {
      "message": "ഇനം കൂടുതൽ ഇൻഡന്റ് ചെയ്യാനാവില്ല."
   },
   "4740100782728373253": {
      "message": "ഡ്രൈവിൽ സംരക്ഷിക്കുക"
   },
   "4748046231232264180": {
      "message": "Google ഫോം"
   },
   "4751202914935960324": {
      "message": "ഈ ഇമെയിൽ ഇതിനകം നിലവിലുണ്ട്"
   },
   "4752655540567953719": {
      "message": "$1​ സ്ഥാനം"
   },
   "4762625944764691132": {
      "message": "പ്രധാന മെനു"
   },
   "47670360985205683": {
      "message": "\"$1​\" ($2​) എന്ന ഫയലിന്റെ വലുപ്പം Google-ന് സ്‌കാൻ ചെയ്യാൻ ‌കഴിയുന്നതിലും കൂടുതലാണ്. ഇത് നിങ്ങളുടെ കമ്പ്യൂട്ടർ കേടുവരുത്താനിടയുണ്ട്, അതിനാൽ അപകടസാധ്യത മനസിലാക്കിയെങ്കിൽ മാത്രം ഈ ഫയൽ പ്ലേചെയ്യുക."
   },
   "4767722428137216885": {
      "message": "റദ്ദാക്കുക"
   },
   "477328789314249432": {
      "message": "കുറിപ്പുകൾ തിരയുക"
   },
   "4773737319879079980": {
      "message": "ആപ്പ് ഉപയോഗിച്ച് കുറിപ്പുകൾ വേഗത്തിൽ എടുക്കുക"
   },
   "4775368111547931093": {
      "message": "വിവരണമൊന്നുമില്ല"
   },
   "4805047680716507619": {
      "message": " - ഇതിലേക്ക് നീക്കുക:"
   },
   "4806763987633034948": {
      "message": "PKCS7 സിഗ്‌നേച്ചർ"
   },
   "4807444103404336088": {
      "message": "\"$1​\" എന്നതിൽ നക്ഷത്രം ചേർക്കുന്നതിൽ ഒരു പ്രശ്‌നമുണ്ടായി."
   },
   "4821130290026382049": {
      "message": "പ്രചാരമേറിയ കീബോർഡ് കുറുക്കുവഴികൾ"
   },
   "4833214200453019325": {
      "message": "$1​ / $2​"
   },
   "4840513623749850224": {
      "message": "സിനിമകൾ"
   },
   "4847795993918486929": {
      "message": "ചിത്ര ടെക്‌സ്റ്റ് നേടാനായില്ല. പിന്നീട് വീണ്ടും ശ്രമിക്കുക."
   },
   "4853788427396558692": {
      "message": "$1​ MB"
   },
   "4858389278403807208": {
      "message": "ട്രാഷിലെ കുറിപ്പ്"
   },
   "4863652737159067460": {
      "message": "സൈൻ ഇൻ ചെയ്യുക"
   },
   "4864051612562026766": {
      "message": "{count,plural, =1{ഒന്ന് തിരഞ്ഞെടുത്തു}other{# എണ്ണം തിരഞ്ഞെടുത്തു}}"
   },
   "4878012031550736317": {
      "message": "{NUM_ITEMS,plural, =0{unused plural form}=1{\"{TEAM_DRIVE_NAME}\" ഡ്രൈവിന്റെ അംഗങ്ങൾ അല്ലാത്ത ആളുകൾക്ക് ഈ ഫയലിലേക്കുള്ള ആക്‌സസ് നഷ്‌ടമാവും.}other{\"{TEAM_DRIVE_NAME}\" ഡ്രൈവിന്റെ അംഗങ്ങൾ അല്ലാത്ത ആളുകൾക്ക് ഈ ഫയലുകളിലേക്കുള്ള ആക്‌സസ് നഷ്‌ടമാവും.}}"
   },
   "4888104357342241891": {
      "message": "റിമൈൻഡറുകൾ"
   },
   "490045476479394048": {
      "message": "കമന്റിടേണ്ട ടെക്‌സ്‌റ്റ് ഹൈലൈറ്റുചെയ്യുക"
   },
   "4901386320110714275": {
      "message": "പാസ്‌വേഡ് തെറ്റാണ്. വീണ്ടും ശ്രമിക്കുക."
   },
   "4906669330059413958": {
      "message": "പാസ്‌വേഡ് സമർപ്പിക്കുക"
   },
   "4907349694646937491": {
      "message": "$1​ സൂചികയിലേക്ക് കുറിപ്പ് നീക്കി"
   },
   "4915450884407029247": {
      "message": "$1​ ലേബൽ ചേർത്തു."
   },
   "4918998818369420588": {
      "message": "ദുരുപയോഗം റിപ്പോര്‍ട്ടുചെയ്യുക"
   },
   "4930422592340561418": {
      "message": "എന്റെ ഡ്രൈവ്"
   },
   "4948512233726694061": {
      "message": "$4​പേജ്$1​$5​$3​$1​$7​/$2​$6​$8​$1​"
   },
   "4955094356920130803": {
      "message": "ആംബർ"
   },
   "4957674814179289955": {
      "message": "അടുത്ത/മുമ്പത്തെ ലിസ്റ്റ് ഇനത്തിലേക്ക് നാവിഗേറ്റുചെയ്യുക"
   },
   "4963784280521435720": {
      "message": "സംരക്ഷിക്കുന്നു..."
   },
   "4974059227183970715": {
      "message": "'#' എന്ന് ടൈപ്പുചെയ്യുന്നതിലൂടെയും നിങ്ങൾക്ക് ലേബലുകൾ ചേർക്കാം."
   },
   "4982284738093713321": {
      "message": "ഓഗനൈസർ"
   },
   "4988132901627446385": {
      "message": "വിശദാംശ പാനൽ വിപുലീകരിച്ചു."
   },
   "5006765610090288212": {
      "message": "$1​ വർണ്ണം നൽകി"
   },
   "5008901799534614532": {
      "message": "ഇല്ലാതാക്കുക"
   },
   "5009448218905630614": {
      "message": "നീക്കംചെയ്യുക"
   },
   "5011858093760184160": {
      "message": "നക്ഷത്രചിഹ്നം നീക്കംചെയ്യുക"
   },
   "5013331898336483156": {
      "message": "ഒരു പുതിയ ഡൊമെയ്‌നിലെ എന്റെ ഡ്രൈവിലേക്ക് നീക്കണോ?"
   },
   "501475221876543407": {
      "message": "നിങ്ങൾ ചേർത്ത കുറിപ്പുകൾ ഇവിടെ ദൃശ്യമാകും"
   },
   "5023623739220371850": {
      "message": "പ്രാമാണീകരിക്കുന്നത് പരാജയപ്പെട്ടു. നിങ്ങൾ സൈൻ ഇൻ ചെയ്യുമ്പോൾ മാറ്റങ്ങൾ സമന്വയിപ്പിക്കപ്പെടും."
   },
   "5041572047197549869": {
      "message": "ഓരോ മാസത്തിലെയും ഒരേ ദിവസം"
   },
   "5045725997997672553": {
      "message": "{weekNumber,plural, =1{മാസത്തിലെ ആദ്യ {day} ദിവസത്തിൽ}=2{മാസത്തിലെ രണ്ടാമത്തെ {day} ദിവസത്തിൽ}=3{മാസത്തിലെ മൂന്നാമത്തെ {day} ദിവസത്തിൽ}=4{മാസത്തിലെ നാലാമത്തെ {day} ദിവസത്തിൽ}other{മാസത്തിലെ അവസാന {day} ദിവസത്തിൽ}}"
   },
   "5046219519278664288": {
      "message": "iPhone, iPad എന്നിവ"
   },
   "5046371569383796818": {
      "message": "നിലനിർത്തുക"
   },
   "5052461293250181960": {
      "message": "പേജ് താഴേക്ക്"
   },
   "5054818452036081005": {
      "message": "$2​സ്വകാര്യത$1​"
   },
   "5060107422621709815": {
      "message": "പുതുക്കാനായില്ല"
   },
   "5078184843381528205": {
      "message": "കുറിപ്പ് പിൻ ചെയ്യുക"
   },
   "5085332075590890665": {
      "message": "പഴയപടിയാക്കുക"
   },
   "5086862627563516607": {
      "message": "{NUM_ITEMS,plural, =0{ununsed plural form}=1{\"{TEAM_DRIVE_NAME}\" ഡ്രൈവിലെ അംഗങ്ങൾക്ക് ഈ ഇനത്തിലേക്ക് ആക്‌സസ് ലഭിക്കും.}other{\"{TEAM_DRIVE_NAME}\" ഡ്രൈവിലെ അംഗങ്ങൾക്ക് ഈ ഇനങ്ങളിലേക്ക് ആക്‌സസ് ലഭിക്കും.}}"
   },
   "5094400861508407603": {
      "message": "ബുള്ളറ്റ് നീക്കം ചെയ്‌തു"
   },
   "5095987896933771566": {
      "message": "പ്രമാണം പ്രിന്റുചെയ്യുക"
   },
   "509815948423424872": {
      "message": "നാവിഗേഷൻ"
   },
   "5098941979861776792": {
      "message": "എന്റർ"
   },
   "5121976648047240846": {
      "message": "ലേബൽ നീക്കംചെയ്യുക"
   },
   "5130903421326358933": {
      "message": "അറ്റാച്ചുമെന്റ് Google ഡ്രൈവിലേക്ക് സംരക്ഷിക്കുന്നതിൽ ഒരു പ്രശ്‌നമുണ്ടായി."
   },
   "5134649253619244584": {
      "message": "ലേബല്‍ ഇല്ലാതാക്കൂ"
   },
   "5140285776541296873": {
      "message": "ഇഷ്‌ടാനുസൃതം"
   },
   "5140450179685369890": {
      "message": "{NUM_ITEMS_1,plural, =0{unused plural form}=1{{NUM_ITEMS_2} ഫോൾഡർ {XXX_1} എന്നതിലേക്ക് നീക്കി.}other{{NUM_ITEMS_2} ഫോൾഡറുകൾ {XXX_2} എന്നതിലേക്ക് നീക്കി.}}"
   },
   "5151247077945318396": {
      "message": "എക്‌സ്‌ട്രാറ്റുചെയ്യേണ്ട ഒരു ഫോൾഡർ തിരഞ്ഞെടുക്കുമ്പോൾ പിശകുണ്ടായി."
   },
   "5159511879001144721": {
      "message": "തിളങ്ങുന്ന നീല നിറം"
   },
   "5167365673547406876": {
      "message": "{NUM_ITEMS,plural, =0{unused plural form}=1{\"{TEAM_DRIVE_NAME}\" ഡ്രൈവിന്റെ അംഗങ്ങൾ ആക്‌സസ് നേടും.}other{\"{TEAM_DRIVE_NAME}\" ഡ്രൈവിന്റെ അംഗങ്ങൾ ആക്‌സസ് നേടും.}}"
   },
   "5178674191443894176": {
      "message": "ലേബലുകൾ"
   },
   "5180454621500142444": {
      "message": "പുനഃസ്ഥാപിക്കുക"
   },
   "5180989337128758117": {
      "message": "ഇടത് ബ്രാക്കറ്റ്"
   },
   "5182569285908080938": {
      "message": "അവസാനിക്കുന്ന തീയതി ഓപ്‌ഷനുകൾ"
   },
   "5184692850089055965": {
      "message": "ചിത്ര ടെക്‌സ്‌റ്റ് നേടുക"
   },
   "5184785218378634051": {
      "message": "ഇനം ഇനി സൂം ചെയ്യില്ല."
   },
   "5197718200713913936": {
      "message": "C++"
   },
   "5201670213497642487": {
      "message": "വിശദാംശ പാനൽ ടാബ് ബാർ. ടാബുകൾക്കിടയിൽ മാറാൻ ഇടത്, വലത് അമ്പടയാള കീകൾ അമർത്തുക."
   },
   "5202835861850747976": {
      "message": "$2​കൂടുതലറിയുക$1​"
   },
   "5204391636475413312": {
      "message": "സംരക്ഷിക്കുക"
   },
   "5238284741118437734": {
      "message": "പഴയപടിയാക്കുക"
   },
   "5238307666527496111": {
      "message": "ശരി"
   },
   "5238371081785912565": {
      "message": "$1​ ഉപയോഗിച്ച് തുറക്കുക"
   },
   "5253765183290980485": {
      "message": "\"$1​\"എന്ന ഡ്രൈവിൽ ഇനങ്ങൾ ചേർക്കാനും എഡിറ്റുചെയ്യാനും മാത്രമേ നിങ്ങൾക്ക് അനുമതിയുള്ളൂ, അതിനാൽ നിങ്ങൾക്ക് ഈ പ്രവൃത്തി പഴയപടിയാക്കാനാവില്ല."
   },
   "5255388116256536182": {
      "message": "കമന്റ് ചെയ്യാൻ കളങ്ങൾ തിരഞ്ഞെടുക്കുന്നതിന് അമ്പടയാള കീകൾ ഉപയോഗിക്കുക. തിരഞ്ഞെടുക്കൽ വികസിപ്പിക്കാനായി അമ്പടയാള കീകൾ അമർത്തുമ്പോൾ Shift അമർത്തിപ്പിടിക്കുക. ഒരു കമന്റ് സൃഷ്‌ടിക്കാൻ Enter അമർത്തുക, അല്ലെങ്കിൽ റദ്ദാക്കാൻ എസ്‌കേപ്പ് ഉപയോഗിക്കുക."
   },
   "5259541708332520733": {
      "message": "ഉറവിടം നീക്കംചെയ്‌തു"
   },
   "5271615049826004958": {
      "message": "ലിങ്ക് പ്രിവ്യൂ ഓപ്‌ഷനുകൾ"
   },
   "5281121179861637423": {
      "message": "$1​ ആക്‌സസ്സ് ചെയ്യാൻ ഒരു പാസ്‌വേഡ് ആവശ്യമാണ്. പാസ്‌വേഡ് നൽകുക"
   },
   "5288037028604092288": {
      "message": "XPS"
   },
   "5299648222246616124": {
      "message": "ബാക്ക്‌ടിക്ക്"
   },
   "5300527252159851865": {
      "message": "ഉദ്ദേശിച്ച ഫയൽ ഫോർമാറ്റുമായി ഉള്ളടക്കം യോജിക്കുന്നില്ല."
   },
   "5320475549855398784": {
      "message": "നിങ്ങൾ ഓൺലൈനാകുമ്പോൾ, ഈ ഡ്രോയിംഗ് ലഭ്യമാകും."
   },
   "5321772883765574323": {
      "message": "\"$1​\" എന്നതിനെ $2​ എന്നതിൽ നിന്ന് $3​ എന്നതിലേക്ക് നീക്കി."
   },
   "5334959887390704534": {
      "message": "ഞങ്ങൾ ഈ ലേബൽ നീക്കംചെയ്‌തുകൊണ്ട് നിങ്ങളുടെ എല്ലാ Keep കുറിപ്പുകളിൽ നിന്നും അത് നീക്കംചെയ്യും. നിങ്ങളുടെ കുറിപ്പുകൾ ഇല്ലാതാക്കില്ല."
   },
   "5336801339221383042": {
      "message": "Javascript"
   },
   "5336924963122494935": {
      "message": "ഇത് തിരഞ്ഞെടുക്കുക"
   },
   "534191528712675978": {
      "message": "താൽക്കാലികമായി നിർത്തുക"
   },
   "534228323125524312": {
      "message": "സൂം ഔട്ട് ചെയ്യുക"
   },
   "5353129315502554762": {
      "message": "സ്റ്റൈൽ ഷീറ്റ്"
   },
   "5353173068672429342": {
      "message": "ഡീബഗ് ടൂളുകൾ"
   },
   "5362962746518601227": {
      "message": "{NUM_ITEMS,plural, =1{ഒരു ഫോൾഡറിൽ ഉള്ള ഒരു ഫയൽ നിങ്ങൾ നീക്കുകയാണ്}other{ഒരു ഫോൾഡറിൽ ഉള്ള ഫയലുകൾ നിങ്ങൾ നീക്കുകയാണ്}}"
   },
   "5363853533596749934": {
      "message": "ലേബലിന്റെ പേര് നൽകുക"
   },
   "5372143986724491245": {
      "message": "$1​ ദിവസം മുമ്പ്"
   },
   "5372160981898991853": {
      "message": "പബ്ലിഷർ"
   },
   "5385273191513151655": {
      "message": "ലഘുചിത്രം സൃഷ്‌ടിക്കുന്നു..."
   },
   "5392844646168201484": {
      "message": "വലുപ്പം 3"
   },
   "5394695048211047984": {
      "message": "ഒരു തീയതി ചേർക്കുക"
   },
   "5398036630337418486": {
      "message": "പ്രമാണം തുറക്കുക"
   },
   "5399553230649155346": {
      "message": "$1​ മണിക്കൂറിൽ"
   },
   "5403636185480096151": {
      "message": "ടിവി"
   },
   "540596856674438371": {
      "message": "പങ്കിടൽ ഓഫാക്കിയിരിക്കുന്നതിനാൽ പങ്കിടാനാവില്ല."
   },
   "5408091115193390231": {
      "message": "AutoCAD"
   },
   "5413225497191133249": {
      "message": "കുറിപ്പുകൾ പിൻ അല്ലെങ്കിൽ അൺപിൻ ചെയ്യുക"
   },
   "5423742603774911808": {
      "message": "ലി‌സ്റ്റ് വളരെ വലുതാണ്."
   },
   "5435749276779042277": {
      "message": "+ $1​ എണ്ണം കൂടി"
   },
   "5447119197363232006": {
      "message": "ഡ്രൈവിൽ കാണിക്കുക"
   },
   "5455566801812656827": {
      "message": "ചുരുക്കുക"
   },
   "5465081454525683943": {
      "message": "ഈ കുറിപ്പ് ഇനി നിങ്ങളുടെ അക്കൗണ്ടിൽ പങ്കിടില്ല. ആക്‌സസ്സിനായി ഉടമയോട് ചോദിക്കുക, അല്ലെങ്കിൽ അനുമതിയുള്ള ഒരു അക്കൗണ്ടിലേക്ക് മാറുക."
   },
   "5467649767578147801": {
      "message": "{NUM_ITEMS,plural, =0{unused plural form}=1{\"{TEAM_DRIVE_NAME}\" ഡ്രൈവിന്റെ അംഗങ്ങൾ അല്ലാത്ത അല്ലെങ്കിൽ {DOMAIN_NAME} ഡൊമെയ്‌നിന് പുറത്തുള്ള ആളുകൾക്ക് ഈ ഫയലിലേക്കുള്ള ആക്‌സസ് നഷ്‌ടമാവും.}other{\"{TEAM_DRIVE_NAME}\" ഡ്രൈവിന്റെ അംഗങ്ങൾ അല്ലാത്ത അല്ലെങ്കിൽ {DOMAIN_NAME} ഡൊമെയ്‌നിന് പുറത്തുള്ള ആളുകൾക്ക് ഈ ഫയലുകളിലേക്കുള്ള ആക്‌സസ് നഷ്‌ടമാവും.}}"
   },
   "5472312735475866917": {
      "message": "$1​ എന്നയാളുടെ അഭിപ്രായം."
   },
   "547865385964196102": {
      "message": "$1​ മിനിറ്റ് മുമ്പ്"
   },
   "5478662967017843220": {
      "message": "ഇരുണ്ട നീല"
   },
   "5480497191725157666": {
      "message": "Esc"
   },
   "5482604275203517054": {
      "message": "ഇടത് അമ്പടയാളം"
   },
   "5503885447744017882": {
      "message": "$2​ ഡൊമെയ്‌നിന് പുറത്തുള്ള $1​ എന്നതിലേക്ക് നീക്കണോ?"
   },
   "5506390497558702263": {
      "message": "{count,plural, =1{കുറിപ്പ് ആർക്കൈവുചെയ്‌തത് മാറ്റി, പിൻ ചെയ്‌തു}other{# കുറിപ്പുകളെ ആർക്കൈവുചെയ്‌തത് മാറ്റി, പിൻ ചെയ്‌തു}}"
   },
   "5520112019886360037": {
      "message": "അടയ്ക്കുക"
   },
   "5539958940810433464": {
      "message": "കുറിപ്പ് ട്രാഷുചെയ്യുക"
   },
   "5542817571710587822": {
      "message": "ഫയലിൽ നിരവധി ചിത്രങ്ങളുണ്ട്."
   },
   "5545146751578623220": {
      "message": "ക്യാപ്‌സ് ലോക്ക്"
   },
   "5555182241047709329": {
      "message": "ഒരു ലൊക്കേഷൻ തിരഞ്ഞെടുക്കൂ"
   },
   "5555599189512365009": {
      "message": "മനസ്സിലായി"
   },
   "556742419793425318": {
      "message": "നിരസിക്കുക"
   },
   "5581834527128285229": {
      "message": "എന്റെ ഡ്രൈവിൽ \"$1​\" ചേർക്കുന്നതിൽ ഒരു പ്രശ്‌നമുണ്ടായി."
   },
   "5598649706113950710": {
      "message": "എഡിറ്റർ"
   },
   "5627470193961862490": {
      "message": "വരാനിരിക്കുന്ന ഓർമ്മപ്പെടുത്തൽ ഉള്ള കുറിപ്പുകൾ ഇവിടെ ദൃശ്യമാകും"
   },
   "564165666160590723": {
      "message": "Windows Media Player"
   },
   "5657974964218523724": {
      "message": "ട്രാഷ് ശൂന്യമാക്കുക"
   },
   "566719933273904590": {
      "message": "ലേബലിലേക്ക് പോവുക"
   },
   "5670235154099791694": {
      "message": "ഇഞ്ച്"
   },
   "5672326933907786881": {
      "message": "ലോക്ക് സ്‌ക്രീൻ കുറിപ്പുകൾ സ്വമേധയാ Google Keep-ൽ സംരക്ഷിക്കും."
   },
   "5678095606167600931": {
      "message": "ബുള്ളറ്റ് ചേർത്തു"
   },
   "568072913338360182": {
      "message": "HTML"
   },
   "5707549724380589079": {
      "message": "ചെക്കുചെയ്‌ത ഇനങ്ങൾ ഇല്ലാതാക്കണോ?"
   },
   "5713014647314396479": {
      "message": "ഇതിനുശേഷം"
   },
   "5714240424645614611": {
      "message": "Android പാക്കേജ്"
   },
   "5714760273477184428": {
      "message": "കമന്റിടുന്നതിനുള്ള ഇടം അമ്പടയാളങ്ങൾ ഉപയോഗിച്ച് ഹൈലൈറ്റുചെയ്യുക, ശേഷം enter അമർത്തുക"
   },
   "5738003914096572768": {
      "message": "ഫയർ ചെയ്‌തു"
   },
   "5755541943799933389": {
      "message": "\"$1​\" എന്നതിലേക്ക് നക്ഷത്രചിഹ്നം ചേർത്തു."
   },
   "577619047319778196": {
      "message": "തിരഞ്ഞെടുക്കൽ മായ്‌ക്കുക"
   },
   "5801257863595278616": {
      "message": "തിരഞ്ഞെടുക്കൽ ഇടത്തേയ്ക്ക് നീക്കി."
   },
   "5820033033803019104": {
      "message": "ഓര്‍ഗനൈസുചെയ്യുക"
   },
   "5826302153453971149": {
      "message": "ഇളം പിങ്ക്"
   },
   "5840202488368071194": {
      "message": "ചിത്രമടങ്ങിയ പുതിയ കുറിപ്പ്"
   },
   "5840330517914556080": {
      "message": "സൂം ഔട്ട് ചെയ്യുക"
   },
   "5854158607727111728": {
      "message": "ടാബ്"
   },
   "585503297543253590": {
      "message": "ഈ തീയതിയിൽ"
   },
   "5870134033985574990": {
      "message": "എക്‌സ്‌ട്രാക്റ്റുചെയ്യുന്നു…"
   },
   "5871966496153339793": {
      "message": "$1​ എന്ന വീഡിയോയുടെ ലഘുചിത്രം പ്രദർശിപ്പിക്കുന്നു"
   },
   "5895666393386604578": {
      "message": "ഇന്‍ഡെന്റ് ചെയ്യാൻ, നിങ്ങളുടെ ലിസ്‌റ്റിൽ ഇനങ്ങൾ വലിച്ചിടുക അല്ലെങ്കിൽ കുറുക്കുവഴി $1​ ഉപയോഗിക്കുക."
   },
   "5909490544352162901": {
      "message": "ഈ കുറിപ്പിലേക്ക് ഉടമയോട് ആക്‌സസ്സ് ആവശ്യപ്പെടുക, അല്ലെങ്കിൽ അനുമതിയുള്ള ഒരു അക്കൗണ്ടിലേക്ക് മാറുക. നിങ്ങൾ $1​ ഇമെയിലിൽ സൈൻ ഇൻ ചെയ്‌തിരിക്കുന്നു."
   },
   "5911012384539794869": {
      "message": "എക്‌സ്‌ട്രാക്‌റ്റുചെയ്യാൻ ആരംഭിക്കുന്നത് പരാജയപ്പെട്ടു."
   },
   "591481266986424156": {
      "message": "$1​ ബ്രൗസർ നിലവിൽ $2​ എന്നതിന് ഈ കീബോർഡ് കുറുക്കുവഴി ഉപയോഗിക്കുന്നു"
   },
   "5916010927050975496": {
      "message": "$1​ KB"
   },
   "5917528552332886959": {
      "message": "പരിഹരിച്ച കമന്റുകൾ കാണിക്കുക"
   },
   "5947790263929501779": {
      "message": "ബുള്ളറ്റിലേക്ക് പരിവർത്തനം ചെയ്തു"
   },
   "5949528478488617689": {
      "message": "ഡൗൺലോഡുചെയ്യാനുള്ള അനുമതി"
   },
   "5950887255133612666": {
      "message": "ആരംഭിച്ചിട്ടില്ല."
   },
   "5954965790623966933": {
      "message": "രക്തവര്‍ണ്ണം"
   },
   "5961981688037913870": {
      "message": "$1​ ചേർത്തു"
   },
   "5965683144165568126": {
      "message": "ലിസ്‌റ്റ് ഇനം പുനക്രമീകരിക്കുക"
   },
   "5969696744752069015": {
      "message": "പ്രിവ്യൂ ഒന്നും ലഭ്യമല്ല."
   },
   "597927944425927829": {
      "message": "ഉടമസ്ഥത \"$1​\" ഡ്രൈവിൽ നിന്ന് നിങ്ങളിലേക്ക് കൈമാറും."
   },
   "5984398071085567332": {
      "message": "Google ഫ്യൂഷൻ പട്ടികകൾ"
   },
   "5987609488177213747": {
      "message": "ലേബല്‍ സൃഷ്ടിക്കുക"
   },
   "5989809255170931770": {
      "message": "{time,plural, =1{സെക്കൻഡിൽ Keep അപ്ഡേറ്റ് ചെയ്യും}other{# സെക്കൻഡിൽ Keep അപ്ഡേറ്റ് ചെയ്യും}}"
   },
   "6005084567691342649": {
      "message": "റിമൈൻഡറുകൾ"
   },
   "6009962986062136164": {
      "message": "$1​ ലോഡുചെയ്യുന്നു."
   },
   "6011637630664474614": {
      "message": "സ്‌പെ‌യ്‌സ്"
   },
   "6030537159236285525": {
      "message": "അടുത്ത/മുമ്പത്തെ സ്ഥാനത്തേക്ക് ലിസ്‌റ്റ് ഇനം നീക്കുക"
   },
   "60305871484579258": {
      "message": "Alt"
   },
   "6033916931543811803": {
      "message": "{NUM_ITEMS_1,plural, =0{unused plural form}=1{{NUM_ITEMS_2} ഫോൾഡർ, {XXX_1} എന്നതിൽ നിന്ന് {XXX_2} എന്നതിലേക്ക് നീക്കി.}other{{NUM_ITEMS_2} ഫോൾഡറുകൾ, {XXX_3} എന്നതിൽ നിന്ന് {XXX_4} എന്നതിലേക്ക് നീക്കി.}}"
   },
   "6043578784980337112": {
      "message": "$2​ എന്നതിലേക്ക് $1​ ഫയലുകൾ നീക്കി."
   },
   "6062216008944363143": {
      "message": "{weekNumber,plural, =1{ഓരോ {every} മാസത്തിലും, മാസത്തിലെ ആദ്യ {day} ദിവസത്തിൽ ആവർത്തിക്കുന്നു}=2{ഓരോ {every} മാസത്തിലും, മാസത്തിലെ രണ്ടാമത്തെ {day} ദിവസത്തിൽ ആവർത്തിക്കുന്നു}=3{ഓരോ {every} മാസത്തിലും, മാസത്തിലെ മൂന്നാമത്തെ {day} ദിവസത്തിൽ ആവർത്തിക്കുന്നു}=4{ഓരോ {every} മാസത്തിലും, മാസത്തിലെ നാലാമത്തെ {day} ദിവസത്തിൽ ആവർത്തിക്കുന്നു}other{ഓരോ {every} മാസത്തിലും, മാസത്തിലെ അവസാനത്തെ {day} ദിവസത്തിൽ ആവർത്തിക്കുന്നു}}"
   },
   "6069780031254134657": {
      "message": "പൂർത്തിയായെന്ന് അടയാളപ്പെടുത്തുക"
   },
   "6087078248621415351": {
      "message": "പരിഷ്‌ക്കരിച്ചത് $1​"
   },
   "6100883940579706314": {
      "message": "ലിങ്ക് പ്രിവ്യൂ"
   },
   "6105571474005679446": {
      "message": "പ്രിവ്യൂ കാണിക്കുന്നതിൽ ഒരു പ്രശ്‌നമുണ്ടായി."
   },
   "6113237889871930608": {
      "message": "ശൂന്യമായ കുറിപ്പ്"
   },
   "6118623991445349480": {
      "message": "പേജ് $1​"
   },
   "6122643025527543706": {
      "message": "Ctrl"
   },
   "6127325177382263770": {
      "message": "URLകൾ"
   },
   "6128550071219729739": {
      "message": "ചിത്രം ഇല്ലാതാക്കി"
   },
   "6131822680770571276": {
      "message": "PowerPoint"
   },
   "6140634664402328750": {
      "message": "അപ്ലിക്കേഷനുകളുടെ ലിസ്‌റ്റ്"
   },
   "6149175749937815029": {
      "message": "എല്ലാ ഇനങ്ങളും കാണുക"
   },
   "616807262818311711": {
      "message": "തരം"
   },
   "6185886893933834031": {
      "message": "തിരഞ്ഞെടുത്തവ സൂക്ഷിക്കുക"
   },
   "6186753450686672643": {
      "message": "{every,plural, =1{ദിവസവും ആവർത്തിക്കുന്നു}other{ഓരോ # ദിവസവും ആവർത്തിക്കുന്നു.}}"
   },
   "6201176165479907499": {
      "message": "{count,plural, =1{കുറിപ്പ് പിൻ ചെയ്‌തു}other{# കുറിപ്പുകൾ പിൻ ചെയ്‌തു}}"
   },
   "6203260615455347677": {
      "message": "നമ്പറുകൾ"
   },
   "6209117354086898503": {
      "message": "തിരികെ പോകുക"
   },
   "6211895332551673425": {
      "message": "$2​എന്റെ ഡ്രൈവിൽ$1​ ചേർത്തു"
   },
   "6212070333807533570": {
      "message": "$2​എന്റെ ഡ്രൈവിൽ$1​ ചേർക്കുന്നു..."
   },
   "6223207695466118454": {
      "message": "YouTube"
   },
   "6224687211096863620": {
      "message": "ആര്‍ക്കും"
   },
   "6252259197986158120": {
      "message": "ഇന്നലെ"
   },
   "6263940822259442857": {
      "message": "ചെക്ക്‌ബോക്‌സുകൾ മറയ്‌ക്കുക"
   },
   "628140343505892786": {
      "message": "ക്രമീകരണം"
   },
   "6286379137937560558": {
      "message": "ലേഖനം"
   },
   "6286806453721792102": {
      "message": "ഡ്രൈവിൽ ഓർഗനൈസുചെയ്യുക"
   },
   "6305748545202493254": {
      "message": "വിശദാംശങ്ങളുടെ പാൻ കാണിക്കുക/മറയ്‌ക്കുക"
   },
   "6306268376900894985": {
      "message": "{endDate} വരെ സംഭവിക്കുന്നു"
   },
   "6324768448533022780": {
      "message": "$1​ $2​"
   },
   "6336194821483049583": {
      "message": "ഡിഫോൾട്ട് നേറ്റീവ് ആപ്പ്"
   },
   "6347484050944915390": {
      "message": "അഭ്യർത്ഥന അയച്ചു. അംഗീകാരം ലഭിച്ചശേഷം നിങ്ങൾക്കൊരു ഇമെയിൽ ലഭിക്കും."
   },
   "6352952829934775705": {
      "message": "കൂടുതൽ"
   },
   "6366376928558090914": {
      "message": "ഭക്ഷണം"
   },
   "6375244206466599493": {
      "message": "വര്‍ഷം"
   },
   "6375395544374251820": {
      "message": "കൂടുതൽ പേജുകൾ ലോഡുചെയ്യുന്നതിൽ ഒരു പ്രശ്‌നമുണ്ടായി. വീണ്ടും ശ്രമിക്കുന്നു..."
   },
   "6377664889539934": {
      "message": "ടച്ച് ഉപയോഗിച്ച് വരയ്‌ക്കുക"
   },
   "6381941041429900831": {
      "message": "സഹകാരിയെ ചേര്‍ക്കുക"
   },
   "6386587519843563719": {
      "message": "ബൈനറി ഫയൽ"
   },
   "639451288140270562": {
      "message": "Google ഡോക്‌സിലേക്ക് പകർത്തി"
   },
   "6394816510866826521": {
      "message": "ഡോഗ്‌ഫുഡി"
   },
   "6413404795391222793": {
      "message": "പുതിയ ലിസ്റ്റ് രചിക്കുക"
   },
   "6416495701611778255": {
      "message": "നിർദ്ദേശിച്ചിരിക്കുന്ന മൂന്നാം-കക്ഷി അപ്ലിക്കേഷനുകൾ"
   },
   "6419411265907669340": {
      "message": "ഇന്ന്"
   },
   "6424277546995954045": {
      "message": "നിലവിലെ ബ്രൗസറിൽ കീബോർഡ് അസാധുവാക്കൽ ലഭ്യമല്ല.\nഈ ഫീച്ചർ പ്രവർത്തനക്ഷമമാക്കാൻ, Chrome, Firefox, IE/Edge, Safari എന്നിവയിലൊന്നിലേക്ക് മാറുക."
   },
   "6428000916830484004": {
      "message": "തവിട്ടുനിറം"
   },
   "6432019580434957057": {
      "message": "ഓഡിയോ"
   },
   "6443615802319581315": {
      "message": "{NUM_ITEMS,plural, =1{ഈ ഫയലിനെ, അതിന്റെ നിലവിലെ ഫോൾഡറുകളിൽ നിന്ന് നീക്കാൻ നിങ്ങൾക്ക് അനുമതിയില്ല. പകരം {START_SPAN_1}{NAME}{END_SPAN} എന്നതിലേക്ക് ഫയൽ ചേർക്കുക.}other{ഈ ഫയലുകളെ, അവയുടെ നിലവിലെ ഫോൾഡറുകളിൽ നിന്ന് നീക്കാൻ നിങ്ങൾക്ക് അനുമതിയില്ല. പകരം {START_SPAN_2}{NAME}{END_SPAN} എന്നതിലേക്ക് ഫയലുകൾ ചേർക്കുക.}}"
   },
   "6450508807204492448": {
      "message": "$1​ ഐക്കൺ"
   },
   "6457802200418354862": {
      "message": "കാഴ്‌ച്ചക്കാർക്ക് ഡൗൺലോഡുചെയ്യാനാകും"
   },
   "6459405233858728718": {
      "message": "Google സ്ലൈഡ്"
   },
   "6464761738227651511": {
      "message": "$1​ മിനിറ്റ് മുമ്പ്"
   },
   "6466736813846482957": {
      "message": "മുമ്പത്തെ"
   },
   "6466858417983764649": {
      "message": "സ്ഥലങ്ങൾക്കായും സമയങ്ങൾക്കായും കുറിപ്പുകളിൽ റിമൈൻഡറുകൾ സജ്ജീകരിക്കുക, വോയ്സ് കുറിപ്പുകൾ എടുക്കുക, ഓൺലൈനായോ ഓഫ്‌ലൈനായോ പ്രവർത്തിക്കുക."
   },
   "6472238195689960152": {
      "message": "വെളുപ്പ്"
   },
   "6473102097014191455": {
      "message": "ഡ്രോയിംഗുള്ള കുറിപ്പ്"
   },
   "6477306554098527424": {
      "message": "Google അസിസ്‌റ്റന്റ്"
   },
   "6480376252068839019": {
      "message": "ഗ്രിഡ് ഓപ്ഷനുകൾ തുറക്കുക"
   },
   "6496683100661104868": {
      "message": "$2​ഓപ്പൺ സോഴ്‌സ് ലൈസൻസുകൾ$1​"
   },
   "6497197865876438261": {
      "message": "സംഗീതം"
   },
   "6507257480072167483": {
      "message": "ലേബലിന്റെ പേര് $1​ എന്ന് മാറ്റി."
   },
   "6510131849363684615": {
      "message": "നാളെ"
   },
   "6513721414466645971": {
      "message": "നീക്കംചെയ്‌തു"
   },
   "6522917155620379865": {
      "message": "ഡൗൺലോഡുചെയ്യുക"
   },
   "6524849072392100692": {
      "message": "Google ഡ്രൈവ് ഫോൾഡർ"
   },
   "653160061888539741": {
      "message": "പുരോഗതി നിയന്ത്രണം"
   },
   "6571686604846453345": {
      "message": "ഈ ഇനം ഡ്രൈവിൽ ചേർക്കുന്നതിൽ ഒരു പ്രശ്‌നമുണ്ടായി."
   },
   "6578339688410021742": {
      "message": "\"$1​\"  ഡ്രൈവിന്റെ എല്ലാ അംഗങ്ങൾക്കും ഇനങ്ങൾ ആക്‌സസ് ചെയ്യാനാകും."
   },
   "6579707685908557993": {
      "message": "വൈകുന്നേരം"
   },
   "6582286158693833652": {
      "message": "കൂടുതലറിയുക"
   },
   "6588176324871799870": {
      "message": "Google Apps സ്‌ക്രിപ്റ്റ്"
   },
   "6618562607681757575": {
      "message": "ഒരു ഫോൾഡറിൽ നിന്നും നീക്കരുത്, $3​$2​$1​ എന്നതിലേക്ക് ചേർത്താൽ മാത്രം മതി"
   },
   "6622304228074863427": {
      "message": "അപ്ലിക്കേഷൻ"
   },
   "6627510416186113122": {
      "message": "ഇളം നീല"
   },
   "6650600936729710500": {
      "message": "മറുപടികൾ."
   },
   "6664835828596108553": {
      "message": "ഓപ്‌ഷൻ"
   },
   "670419277288558500": {
      "message": "വീഡിയോ/ഓഡിയോ"
   },
   "6707173584987026005": {
      "message": "ഇന്ന്"
   },
   "6710728478489145370": {
      "message": "അടയ്‌ക്കുക"
   },
   "6713235295664405475": {
      "message": "ഇതിൽ‍|ഇതിലേക്ക്"
   },
   "6715985122107380503": {
      "message": "റെക്കോർഡിംഗുകൾ"
   },
   "6726462693927865256": {
      "message": "വിശദാംശങ്ങൾ"
   },
   "6726879257388338969": {
      "message": "പ്രിന്റുചെയ്യുക"
   },
   "6732800471045353930": {
      "message": "പരമാവധി ആളുകളുമായി ഈ കുറിപ്പ് പങ്കിട്ടു."
   },
   "673551770550324419": {
      "message": "വീതിയ്‌ക്ക് അനുയോജ്യമാക്കുക"
   },
   "6747379635033535953": {
      "message": "ചുവടെ പുതിയ ഇനങ്ങൾ ചേർക്കുക"
   },
   "6747528043814108113": {
      "message": "$1​ എന്നതിലേക്ക് മാറി"
   },
   "6749829802551750923": {
      "message": "മുകളിലേയ്‌ക്കുള്ള അമ്പടയാളം"
   },
   "6750600017746655174": {
      "message": "ഓപ്‌ഷൻ"
   },
   "6750827506231593056": {
      "message": "അക്കൗണ്ടുകൾ മാറുക"
   },
   "6761622351199419182": {
      "message": "കുറിപ്പ് ആർക്കൈവുചെയ്‌തു"
   },
   "6773222938695237983": {
      "message": "{NUM_ITEMS,plural, =0{Unused}=1{ഈ ഇനം പങ്കിടണോ?}other{ഈ ഇനങ്ങൾ പങ്കിടണോ?}}"
   },
   "6778577079172085976": {
      "message": "പിൻ ചെയ്‌തവ"
   },
   "678660085936036852": {
      "message": "ചിത്രങ്ങൾ പ്രോസസ്സുചെയ്യുന്നു..."
   },
   "6787580031482277539": {
      "message": "ഒരിക്കലും"
   },
   "6797862596948579998": {
      "message": "Chrome ആപ്പ്"
   },
   "6798055902819777633": {
      "message": "ടച്ച് ഉപയോഗിച്ച് പാൻ ചെയ്യുക"
   },
   "6801348618370627980": {
      "message": "$1​ ലേബൽ സൃഷ്‌ടിച്ചു."
   },
   "6815042072535422726": {
      "message": "ഓഡിയോ ഇല്ലാതാക്കി"
   },
   "681598652078493281": {
      "message": "കൂടുതലറിയുക"
   },
   "6822520214440117457": {
      "message": "ഔദ്യോഗികം"
   },
   "6823109315717909214": {
      "message": "പരീക്ഷിക്കുക"
   },
   "6831650827360444197": {
      "message": "കുറിപ്പ് പങ്കിട്ടത് മാറ്റി."
   },
   "6833062695195555756": {
      "message": "ഇറേസർ ടൂൾ ഓപ്‌ഷനുകളുടെ മെനു തുറക്കുക"
   },
   "6833760103261954639": {
      "message": "ഈ പേജ് ലോഡുചെയ്യുന്നതിൽ ഒരു പ്രശ്‌നമുണ്ടായി. വീണ്ടും ശ്രമിക്കുന്നു..."
   },
   "6861978427131390279": {
      "message": "ഫീഡ്‌ബാക്ക് അയയ്‌ക്കുക"
   },
   "687402923448150707": {
      "message": "അൺചെക്ക് ചെയ്തു"
   },
   "689017442055275529": {
      "message": "$1​ എന്നയാളുടെ കുടുംബ ഗ്രൂപ്പ്"
   },
   "6891563484025164308": {
      "message": "മുമ്പത്തെ"
   },
   "6898823203505321799": {
      "message": "വിശദാംശങ്ങൾ"
   },
   "6904351530369058983": {
      "message": "ഉടമസ്ഥന്‍"
   },
   "691041991673354191": {
      "message": "എന്നെ നീക്കംചെയ്യുക"
   },
   "6918505531548047245": {
      "message": "ഹൈലൈറ്റർ ടൂൾ"
   },
   "6921237745237410511": {
      "message": "കമന്റ് ചേർക്കുക"
   },
   "6922953828399110511": {
      "message": "വ്യൂവറെ അടയ്‌ക്കുക"
   },
   "693770783324368110": {
      "message": "കുറിപ്പുകൾ അൺപിൻ ചെയ്‌ത് ട്രാഷ് ചെയ്‌തു"
   },
   "695253297035211081": {
      "message": "ട്രാഷ് ശൂന്യമാക്കുക"
   },
   "6980199665979997122": {
      "message": "പുനഃസ്ഥാപിക്കുക"
   },
   "6982682101118067511": {
      "message": "ഓർഗനൈസുചെയ്യുന്നു..."
   },
   "701276785305022936": {
      "message": "പ്രമാണം കറപ്‌റ്റാണ്. ഫയൽ ഏറ്റവും പുതിയ ഫോർമാറ്റിലാണെന്ന് ഉറപ്പാക്കുക."
   },
   "7017485862232001373": {
      "message": "\"$1​\" എന്നതിനെ $2​ എന്നതിൽ ചേർത്തു."
   },
   "7019002927048576918": {
      "message": "$1​ തിരയൽ ഫിൽട്ടറുകൾ"
   },
   "7030308038380934896": {
      "message": "Google ഡോക്‌സിലേക്ക് പകർത്താനായില്ല"
   },
   "7050021021988648361": {
      "message": "URL പകർത്തുക"
   },
   "7050898523853841537": {
      "message": "ഫ്രീക്വെൻസി ഓപ്‌ഷനുകൾ"
   },
   "7054631817922169541": {
      "message": "Google Keep-ല്‍ സംരക്ഷിക്കാത്ത മാറ്റങ്ങള്‍ ഉണ്ട്. പേജില്‍ നിന്നും പുറത്തു പോകാനും നിങ്ങളുടെ മാറ്റങ്ങള്‍ നിരസിക്കാനും താല്‍‌‌‌‌‌പ്പര്യമുണ്ടോ?"
   },
   "705714112650622350": {
      "message": "Google ഡ്രൈവിലേക്ക് ഇനം ചേർക്കുന്നതിൽ ഒരു പ്രശ്നമുണ്ടായി."
   },
   "7059437903473652416": {
      "message": "$1​ എന്ന YouTube വീഡിയോ പ്ലേചെയ്യുക"
   },
   "7065454163742312322": {
      "message": "കൂടുതൽ വർണ്ണങ്ങൾ"
   },
   "7066744251212631722": {
      "message": "മഞ്ഞകലർന്ന ‌പച്ച"
   },
   "7084324152376766809": {
      "message": "$1​ ദിവസം മുമ്പ്"
   },
   "7084991134824194740": {
      "message": "എന്നെ ഓർമ്മപ്പെടുത്തുക"
   },
   "7086801490719148597": {
      "message": "ഇത് തിരഞ്ഞെടുത്തത് മാറ്റുക"
   },
   "7094548885298700726": {
      "message": "ഇരുണ്ട തവിട്ടുനിറം"
   },
   "7120211249329066227": {
      "message": "നിങ്ങൾക്കൊരു അസിസ്‌റ്റന്റിനെ ലഭിച്ചു!"
   },
   "7121259585839664942": {
      "message": "റദ്ദാക്കുക"
   },
   "7126326627883991568": {
      "message": "നിലവിലെ ഡ്രോയിംഗ് ഇല്ലാതാക്കുക"
   },
   "7126535013613878060": {
      "message": "നിങ്ങളുടെ പ്രധാനപ്പെട്ട കുറിപ്പുകൾ മുകളിൽ പിൻ ചെയ്യുക."
   },
   "7135182401951359795": {
      "message": "നിങ്ങൾക്ക് ഉടമസ്ഥത കൈമാറും."
   },
   "7141983486405549971": {
      "message": "ചേർക്കുക"
   },
   "7145753028985071097": {
      "message": "കുറിപ്പ്‌ പുനഃക്രമീകരിക്കുന്നു"
   },
   "7146242673022399081": {
      "message": "വാചകസന്ദേശമയയ്‌ക്കുക"
   },
   "7148992630785407972": {
      "message": "ഈ ഫയൽ പാസ്‌വേഡ് പരിരക്ഷിതമായതിനാൽ പ്രിവ്യൂ കാണിക്കാനാവില്ല."
   },
   "7153847618034547771": {
      "message": "പ്രവർത്തനക്ഷമമാക്കുക"
   },
   "7161134329606048317": {
      "message": "അടയ്ക്കുക"
   },
   "7161718175684624843": {
      "message": "ലേബൽ നീക്കംചെയ്യുക"
   },
   "7164532930742017984": {
      "message": "ലിങ്കുള്ള ആര്‍ക്കും"
   },
   "7166989725427500881": {
      "message": "ട്രാഷ്‌ ചെയ്‌ത കുറിപ്പ് തിരഞ്ഞെടുക്കുക"
   },
   "7174189954350964804": {
      "message": "വീണ്ടും ശ്രമിക്കുക"
   },
   "7174908348310449675": {
      "message": "നിങ്ങളുടെ ഓർമ്മപ്പെടുത്തൽ ഡിഫോൾട്ടുകൾ ഇഷ്‌ടാനുസൃതമാക്കുക"
   },
   "7181961085183734135": {
      "message": "ഈ ഫയലിൽ പ്രിന്റുചെയ്യൽ പ്രവർത്തനരഹിതമാക്കിയിരിക്കുന്നു"
   },
   "7201188472754345797": {
      "message": "{NUM_ITEMS,plural, =0{unused plural form}=1{\"{DESTINATION_DOMAIN}\" ഡൊമെയ്‌നിന് പുറത്തുള്ള ആളുകൾക്ക് ഈ ഫയലിലേക്കുള്ള ആക്‌സസ് നഷ്‌ടമാവും.}other{\"{DESTINATION_DOMAIN}\" ഡൊമെയ്‌നിന് പുറത്തുള്ള ആളുകൾക്ക് ഈ ഫയലുകളിലേക്കുള്ള ആക്‌സസ് നഷ്‌ടമാവും.}}"
   },
   "7218693060378095915": {
      "message": "പുതിയത്"
   },
   "722264179594523168": {
      "message": "റദ്ദാക്കുക"
   },
   "7225445911355686176": {
      "message": "ആർക്കൈവുചെയ്‌ത കുറിപ്പ് തിരഞ്ഞെടുക്കുക"
   },
   "722702934847795304": {
      "message": "Project"
   },
   "7231231875581131930": {
      "message": "{NUM_ITEMS,plural, =0{Unused}=1{\"{TEAM_DRIVE_NAME}\" ഡ്രൈവിലേക്ക് ഈ ഇനം തിരികെ നീക്കാൻ കഴിയില്ല, അതിനാൽ നിങ്ങൾക്ക് ഈ നടപടി പഴയപടിയാക്കാനാവില്ല.}other{\"{TEAM_DRIVE_NAME}\" ഡ്രൈവിലേക്ക് ചുരുങ്ങിയത് ഒരിനം തിരികെ നീക്കാൻ കഴിയില്ല, അതിനാൽ നിങ്ങൾക്ക് ഈ നടപടി പഴയപടിയാക്കാനാവില്ല.}}"
   },
   "723223692006219983": {
      "message": "pt"
   },
   "7247530225058410142": {
      "message": "$2​ $1​"
   },
   "7247965266239591227": {
      "message": "\"$1​\" എക്‌സ്‌ട്രാക്‌റ്റുചെയ്യുമ്പോൾ ഒരു പിശകുണ്ടായി."
   },
   "7251490702980298031": {
      "message": "ഹൈലൈറ്റർ ടൂൾ വർണ്ണവും വലുപ്പ സെലക്‌ടറും തുറക്കുക"
   },
   "7265183966796883739": {
      "message": "പരിഹരിച്ച കമന്റുകൾ മറയ്‌ക്കുക"
   },
   "7278398674737413598": {
      "message": "ഡോക്യുമെന്റ് കണ്‍‌വേര്‍ട്ട് ചെയ്യാനാവില്ല."
   },
   "7278859550373246865": {
      "message": "{count,plural, =1{കുറിപ്പ് ആർക്കൈവുചെയ്‌തു}other{# കുറിപ്പുകൾ ആർക്കൈവുചെയ്‌തു}}"
   },
   "7290932540630116546": {
      "message": "റിമൈൻഡർ സജ്ജമാക്കി. $1​"
   },
   "7295254213841803546": {
      "message": "മാറ്റങ്ങൾ നിരസിക്കണോ? നിങ്ങളുടെ മാറ്റങ്ങൾ സംരക്ഷിക്കില്ല."
   },
   "7299749713933143099": {
      "message": "പര്‍‌പ്പിള്‍‌"
   },
   "7304355547638486270": {
      "message": "ഓഡിയോ ഡൗൺലോഡുചെയ്യുക ($1​)"
   },
   "7306962184871750459": {
      "message": "$1​ ഡൊമെയ്‌നിലെ \"$2​\" ഡ്രൈവിലേക്ക് $3​ ഡൊമെയ്‌നിലെ \"$4​\" ഡ്രൈവിൽ നിന്ന് ഉടമസ്ഥത കൈമാറും."
   },
   "7337660181466605745": {
      "message": "ഡ്രൈവിൽ \"$1​\" അപ്ഡേറ്റ് ചെയ്യാനായില്ല."
   },
   "7342923890755029722": {
      "message": "അടയ്ക്കുക"
   },
   "7344507440412470266": {
      "message": "തിരഞ്ഞെടുക്കൽ വികസിപ്പിച്ചു."
   },
   "734478884582426793": {
      "message": "കംപ്രസ്സുചെയ്‌ത ആർക്കൈവ്"
   },
   "7353547650196788656": {
      "message": "ചുവപ്പ്"
   },
   "7364571366369083618": {
      "message": "വീഡിയോ"
   },
   "7376703418960184879": {
      "message": "പകർത്തുക"
   },
   "7377239345926788722": {
      "message": "പ്രവര്‍ത്തനങ്ങള്‍"
   },
   "7382688299146249119": {
      "message": "ഇനം ഡൗൺലോഡുചെയ്യുക"
   },
   "7388342865555961406": {
      "message": "$1​ ദിവസത്തിനുള്ളിൽ"
   },
   "7393771571081973549": {
      "message": "C"
   },
   "7420117636241237177": {
      "message": "\"ഇമ്പോർട്ടുചെയ്യുക: $2​\" ലേബലിന് കീഴിലുള്ള നിങ്ങളുടെ മെയിൽ അക്കൗണ്ടിലേക്ക് $1​ എന്നതിൽ നിന്നുള്ള സന്ദേശങ്ങൾ എക്‌സ്‌ട്രാക്‌റ്റുചെയ്‌തു."
   },
   "7426603384368095928": {
      "message": "വീണ്ടും സൈൻ ഇൻ ചെയ്‌ത് പ്രവർത്തനം തുടരാൻ പേജ് വീണ്ടും ലോഡുചെയ്യുക."
   },
   "7427333772418801813": {
      "message": "+ $1​ കൂടുതൽ ബട്ടൺ വിപുലീകരിച്ചു"
   },
   "7429084719905985261": {
      "message": "ഒബ്‌ജക്റ്റീവ് C"
   },
   "7432956605646331928": {
      "message": "SQL"
   },
   "7440735091552109962": {
      "message": "$2​ (എഡിറ്റുചെയ്‌തത് $1​)"
   },
   "7441891675459021164": {
      "message": "ഡ്രൈവിൽ സംരക്ഷിക്കുന്നു"
   },
   "744753705925710199": {
      "message": "ക്ഷമിക്കണം, നിങ്ങൾ തുറക്കാൻ ശ്രമിക്കുന്ന എല്ലാ ഫയലുകൾക്കായും ഈ ആപ്പ് അംഗീകൃതമാക്കാൻ ഞങ്ങൾക്കായില്ല. വീണ്ടും ശ്രമിക്കുക."
   },
   "7452116603589558390": {
      "message": "പിൻ ചെയ്‌ത കുറിപ്പിന്റെ തിരഞ്ഞെടുപ്പ് മാറ്റുക"
   },
   "7453297286571818554": {
      "message": "Google ഡോക്‌സിലേക്ക് പകർത്തുക"
   },
   "7453307802804717178": {
      "message": "ഇളം നീല"
   },
   "7458942806393710991": {
      "message": "ആർക്കൈവുചെയ്‌ത കുറിപ്പ് തിരഞ്ഞെടുത്തത് മാറ്റുക"
   },
   "7464780237502381438": {
      "message": "കൂടുതൽ ആപ്പുകൾ കണക്‌റ്റ് ചെയ്യുക"
   },
   "7468842863971844562": {
      "message": "പുതിയ ലിസ്റ്റ്"
   },
   "7469895656894091562": {
      "message": "ഈ ഇമെയിൽ സാധുവായതല്ല"
   },
   "7482924911694634213": {
      "message": "{weekNumber,plural, =1{മാസംതോറും, മാസത്തിലെ ആദ്യ {day} ദിവസത്തിൽ ആവർത്തിക്കുന്നു}=2{മാസംതോറും, മാസത്തിലെ രണ്ടാമത്തെ {day} ദിവസത്തിൽ ആവർത്തിക്കുന്നു}=3{മാസംതോറും, മാസത്തിലെ മൂന്നാമത്തെ {day} ദിവസത്തിൽ ആവർത്തിക്കുന്നു}=4{മാസംതോറും, മാസത്തിലെ നാലാമത്തെ {day} ദിവസത്തിൽ ആവർത്തിക്കുന്നു}other{മാസംതോറും, മാസത്തിലെ അവസാന {day} ദിവസത്തിൽ ആവർത്തിക്കുന്നു.}}"
   },
   "7483088916037874359": {
      "message": "ഫയൽ വളരെ വലുതാണ്. "
   },
   "7488945223835574498": {
      "message": "പോസ്റ്റ്സ്‌ക്രിപ്റ്റ്"
   },
   "7503234138288940590": {
      "message": "തിരയുക"
   },
   "7507827375601925075": {
      "message": "അടുത്ത/മുമ്പത്തെ സ്ഥാനത്തേക്ക് കുറിപ്പ് നീക്കുക"
   },
   "7516769578943800930": {
      "message": "ചെക്ക് ചെയ്തു"
   },
   "7528204871156404767": {
      "message": "സഫാരി"
   },
   "7529683448345488779": {
      "message": "നൽകിയ പാസ്‍വേഡ് തെറ്റാണ്; മറ്റൊരു പാസ്‌വേഡ് നൽകുക."
   },
   "7530677128711603655": {
      "message": "\"$1​\" എന്നതിനുള്ള തിരയൽ ഫലങ്ങൾ"
   },
   "754367112212424716": {
      "message": "ഇന്ന് കുറച്ചുകഴിഞ്ഞ്"
   },
   "7564771400033548584": {
      "message": "{selectedCount,plural, =1{# തിരഞ്ഞെടുത്തു}other{# തിരഞ്ഞെടുത്തു}}"
   },
   "7565383798249439151": {
      "message": "$1​ ദിവസത്തിൽ"
   },
   "7579280421767578228": {
      "message": "മറ്റൊരു ദിവസത്തേക്കുള്ള ഓർമ്മപ്പ്ടുത്തൽ"
   },
   "7586291841734385643": {
      "message": "പോപ്പ്-ഔട്ട്"
   },
   "7587936635257676112": {
      "message": "$1​ എന്നയാളെ ചേർത്തു"
   },
   "7598582624136632660": {
      "message": "തിരയൽ ബാർ തുറക്കുക / അടുത്തത് കണ്ടെത്തുക"
   },
   "7598850438299201663": {
      "message": "\"$1​\" തുറക്കുന്നു..."
   },
   "7599358608613738069": {
      "message": "ഇല്ലാതാക്കുക"
   },
   "7604275940271852148": {
      "message": "നിങ്ങളുടെ മെയിൽ അക്കൗണ്ടിലേക്ക് എക്‌സ്ട്രാക്‌റ്റുചെയ്യുക"
   },
   "7604400308311739073": {
      "message": "പിൻ ചെയ്യുക"
   },
   "7610628906656867728": {
      "message": "ആര്‍ക്കൈവുചെയ്യുക"
   },
   "7610654194202731772": {
      "message": "ഇല്ലാതാക്കുക"
   },
   "7624042048123264803": {
      "message": "കുറിപ്പ് തുറക്കുക"
   },
   "7629685876277801112": {
      "message": "ഈ മാപ്‌സ് ഫയൽ പ്രദർശിപ്പിക്കുന്നതിൽ ഒരു പ്രശ്‌നമുണ്ടായി."
   },
   "7630723924002267143": {
      "message": "കീബോർഡ് കുറുക്കുവഴികൾ പ്രവർത്തനക്ഷമമാക്കി."
   },
   "7631302417932873160": {
      "message": "ഫയലിൽ വൈറസുണ്ടോയെന്ന് ‌സ്‌കാൻ ‌ചെയ്യാനായില്ല"
   },
   "7648759818896108920": {
      "message": "+$1​"
   },
   "7649506133540465463": {
      "message": "പ്രവർത്തനം പഴയപടിയാക്കാനായില്ല."
   },
   "7653702763016575386": {
      "message": "നീല"
   },
   "7656983816661099886": {
      "message": "ഉള്ളടക്കം"
   },
   "7659047104232758352": {
      "message": "അത്|ഇത്"
   },
   "7669677145513127809": {
      "message": "ടീം ഡ്രൈവുകൾക്കിടയിൽ നീക്കണോ?"
   },
   "7669846901402551021": {
      "message": "ഇന്ന്"
   },
   "7690349821507417537": {
      "message": "ലിസ്‌റ്റ് ഇനം നീക്കം ചെയ്‌തു, $1​"
   },
   "7690355160889785521": {
      "message": "പച്ച"
   },
   "7691521283331762131": {
      "message": "നിങ്ങളുടെ ആർക്കൈവുചെയ്‌ത കുറിപ്പുകൾ ഇവിടെ ദൃശ്യമാകും"
   },
   "7709557808259730054": {
      "message": "അംഗീകാരങ്ങൾ"
   },
   "7709889936233398701": {
      "message": "നീക്കംചെയ്യുക"
   },
   "7715735412192018288": {
      "message": "സഹായം"
   },
   "7715892737835649602": {
      "message": "'#' എന്ന് ടൈപ്പുചെയ്യുന്നതിലൂടെയും നിങ്ങൾക്ക് ലേബലുകൾ ചേർക്കാം."
   },
   "772000107335590599": {
      "message": "$1​ മിനിറ്റിനുള്ളിൽ"
   },
   "7724602581120994002": {
      "message": "ഓറഞ്ച്"
   },
   "7728066040934031356": {
      "message": "പര്‍‌പ്പിള്‍‌"
   },
   "7734578122414851725": {
      "message": "PHP"
   },
   "7735981667219692675": {
      "message": "{resultCount,plural, =1{# തിരയൽ ഫലം}other{# തിരയൽ ഫലങ്ങൾ}}"
   },
   "774390292128857049": {
      "message": "തിരയുക"
   },
   "7751981235297474273": {
      "message": "പഴയപടിയാക്കുക"
   },
   "7754093419850121316": {
      "message": "⌘"
   },
   "7757440777278143092": {
      "message": "ഇരുണ്ട ചാരനിറം"
   },
   "7772544658778579390": {
      "message": "പ്രമാണത്തിൽ കണ്ടെത്തുക"
   },
   "777546328624962090": {
      "message": "ഈ ഫയൽ അപ്‌ലോഡുചെയ്യാനാവില്ല. $2​MB-യിലും $3​ മെഗാപിക്‌സലിലും താഴെയുള്ള $1​ ഫയലുകൾ മാത്രമേ ഞങ്ങൾ അംഗീകരിക്കൂ."
   },
   "778181404304502404": {
      "message": "ഇനത്തിൽ നിന്ന് സൂം ഔട്ട് ചെയ്‌തു."
   },
   "7791050524692390574": {
      "message": "വർണ്ണങ്ങൾ"
   },
   "7800318069267901681": {
      "message": "പരിഷ്‌ക്കരിച്ചത്"
   },
   "7814778057875152792": {
      "message": "Google ഡ്രൈവിലെ തിരഞ്ഞെടുത്ത ഫോൾഡറിലേക്ക് അറ്റാച്ചുമെന്റ് നീക്കുമ്പോൾ ഒരു പ്രശ്‌നമുണ്ടായി."
   },
   "7821512290975371360": {
      "message": "ഇരുണ്ട പിങ്ക്"
   },
   "7828886646639771557": {
      "message": "ഒരു കുറിപ്പെടുക്കുക…"
   },
   "7830513726270865588": {
      "message": "കലണ്ടർ"
   },
   "7842164552344536314": {
      "message": "ഓർഗനൈസുചെയ്യുന്നു..."
   },
   "7844842290699524598": {
      "message": "ലേബൽ പരിധി എത്തി. പുതിയൊരണ്ണം ചേർക്കാൻ നിലവിലുള്ള ലേബൽ ഇല്ലാതാക്കുക."
   },
   "7845751753397906805": {
      "message": "വൈരുദ്ധ്യമുള്ള എഡിറ്റുകൾ കണ്ടെത്തി"
   },
   "785840448809859989": {
      "message": "സമയ ഓപ്‌ഷനുകൾ"
   },
   "7865240075542402013": {
      "message": "നക്ഷത്രം ചേർക്കുക"
   },
   "7868324478160174739": {
      "message": "നീല"
   },
   "7873060817438017568": {
      "message": "$2​ · $1​"
   },
   "7873698934773957560": {
      "message": "ഒന്നുമില്ല"
   },
   "787773550893657271": {
      "message": "മുമ്പത്തെ ഡ്രോയിംഗ് തുറന്നു"
   },
   "7888520165977111723": {
      "message": "ടീം ഡ്രൈവിലേക്ക് നീക്കണോ?"
   },
   "7895643887742936844": {
      "message": "അർദ്ധവിരാമം"
   },
   "7906726367011430855": {
      "message": "കണക്റ്റുചെയ്യുക"
   },
   "7910887984113996757": {
      "message": "പങ്കിടൽ ഓണാക്കുക"
   },
   "7922692430438844436": {
      "message": "എക്‌സ്ട്രാക്‌റ്റുചെയ്യുക"
   },
   "792315196550007047": {
      "message": "യോജിക്കുന്ന ഫലങ്ങളൊന്നുമില്ല."
   },
   "7943657844420237650": {
      "message": "OpenOffice ഇംപ്രസ്"
   },
   "7946114032014914338": {
      "message": "{repeatSentence}. {endSentence}"
   },
   "7947001788143789176": {
      "message": "ലോഡുചെയ്യുന്നു..."
   },
   "7959130747647079558": {
      "message": "{selectedCount,plural, =1{# കുറിപ്പ് തിരഞ്ഞെടുത്തു}other{# കുറിപ്പുകൾ തിരഞ്ഞെടുത്തു}}"
   },
   "7976461426527138085": {
      "message": "ലിസ്റ്റുകൾ"
   },
   "7988058806865329896": {
      "message": "തീയതിയും സമയവും തിരഞ്ഞെടുക്കുക"
   },
   "7991475666499751798": {
      "message": "റിമൈൻഡർ പൂർത്തിയാക്കിയതായി അടയാളപ്പെടുത്തുക"
   },
   "7996360883730444101": {
      "message": "ക്ഷമിക്കണം, ഈ ഫയൽ തുറക്കുമ്പോൾ ഒരു പിശക് സംഭവിച്ചു. വീണ്ടും ശ്രമിക്കുക."
   },
   "7998118521140187915": {
      "message": "പരിഹരിച്ച കമന്റുകൾ മറച്ചിരിക്കുന്നു"
   },
   "8003252582874834655": {
      "message": "ടീം ഡ്രൈവിലേക്ക് ഇനങ്ങൾ നീക്കുന്നത്, ആക്സസിനെയും ഉടമസ്ഥതയെയും മാറ്റുന്നു."
   },
   "8010075936095394680": {
      "message": "ഫയൽ പതിപ്പ് വളരെ പഴയതാണ്. ഫയൽ ഏറ്റവും പുതിയ ഫോർമാറ്റിലാണെന്ന് ഉറപ്പാക്കുക. "
   },
   "8011497727123874703": {
      "message": "$1​ ഫോൾഡർ ബട്ടൺ"
   },
   "8013687642711017862": {
      "message": "{NUM_ITEMS_1,plural, =0{ununsed plural form}=1{പങ്കിട്ട ഫോൾഡറുകളിൽ നിന്ന് നിങ്ങൾ ഒരു ഇനം നീക്കുകയാണ്, അതിനാൽ ആളുകൾക്ക് അതിലേക്കുള്ള ആക്സസ് നഷ്ടപ്പെടും.}other{പങ്കിട്ട ഫോൾഡറുകളിൽ നിന്ന് നിങ്ങൾ {NUM_ITEMS_2} ഇനങ്ങൾ നീക്കുകയാണ്, അതിനാൽ ആളുകൾക്ക് അതിലേക്കുള്ള ആക്സസ് നഷ്ടപ്പെടും.}}"
   },
   "8019402848412685977": {
      "message": "\"$2​\" എന്നത് \"$1​\" എന്നായി പേരുമാറ്റി."
   },
   "802668096552856965": {
      "message": "{checkedItemCount,plural, =1{# പൂർത്തിയായ ഇനം}other{# പൂർത്തിയായ ഇനങ്ങൾ}}"
   },
   "8043514121228710092": {
      "message": "ചിത്രം ചേർക്കുക"
   },
   "8044700199531805239": {
      "message": "$3​$1​$2​ കണക്‌റ്റുചെയ്തു."
   },
   "8046884224424523922": {
      "message": "{NUM_ITEMS_1,plural, =0{unused plural form}=1{{NUM_ITEMS_2} ഫയൽ, {XXX_1} എന്നതിൽ നിന്ന് {XXX_2} എന്നതിലേക്ക് നീക്കി.}other{{NUM_ITEMS_2} ഫയലുകൾ {XXX_3} എന്നതിൽ നിന്ന് {XXX_4} എന്നതിലേക്ക് നീക്കി.}}"
   },
   "8063817953234049242": {
      "message": "സെലക്ഷൻ ടൂൾ"
   },
   "8066398070826666542": {
      "message": "{count,plural, =1{+ # പൂർത്തിയായ ഇനം}other{+ # പൂർത്തിയായ ഇനങ്ങൾ}}"
   },
   "8069384932934428393": {
      "message": "$1​ മിനിറ്റിനുള്ളിൽ"
   },
   "807840433749698811": {
      "message": "സിയാൻ"
   },
   "8080583426915938264": {
      "message": "നിങ്ങളുടെ കമ്പ്യൂട്ടറിലെ അപ്ലിക്കേഷനുകൾ"
   },
   "8085493757603803516": {
      "message": "തിരഞ്ഞെടുക്കൽ എഡിറ്റുചെയ്യുക"
   },
   "8090743714060857028": {
      "message": "കാഴ്‌ച്ചക്കാർക്ക് ഡൗൺലോഡുചെയ്യാനാകില്ല"
   },
   "8095838445486198080": {
      "message": "{FILE_SIZE,plural, =0{0 ബൈറ്റുകൾ}=1{ഒരു ബൈറ്റ്}other{# ബൈറ്റുകൾ}}"
   },
   "8111632928339277375": {
      "message": "{NUM_FOLDERS,plural, =1{ഒരു ഫോൾഡറിൽ നിന്ന് നീക്കുക}=2{രണ്ട് ഫോൾഡറുകളിൽ നിന്നും നീക്കുക}other{എല്ലാ # ഫോൾഡറുകളിൽ നിന്നും നീക്കുക}}"
   },
   "8125425371755035523": {
      "message": "പഴയപടിയാക്കുക"
   },
   "8133866583554546341": {
      "message": "$1​, $2​"
   },
   "8135145577663029437": {
      "message": "രണ്ടും സൂക്ഷിക്കുക"
   },
   "8139785559888164453": {
      "message": "കൂടുതലറിയുക"
   },
   "8144512434938656483": {
      "message": "അല്ലെങ്കില്‍"
   },
   "8146560259680897627": {
      "message": "റദ്ദാക്കുക"
   },
   "8149439558305434788": {
      "message": "$1​, $2​"
   },
   "8159493406018222636": {
      "message": "ഫീഡ്ബാക്ക് അയയ്ക്കുക"
   },
   "8163781449224244510": {
      "message": "തിരഞ്ഞെടുക്കൽ പിൻവലിച്ചു."
   },
   "8174654098152723289": {
      "message": "എഡിറ്റ് വിവരണം"
   },
   "818217888086545352": {
      "message": "മഞ്ഞ"
   },
   "8189126656205301402": {
      "message": "Google ഡോക്‌സിലേക്ക് പകർത്തുക"
   },
   "8194941811853358224": {
      "message": "\"$1​\" എന്നതിൽ നിന്നും നക്ഷത്രം നീക്കംചെയ്യുന്നതിൽ ഒരു പ്രശ്‌നമുണ്ടായി."
   },
   "821942580510564685": {
      "message": "ഈ പ്രമാണം കാണാൻ അതിന്റെ പാസ്‌വേഡ് നൽകുക"
   },
   "8223878224920694193": {
      "message": "ഓരോ"
   },
   "8224193807932432983": {
      "message": "പ്രവർത്തനങ്ങൾ"
   },
   "8225614702924834215": {
      "message": "കൂടുതൽ ഓപ്‌ഷനുകൾ"
   },
   "8231449936104909428": {
      "message": "ഡ്രൈവിലെ തിരഞ്ഞെടുത്ത ഫോൾഡറിലേക്ക് \"$1​\" നീക്കുന്നതിൽ പ്രശ്‌നമുണ്ടായി."
   },
   "8233945959714786736": {
      "message": "മുമ്പത്തെ"
   },
   "8242655297101700529": {
      "message": "എന്റെ ഡ്രൈവ്"
   },
   "826433162451399549": {
      "message": "നാളെ"
   },
   "8273434617910595878": {
      "message": "താഴേയ്‌ക്കുള്ള അമ്പടയാളം"
   },
   "8281141013543828574": {
      "message": "അസംസ്‌കൃത ചിത്രം"
   },
   "8292708563843446267": {
      "message": "ഇനങ്ങൾ \"$1​\" ഡ്രൈവിന്റെ ഉടമസ്ഥതയിലായിരിക്കും."
   },
   "8304474373444239435": {
      "message": "$1​ എന്നയാളുടെ മറുപടി."
   },
   "8305505634689906340": {
      "message": "\"$1​\" എന്നതിൽ തിരയുക"
   },
   "8322416564157128458": {
      "message": "പങ്കിടുന്നവ"
   },
   "8332720954679654953": {
      "message": "ആപ്പ് ഡൗൺലോഡുകൾ"
   },
   "8337582740675387693": {
      "message": "Java"
   },
   "8342620486324515462": {
      "message": "നിരാകരിക്കുക"
   },
   "837692854094319105": {
      "message": "ഇനിപ്പറയുന്ന ഉപയോക്താക്കളുടെ ഡൊമെയ്‌നിലേക്കുള്ള പങ്കിടലിനെ അവരുടെ അഡ്‌മിൻ പ്രവർത്തനരഹിതമാക്കിയതിനാൽ അവരുമായി പങ്കിടാനാവില്ല."
   },
   "8379952094517631162": {
      "message": "ഇല്ല"
   },
   "8409190394690387796": {
      "message": "അഭിപ്രായം ചേർക്കുക"
   },
   "8412098268689886334": {
      "message": "ലയിപ്പിക്കുക"
   },
   "8412733496413412439": {
      "message": "ഓഫ്‌ലൈൻ"
   },
   "84334343973701810": {
      "message": "ഹോം"
   },
   "8452647597930138120": {
      "message": "കമന്റിടേണ്ട സെൽ ഹൈലൈറ്റുചെയ്യുക"
   },
   "8453627484113670693": {
      "message": "ഇളം ഓറഞ്ച്"
   },
   "8467894483369467251": {
      "message": "ഫ്ലാഷ്"
   },
   "8471029293590878384": {
      "message": "താൽക്കാലികമായി നിർത്തുക"
   },
   "8493378997610580289": {
      "message": "കൂടുതൽ കുറുക്കുവഴികൾ"
   },
   "8505989225387082493": {
      "message": "ലേബൽ ചേർക്കുക"
   },
   "8509270263487836281": {
      "message": "സൈൻ ഇൻ ചെയ്യുക"
   },
   "8517148045938431718": {
      "message": "പിശകുകൾ പരിഹരിക്കുക"
   },
   "8535303351837089357": {
      "message": "{modifierKey}+Z, {modifierKey}+Y എന്നീ കീകളുപയോഗിച്ച് നിങ്ങൾക്ക് മാറ്റങ്ങൾ പഴയപടിയാക്കാം, വീണ്ടും ചെയ്യാം."
   },
   "8562196940800756925": {
      "message": "മാർക്കർ ടൂൾ"
   },
   "8589423377647285975": {
      "message": "$1​ $2​ ലിസ്‌റ്റ് ഇനം $3​."
   },
   "8591848339430983053": {
      "message": "കുറിപ്പുകൾ"
   },
   "8595175575778060149": {
      "message": "കൂടുതൽ"
   },
   "8596279649507974639": {
      "message": "ഇവിടേക്ക് നീക്കുക"
   },
   "8602525917014156029": {
      "message": "സ്ഥലങ്ങള്‍"
   },
   "8616342546716995946": {
      "message": "മനസ്സിലായി"
   },
   "8621067185485606452": {
      "message": "ECMAScript"
   },
   "8621178077822096827": {
      "message": "ലിസ്‌റ്റ് ഇനം ചേർത്തു, $1​"
   },
   "8626694988569301667": {
      "message": "ഡ്രോയിംഗ്‌ ലഭ്യമല്ല"
   },
   "8637215430007224613": {
      "message": "അടുത്ത ഡ്രോയിംഗ് തുറന്നു"
   },
   "8646821180780920830": {
      "message": "ലേബലുകള്‍"
   },
   "8652657235429996594": {
      "message": "വേഗം"
   },
   "8660016472468563221": {
      "message": "കോളൻ"
   },
   "8663507590720636709": {
      "message": "$1​ എന്നിവയും, ഒപ്പം $2​ ഇനങ്ങളും"
   },
   "8663993454460982287": {
      "message": "ചെക്ക്‌ബോക്‌സുകൾ മറച്ചിരിക്കുന്നു"
   },
   "8674222789100049233": {
      "message": "അടയ്ക്കുക"
   },
   "86815590954366945": {
      "message": "ആർക്കൈവുചെയ്‌ത ഉള്ളടക്ക ലിസ്‌റ്റ്"
   },
   "8708723278154759600": {
      "message": "കുറിപ്പ് ആർക്കൈവുചെയ്‌തു"
   },
   "8726038895018570620": {
      "message": "ലിങ്കിലേക്ക് പോകുക"
   },
   "8734569874711220205": {
      "message": "നാവിഗേഷൻ മെനു"
   },
   "8738345098829705526": {
      "message": "വലുപ്പം 12"
   },
   "8742388056829916665": {
      "message": "റിച്ച് ലിങ്ക് പ്രിവ്യൂകൾ പ്രദർശിപ്പിക്കുക"
   },
   "8773943264600860531": {
      "message": "Internet Explorer"
   },
   "8775097441636640256": {
      "message": "$2​ - $1​"
   },
   "8781837301864053001": {
      "message": "റിച്ച് ടെക്‌സ്റ്റ്"
   },
   "8786673003584562680": {
      "message": "pg-up"
   },
   "8792038552136453044": {
      "message": "ക്ഷമിക്കണം! എന്തോ കുഴപ്പം സംഭവിച്ചു"
   },
   "8793166064242077041": {
      "message": "ഈ ചിത്രം പ്രദർശിപ്പിക്കുന്നതിൽ ഒരു പ്രശ്‌നമുണ്ടായി."
   },
   "8822326207328431952": {
      "message": "ചിത്രം അപ്‌ലോഡുചെയ്യൽ ലഭ്യമല്ല"
   },
   "8825353897919495748": {
      "message": "{NUM_ITEMS,plural, =0{ununsed plural form}=1{ഈ ഫയൽ നീക്കണമെന്ന് നിങ്ങൾക്ക് തീർച്ചയാണോ?}other{ഈ ഫയലുകൾ നീക്കണമെന്ന് നിങ്ങൾക്ക് തീർച്ചയാണോ?}}"
   },
   "8845176264121061589": {
      "message": "എല്ലാ ഇനങ്ങളും അൺചെക്ക് ചെയ്യുക"
   },
   "8851252390780816895": {
      "message": "ക്ലയന്റ് ലോഗ്"
   },
   "8852550049823214385": {
      "message": "തുടർന്ന്"
   },
   "8860658114732392347": {
      "message": "ഓർമ്മപ്പെടുത്തൽ ഇല്ലാതാക്കുക"
   },
   "8867634760949689122": {
      "message": "ഫയൽ പരിവർത്തനം ചെയ്യാനായില്ല: പരിവർത്തനം ചെയ്യാനുള്ള സമയം കഴിഞ്ഞു. പിന്നീട് വീണ്ടും ശ്രമിക്കുക."
   },
   "8868758864963683383": {
      "message": "കുറിപ്പ് തിരഞ്ഞെടുത്തത് മാറ്റുക"
   },
   "8869202143464930500": {
      "message": "$1​ ഡ്രൈവിലേക്ക് ഉടമസ്ഥത കൈമാറണോ?"
   },
   "887001400549949730": {
      "message": "പുതിയ വിൻഡോയിൽ തുറക്കുക"
   },
   "888015650266122140": {
      "message": "സംഭവങ്ങൾ"
   },
   "8889019648958415451": {
      "message": "അജ്ഞാത ഫയൽ"
   },
   "8917554093651202032": {
      "message": "$1​ പ്ലേ ചെയ്യുക"
   },
   "8919660666733306860": {
      "message": "ചിത്രം"
   },
   "8923591894816841670": {
      "message": "തിരഞ്ഞെടുക്കൽ താഴേക്ക് നീക്കി."
   },
   "8925842014466254066": {
      "message": "Google ഡോക്‌സിലേക്ക് പകർത്തുന്നു"
   },
   "8930959387403789939": {
      "message": "ഓർമ്മപ്പെടുത്തൽ"
   },
   "8931267220766224111": {
      "message": "Google Keep ഓർമ്മപ്പെടുത്തലുകൾ ഓണാക്കണോ? നിങ്ങൾക്ക് ബ്രൗസർ അറിയിപ്പുകൾ അനുവദിക്കേണ്ടതായി വരാം."
   },
   "8938626240031421092": {
      "message": "ചെക്ക്‌ബോക്‌സുകൾ ടോഗിൾ ചെയ്യുക"
   },
   "8943760679396635042": {
      "message": "$1​ പ്രദർശിപ്പിക്കുന്നു."
   },
   "8953555255469284376": {
      "message": "ചിത്രങ്ങൾ ഇവിടെ ഇടുക"
   },
   "8962132866274125834": {
      "message": "വീണ്ടും ചെയ്യുക"
   },
   "896590342186332268": {
      "message": "വലുപ്പം 16"
   },
   "8975305711699693093": {
      "message": "കമന്റ് കോളം മറയ്ക്കുക"
   },
   "8978442832029227748": {
      "message": "Google Jamboard"
   },
   "8979104019474011578": {
      "message": "{every,plural, =1{ആഴ്‌ച‌തോറും ആവർത്തിക്കുന്നു}other{ഓരോ # ആഴ്‌ചയിലും ആവർത്തിക്കുന്നു}}"
   },
   "8979615310931291676": {
      "message": "എഡിറ്റുചെയ്‌തത് $1​"
   },
   "8988925599985431446": {
      "message": "കൂട്ടിച്ചേർക്കാതിരിക്കുക"
   },
   "900086393693234779": {
      "message": "ഹോം"
   },
   "9003585743562048321": {
      "message": "നെറ്റ്‌വർക്ക് പിശക് കാരണം കമന്റുകൾ സമന്വയിപ്പിക്കാനായില്ല."
   },
   "9012753183662045049": {
      "message": "ഒരു ഹ്രസ്വമായ ലേബൽ പേര് നൽകുക"
   },
   "9021945828354340363": {
      "message": "{count,plural, =1{ഈ കുറിപ്പ് ഇനി നിങ്ങളുമായി പങ്കിടില്ല.}other{ഈ കുറിപ്പുകൾ ഇനി നിങ്ങളുമായി പങ്കിടില്ല.}}"
   },
   "9024023699330078373": {
      "message": "ഈ ഇനം തുറക്കുന്നതിന് മുമ്പ് അത് നിങ്ങളുടെ ഡ്രൈവിൽ ചേർക്കും"
   },
   "9058308423774656474": {
      "message": "Hangul Word Processor"
   },
   "9063863448028905602": {
      "message": "ഫലങ്ങളിൽ നിന്ന് നീക്കംചെയ്യുക"
   },
   "9072994494820207560": {
      "message": "ചെക്കുചെയ്‌ത ഇനം"
   },
   "9083935734710258396": {
      "message": "നിരസിക്കുക"
   },
   "9094248058931620597": {
      "message": "വിശദാംശ പാനൽ ചുരുക്കി."
   },
   "911586799466052745": {
      "message": "OpenOffice ഡ്രോ"
   },
   "911698676339750373": {
      "message": "കുടുംബ ഗ്രൂപ്പ്"
   },
   "9121915169985572840": {
      "message": "വർണ്ണം മാറ്റുക"
   },
   "9124422680181020503": {
      "message": "ഡ്രോയിംഗ് ഇല്ലാതാക്കി"
   },
   "9131268871618792263": {
      "message": "{NUM_ITEMS,plural, =0{ununsed plural form}=1{unusedpluralform}other{ടീം ഡ്രൈവുകളിലെ അംഗങ്ങളുമായി ഈ ഇനങ്ങൾ പങ്കിടുന്നില്ലെങ്കിൽ അവർക്ക് ആക്‌സസ്‌ നഷ്‌ടപ്പെടും.}}"
   },
   "9149141099919589043": {
      "message": "കോമയാൽ വേർതിരിച്ച മൂല്യങ്ങൾ"
   },
   "9155213204821633067": {
      "message": "$1​ തിരഞ്ഞെടുത്തത് മാറ്റി."
   },
   "9180910903828232576": {
      "message": "{NUM_ITEMS_1,plural, =0{unused plural form}=1{{NUM_ITEMS_2} ഫോൾഡർ {XXX_1} എന്നതിലേക്ക് ചേർത്തു.}other{{NUM_ITEMS_2} ഫോൾഡറുകൾ {XXX_2} എന്നതിലേക്ക് ചേർത്തു.}}"
   },
   "9197837492705576727": {
      "message": "അടുത്ത ഇനത്തിലേക്ക് പോകുക"
   },
   "919969969251998566": {
      "message": "നിങ്ങളുടെ മെയിൽ അക്കൗണ്ടിലേക്ക് ഈ ആർക്കൈവ് എക്‌സ്‌ട്രാക്‌റ്റുചെയ്യുക."
   },
   "9203454763088526300": {
      "message": "ടെക്‌സ്റ്റ് തിരിച്ചറിയാനായില്ല."
   },
   "9208632284144316801": {
      "message": "ആവർത്തിക്കുക"
   },
   "9213031420087755232": {
      "message": "പേജ് മായ്‌ക്കുക"
   },
   "9220412150349575379": {
      "message": "ഇഞ്ച്"
   },
   "938074023403688885": {
      "message": "നീക്കംചെയ്യുക"
   },
   "951963820437151566": {
      "message": "Google സൈറ്റുകൾ"
   },
   "960732173870658714": {
      "message": "Google Keep പ്രമാണം"
   },
   "969509857504028202": {
      "message": "ടീം ഡ്രൈവിൽ നിന്ന് ഫയലുകൾ നീക്കുന്നത്, ആക്സസിനെയും ഉടമസ്ഥതയെയും മാറ്റുന്നു."
   },
   "976103457024703736": {
      "message": "\"$1​\" തുറക്കാനായില്ല."
   },
   "985197728509875956": {
      "message": "കെമിക്കൽ മോഡൽ"
   },
   "991852286447868510": {
      "message": "$1​ എന്നതിനായി തിരയുന്നു"
   },
   "99635082918315028": {
      "message": "ചിത്രത്തിൽ നിന്ന് ടെക്‌സ്‌റ്റ് നേടി"
   },
   "996381410993745580": {
      "message": "Photoshop"
   },
   "996406443443155276": {
      "message": "\"$1​\" തുറക്കാനായില്ല."
   },
   "appDesc": {
      "description": "App description",
      "message": "നിങ്ങളുടെ മനസ്സിലുള്ളത് വേഗത്തിൽ മനസ്സിലാക്കുകയും സുഹൃത്തുക്കളുമായും കുടുംബാംഗങ്ങളുമായും ആ ചിന്തകൾ പങ്കിടുകയും ചെയ്യുക."
   },
   "appName": {
      "description": "App name",
      "message": "Google Keep - കുറിപ്പുകളും ലിസ്‌റ്റുകളും"
   },
   "shortName": {
      "description": "App short name",
      "message": "Google Keep"
   }
}
