{
   "add": {
      "message": "Voeg by"
   },
   "cancel": {
      "message": "Kanselleer"
   },
   "continue": {
      "message": "Gaan voort"
   },
   "description": {
      "description": "Note: this cannot be longer than 132 characters",
      "message": "With over 500 million downloads, Adblock Plus is one of the world's most popular ad blockers."
   },
   "filters_subscription_lastDownload_connectionError": {
      "message": "Misluk, aflaai nie voltooi"
   },
   "name": {
      "message": "Adblock Plus"
   },
   "options_customFilter_cancel": {
      "message": "Kanselleer"
   },
   "options_filterList_lastDownload_connectionError": {
      "message": "Misluk, aflaai nie voltooi"
   },
   "options_filterList_lastDownload_invalidURL": {
      "message": "Misluk, nie 'n geldige adres"
   },
   "options_short": {
      "message": "Opsies"
   },
   "overlay_notification_button_no": {
      "message": "Nee"
   },
   "overlay_notification_button_yes": {
      "message": "Ja"
   },
   "sendReport": {
      "message": "Rapporteer probleem op hierdie blad"
   }
}
