{
   "1001407065815272462": {
      "message": "$2​میری ڈرائیو$1​ میں شامل کرنے سے قاصر ہے"
   },
   "1013939682284715002": {
      "message": "منظم کریں"
   },
   "1029576232144989689": {
      "message": "‏آپ $2​Google Keep Chrome ایکسٹینشن$1​ کے ساتھ لنکس بعد کیلئے بھی محفوظ کر سکتے ہیں۔"
   },
   "1039394921418415681": {
      "message": "سائن ان کریں"
   },
   "1040405721361467195": {
      "message": "‏تبصرہ کرنے کی خاطر الفاظ کا انتخاب کرنے کیلئے تیر والی کلیدیں استعمال کریں۔ انتخاب کو پھیلانے کیلئے تیر والی کلیدوں کو دبائے رکھ کر شفٹ کو پکڑے رکھیں۔ ایک تبصرہ تیار کرنے کیلئے Enter یا منسوخ کرنے کیلئے Escape استعمال کریں۔"
   },
   "1061011362310586469": {
      "message": "اشتراک کر رہے ہیں"
   },
   "1083918249169198626": {
      "message": "کی بورڈ شارٹ کٹس غیر فعال ہیں۔"
   },
   "1101371910696766077": {
      "message": "ایک کاپی بنائیں"
   },
   "1105774658609209931": {
      "message": "‏Chrome ایکسٹینشن"
   },
   "1122146167985532789": {
      "message": "گزشتہ کل"
   },
   "1127320433256851404": {
      "message": "ویڈیو پلیئر"
   },
   "1131044617724567645": {
      "message": "‏PDFs پر کیے گئے تبصرے فائلوں میں محفوظ اور دیگر ایپس میں مرئی ہوتے ہیں"
   },
   "1137446830169628669": {
      "message": "آئٹم کی حاشیہ بندی کی گئی۔"
   },
   "1158660505977623040": {
      "message": "ہمیشہ کے لیے حذف کریں"
   },
   "1162642135048988280": {
      "message": "دستاویز کا نام تبدیل کریں"
   },
   "1163324543881570799": {
      "message": "Google Docs"
   },
   "1166244120191806795": {
      "message": "تاثرات فراہم کریں"
   },
   "1177768120450365955": {
      "message": "چیک کردہ آئٹمز کو سب سے نیچے منتقل کریں"
   },
   "1179891706526242218": {
      "message": "آگے"
   },
   "1185164838496022543": {
      "message": "صفحہ دوبارہ لوڈ کرنے کیلئے براہ کرم یہاں کلک کریں۔"
   },
   "1213005208968286932": {
      "message": "حل شدہ کے بطور نشان زد"
   },
   "124010372300613445": {
      "message": "{numNotes,plural, =1{غیر آرکائیور کردہ نوٹ تخلیق ہو گیا}other{# غیر آرکائیور کردہ نوٹس تخلیق ہو گئے}}"
   },
   "124900027451629830": {
      "message": "چلائیں"
   },
   "125608713654167241": {
      "message": "نیلگوں سبز"
   },
   "1256362146573583104": {
      "message": "کھولیں"
   },
   "1259492729704800881": {
      "message": "نوٹ آرکائیو کریں"
   },
   "1263685395252160366": {
      "message": "LaTeX"
   },
   "1271038294394884640": {
      "message": "منسوخ کریں"
   },
   "12768758038718216": {
      "message": "آرکائیو کردہ نوٹ پن کریں"
   },
   "1280430284217153733": {
      "message": "ایک وقت شامل کریں"
   },
   "1330083198022464084": {
      "message": "نیا نوٹ بنائیں"
   },
   "1333255388111908292": {
      "message": "راشن"
   },
   "1335763707789999819": {
      "message": "{NUM_ITEMS,plural, =1{آپ کو یہ آئٹم اس کے موجودہ فولڈرز سے منتقل کرنے کی اجازت نہیں ہے۔ اس کی بجائے {START_SPAN_1}{NAME}{END_SPAN} میں آئٹم شامل کریں۔}other{آپ کو ان آئٹمز کو ان کے موجودہ فولڈرز سے منتقل کرنے کی اجازت نہیں ہے۔ اس کی بجائے {START_SPAN_2}{NAME}{END_SPAN} میں آئٹمز شامل کریں۔}}"
   },
   "1338300799355131761": {
      "message": "بلاعنوان نوٹ"
   },
   "1349697396109290623": {
      "message": "$1​ کو اعلی تر ریزولیوشن میں ڈسپلے کرنا"
   },
   "1359937199332190522": {
      "message": "{NUM_ITEMS_1,plural, =0{unused plural form}=1{{NUM_ITEMS_2} فائل {XXX_1} میں شامل کر دی گئی ہے۔}other{{NUM_ITEMS_2} فائلز {XXX_2} میں شامل کر دی گئی ہیں۔}}"
   },
   "136335357683289450": {
      "message": "بند کریں"
   },
   "1368808491835583439": {
      "message": "گہرا جامنی"
   },
   "1379850360723600538": {
      "message": "پاس ورڈ کے ذریعہ تحفظ یافتہ فائلز تعاون یافتہ نہیں ہیں۔"
   },
   "1397887822627488928": {
      "message": "وہ شخص یا ای میل جس کے ساتھ اشتراک کرنا ہے"
   },
   "139942704574044780": {
      "message": "قبول کریں"
   },
   "1419896259743862406": {
      "message": "ان کے ساتھ کھولیں"
   },
   "1432850707344442376": {
      "message": "$1​ لیبل بنائیں"
   },
   "1434081385486479995": {
      "message": "اشتراک کرنے کی سہولت ابھی دستیاب نہیں ہے"
   },
   "1439211265324766071": {
      "message": "نوٹ کوڑے دان میں ہے"
   },
   "1441487391064925653": {
      "message": "سبھی شارٹ کٹس امدادی مرکز میں دیکھیں"
   },
   "1441712877952841568": {
      "message": "ترمیم کردہ $1​"
   },
   "1442722292947881614": {
      "message": "اقسام"
   },
   "1446829548948002072": {
      "message": "کوما"
   },
   "1453330983536591773": {
      "message": "ہلکا خاکستری"
   },
   "1463389029497634261": {
      "message": "والیوم گھٹائیں"
   },
   "1465828580966685215": {
      "message": "اکاؤنٹ صاف کریں"
   },
   "1466663154000252842": {
      "message": "کچھ لوگ رسائی سے محروم ہو سکتے ہیں"
   },
   "1467797923781828000": {
      "message": "$1​ آئٹمز کو $2​ میں شامل کر دیا گیا ہے۔"
   },
   "1473312930157933007": {
      "message": "مندرجہ ذیل صارفین کے ساتھ اشتراک نہیں ہو سکتا کیونکہ آپ کے منتظم نے آپ کی ڈومین سے باہر اشتراک غیر فعال کیا ہوا ہے۔"
   },
   "1475258635371833968": {
      "message": "$2​، $1​"
   },
   "1475261522522402536": {
      "message": "مقام منتخب کریں"
   },
   "1478393252643397554": {
      "message": "نارنجی"
   },
   "1482452362096735080": {
      "message": "‏{numOccurrences} بار دہرایا جاتا ہے"
   },
   "1499433769420882987": {
      "message": "$1​ کو ڈسپلے کر رہا ہے"
   },
   "1505876360160857231": {
      "message": "‎$1​ TB‎"
   },
   "1507063529674142853": {
      "message": "ماہ کے آخری دن"
   },
   "1507445189431379166": {
      "message": "حذف کریں"
   },
   "1512114410402431831": {
      "message": "ریفریش کریں"
   },
   "1512454807955173272": {
      "message": "‏آن لائن ہونے پر Keep اپ ڈیٹ ہو جائے گی"
   },
   "1513178578981188988": {
      "message": "Edge"
   },
   "1532717559893630620": {
      "message": "$1​ لیبل ضم ہو کر $2​ ہو گیا۔"
   },
   "1536051766421561160": {
      "message": "برابر"
   },
   "153659275234722804": {
      "message": "برخاست کریں"
   },
   "1543499632005215694": {
      "message": "{NUM_ITEMS,plural, =0{unused plural form}=1{‏\"{ADDED_PARENT_NAME}\" میں منتقل کی جانے والی فائل نے DLP انکشافات کو محرک کر دیا ہے۔ اس فائل میں حساس معلومات ہو سکتی ہے۔}other{‏\"{ADDED_PARENT_NAME}\" میں منتقل کی جانے والی کجھ فائلوں نے DLP انکشافات کو محرک کر دیا ہے۔ ان فائلوں میں حساس معلومات ہو سکتی ہے۔}}"
   },
   "1568379678795589771": {
      "message": "مربع"
   },
   "1586968957182554447": {
      "message": "غیر فعال کریں"
   },
   "1588268697057804046": {
      "message": "$1​ گھنٹے پہلے"
   },
   "1606998668553414638": {
      "message": "رسائی طلب کریں"
   },
   "1612117309990202511": {
      "message": "نقطے"
   },
   "1623657263486883050": {
      "message": "سینٹی میٹر"
   },
   "1633798963327779260": {
      "message": "آئندہ کل"
   },
   "1655692513689044870": {
      "message": "آپ سائن آؤٹ ہو گئے ہیں۔"
   },
   "1656911987308166143": {
      "message": "حذف کریں"
   },
   "1661251023749398110": {
      "message": "آڈیو ڈاؤن لوڈ کریں"
   },
   "1665821947855814052": {
      "message": "سائز"
   },
   "1675900304699098572": {
      "message": "{count,plural, =1{نوٹ سے پن ہٹا دیا گیا}other{# نوٹس سے پن ہٹا دیے گئے}}"
   },
   "1680617124502957636": {
      "message": "اس وقت منسلک نہیں کیا جا سکتا۔ بعد میں دوبارہ کوشش کریں۔"
   },
   "1680818623013843452": {
      "message": "Lucidchart"
   },
   "1683762293389974494": {
      "message": "حذف کریں"
   },
   "1694896269813520248": {
      "message": "ڈرائنگ شامل کریں"
   },
   "1697160643589236962": {
      "message": "‎$1​ PB‎"
   },
   "1703175513040690135": {
      "message": "$1​ میں کوئی بھی"
   },
   "1704004075228783011": {
      "message": "{every,plural, =1{ماہ کے آخری دن ماہانہ دہرایا جاتا ہے}other{ماہ کے آخری دن ہر # ماہ بعد دہرایا جاتا ہے}}"
   },
   "1711424025297585662": {
      "message": "ایک|ایک|وہ"
   },
   "171683163267149669": {
      "message": "‎$1​ GB‎"
   },
   "1730171019350750807": {
      "message": "سیاہ"
   },
   "1737240194537729525": {
      "message": "ہفتہ وار"
   },
   "1738407623218213194": {
      "message": "گمنام"
   },
   "1739900012825270238": {
      "message": "پچھلے آئٹم پر جائیں"
   },
   "1740371341228065086": {
      "message": "دوبارہ لوڈ کریں"
   },
   "1745782414562966515": {
      "message": "\"$1​\" لیبل کو \"$2​\" لیبل کے ساتھ ضم کریں؟ \"$1​\" لیبل والے سبھی نوٹس کو \"$2​\" کے ساتھ لیبل کیا جائے گا اور \"$1​\" لیبل کو حذف کر دیا جائے گا۔"
   },
   "1746512984326924716": {
      "message": "اس کارروائی کو کالعدم نہیں کیا جا سکتا۔"
   },
   "1783719421893050637": {
      "message": "لمبائی و چوڑائی"
   },
   "178927681797742562": {
      "message": "سائن ان کریں"
   },
   "1791115075948268631": {
      "message": "کی بورڈ شارٹ کٹ سے متعلق مدد کھولیں"
   },
   "179545118447015250": {
      "message": "گرڈ منظر"
   },
   "1803966010993357655": {
      "message": "دیگر"
   },
   "1808245543551507519": {
      "message": "آڈیو"
   },
   "1808500458645743749": {
      "message": "‏مقفل اسکرین کے نوٹس خودکار طور پر Google Keep میں محفوظ ہوتے ہیں۔ آپ کا حالیہ ترین نوٹ مقفل اسکرین پر برقرار رہے گا۔"
   },
   "1810354345035313773": {
      "message": "مارکر ٹول کا رنگ اور سائز منتخب کنندہ کھولیں"
   },
   "1819225489062185613": {
      "message": "دیگر"
   },
   "1823222042913714987": {
      "message": "پاس ورڈ جمع کرائیں"
   },
   "1829174126565818591": {
      "message": "Firefox"
   },
   "1830157062072535681": {
      "message": "$1​ کو ڈسپلے کر رہا ہے"
   },
   "1852745815330163711": {
      "message": "Google Drawings"
   },
   "1857224091554117760": {
      "message": "سرخ"
   },
   "1870691479127746185": {
      "message": "دائیں"
   },
   "187077078156858455": {
      "message": "آڈیو نوٹ"
   },
   "189303170370862360": {
      "message": "$1​ از $2​ آئٹمز"
   },
   "1900571668686750716": {
      "message": "vCard"
   },
   "1901215424950227523": {
      "message": "$1​ لیبل موجود نہیں ہے"
   },
   "1918176455405610789": {
      "message": "ہو گیا"
   },
   "1936219394601788126": {
      "message": "بنیادی"
   },
   "1938115711058331119": {
      "message": "تبصروں والا کالم دکھائیں"
   },
   "195154114623528341": {
      "message": "مقام شامل کریں"
   },
   "1956794332842050061": {
      "message": "اگلا صفحہ"
   },
   "1965626377712226216": {
      "message": "Keynote"
   },
   "1967536906522187719": {
      "message": "اس شیٹ کا پیش منظر دیکھنے میں ایک مسئلہ پیش آ گیا تھا۔"
   },
   "1968405748623909021": {
      "message": "یہ آئٹم کھولنے یا اس میں ترمیم کرنے کیلئے ذیل میں موجود ایپس میں سے ایک آزمائیں"
   },
   "1969531182936822963": {
      "message": "کارروائی کالعدم ہو گئی"
   },
   "1973454937875679500": {
      "message": "لیبل کا نام درج کریں"
   },
   "1975630610063119352": {
      "message": "{charsRemaining,plural, =1{# کریکٹر باقی ہے}other{# کریکٹرز باقی ہیں}}"
   },
   "1980209166254310911": {
      "message": "دن"
   },
   "1988244842147989817": {
      "message": "7 دنوں کے بعد کوڑے دان میں موجود نوٹس حذف ہو جاتے ہیں۔"
   },
   "200005227964332868": {
      "message": "مزید"
   },
   "2003845117979929469": {
      "message": "تفصیلات"
   },
   "200488920523496447": {
      "message": "آئٹم کو زوم ان کیا گیا۔"
   },
   "2039757863628752523": {
      "message": "فریکوئنسی کے اختیارات"
   },
   "205876860571942679": {
      "message": "Google My Maps"
   },
   "2059084517358086391": {
      "message": "تلاش بار بند کریں"
   },
   "2061440050632248160": {
      "message": "آرکائیو کریں"
   },
   "2068023589621557589": {
      "message": "‏TrueType فونٹ"
   },
   "2073322475696388995": {
      "message": "آگے لے جائیں"
   },
   "2074454463201225704": {
      "message": "زوم کو ری سیٹ کریں"
   },
   "207810168108507460": {
      "message": "$1​ گھنٹہ پہلے"
   },
   "2085048987351765091": {
      "message": "سمجھ آ گئی"
   },
   "2091811447965921066": {
      "message": "ان کو ہٹائیں"
   },
   "2107379241532042955": {
      "message": "مقام"
   },
   "2107589831642088814": {
      "message": "\"$3​$2​$1​\" بنائیں"
   },
   "2109979457438465538": {
      "message": "لیبل چنندہ مینو کھل گیا"
   },
   "2113092209746357267": {
      "message": "Chrome"
   },
   "2118635459760443566": {
      "message": "اگلا"
   },
   "2119255452378336327": {
      "message": "نقطہ کو $1​ میں واپس تبدیل کر دیا گیا"
   },
   "212796670323571824": {
      "message": "ٹھیک ہے"
   },
   "213665695896111861": {
      "message": "نوٹس"
   },
   "2138593281154109183": {
      "message": "آرکائیو کریں"
   },
   "214517458278879973": {
      "message": "$1​ کے بطور سائن ان کریں"
   },
   "2147952938331523160": {
      "message": "نام بدلیں…"
   },
   "2154372123324862271": {
      "message": "سلیش"
   },
   "2166966123760559393": {
      "message": "نیا لیبل بنائیں"
   },
   "2168461275182666804": {
      "message": "ترمیم کریں"
   },
   "2181197458532159304": {
      "message": "{numberOfNotes,plural, =1{نوٹ کوڑے دان میں ڈال دیا گیا}other{# نوٹس کوڑے دان میں ڈال دیے گئے}}"
   },
   "2184278444368405837": {
      "message": "$1​ آئٹمز"
   },
   "2187239650627580457": {
      "message": "جمع کرائیں"
   },
   "2189621188983913867": {
      "message": "مزید ایپس منسلک کریں"
   },
   "2190049738646901760": {
      "message": "{count,plural, =1{نوٹ حذف کریں؟}other{نوٹس حذف کریں؟}}"
   },
   "2195440644060728966": {
      "message": "{NUM_ITEMS,plural, =1{آپ ایک فولڈر میں موجود ایک فولڈر کو منتقل کر رہے ہیں}other{آپ ایک فولڈر میں موجود فولڈرز کو منتقل کر رہے ہیں}}"
   },
   "2198096971937872560": {
      "message": "یاد دہانی:"
   },
   "220168959069469607": {
      "message": "مزید کارروائیاں"
   },
   "2202265279234683999": {
      "message": "کی بورڈ شارٹ کٹس"
   },
   "2203926649090909861": {
      "message": "فہرست آئٹم کو انڈیکس $1​ میں منتقل کر دیا گیا"
   },
   "2215890921415017560": {
      "message": "مکمل اسکرین موڈ"
   },
   "2216904725760458480": {
      "message": "روزانہ"
   },
   "221715292685577880": {
      "message": "ہاں"
   },
   "2226562046914098941": {
      "message": "یہ فائل اتنی بڑی ہے کہ پیش منظر نہیں دیکھا جا سکتا"
   },
   "2226937423434054727": {
      "message": "$1​، $2​ تا $3​، $4​ منتخب کیا گيا"
   },
   "223198388381606871": {
      "message": "زرد قرمزی"
   },
   "2264311811697505466": {
      "message": "ریفریش کریں"
   },
   "2270469222412517777": {
      "message": "متن کی شناخت نہیں کر سکتے"
   },
   "2270633624888102832": {
      "message": "نوٹ سے پن ہٹائیں"
   },
   "2280650195464600721": {
      "message": "نیویگیشن"
   },
   "2282423663539387332": {
      "message": "آنے والی"
   },
   "2285069188138705005": {
      "message": "مربوط ایپس"
   },
   "2286685488296851497": {
      "message": "{NUM_ITEMS_1,plural, =0{unused plural form}=1{آپ ایک آئٹم اشتراک کردہ فولڈر \"{SHARED_FOLDER_NAME}\" سے باہر منتقل کر رہے ہیں، لہذا لوگ اس تک رسائی سے محروم ہو جائیں گے۔}other{آپ {NUM_ITEMS_2} آئٹمز اشتراک کردہ فولڈر \"{SHARED_FOLDER_NAME}\" سے باہر منتقل کر رہے ہیں، لہذا لوگ ان تک رسائی سے محروم ہو جائیں گے۔}}"
   },
   "228741435562395266": {
      "message": "پرنٹنگ ابھی تک دستیاب نہیں ہے"
   },
   "2289534534793293486": {
      "message": "آرکائیو سے نکالیں"
   },
   "2289812403593835836": {
      "message": "Pages"
   },
   "229177484946387188": {
      "message": "Google Earth"
   },
   "2292696732672795285": {
      "message": "والیوم بڑھائیں"
   },
   "2299671629154778581": {
      "message": "نوٹس سے پن ہٹا دی گئی اور آرکائیو کر دیے گئے"
   },
   "2308018963132768704": {
      "message": "سائز 4"
   },
   "2310145944356900158": {
      "message": "نشان زد"
   },
   "2311880726221661199": {
      "message": "اعلی ریزولیوشنز لوڈ ہو رہے ہیں"
   },
   "2324955914430674498": {
      "message": "\"$1​\" کیلئے تلاش کے کوئی نتائج نہیں ہیں"
   },
   "2329167963662998826": {
      "message": "‏مقام کی یاددہانیوں کیلئے مقامات کی تجاویز کو بہتر بنانے کیلئے Google Keep آپ کے مقام کا استعمال کرنا چاہے گا۔"
   },
   "2346361265476305332": {
      "message": "مالک نے اس آڈیو فائل کیلئے ڈاؤن لوڈز کی اجازت نہیں دی ہے۔"
   },
   "2357623745116912085": {
      "message": "{NUM_ITEMS,plural, =0{unused plural form}=1{\"{TEAM_DRIVE_NAME}\" کے اراکین رسائی سے محروم ہو جائیں گے جب تک اس آئٹم کا اشتراک ان کے ساتھ نہ ہو جائے۔}other{\"{TEAM_DRIVE_NAME}\" کے اراکین رسائی سے محروم ہو جائیں گے جب تک ان آئٹمز کا اشتراک ان کے ساتھ نہ ہو جائے۔}}"
   },
   "2357761837816388330": {
      "message": "آف لائن"
   },
   "2359614137862708172": {
      "message": "Shift"
   },
   "2364374826543847335": {
      "message": "ماخذ ہٹائیں"
   },
   "236689092839978781": {
      "message": "نہیں دہرایا جاتا"
   },
   "2370656573843123707": {
      "message": "دایاں بریکٹ"
   },
   "2373760032138505521": {
      "message": "لیبل پہلے سے موجود ہے"
   },
   "2386536768112358461": {
      "message": "Pg-Down"
   },
   "2396804279177914769": {
      "message": "‏ملکیت Team Drive میں منتقل کریں؟"
   },
   "2405795704816921421": {
      "message": "$1​ فائل"
   },
   "2408383448126741628": {
      "message": "دورانیہ"
   },
   "2408933271548524782": {
      "message": "مقفل"
   },
   "2423877407428530040": {
      "message": "فائل میں بہت زیادہ چارٹس ہیں۔"
   },
   "2433429041384246549": {
      "message": "خاموش کریں"
   },
   "2444198666025646119": {
      "message": "بنفشی"
   },
   "2449254824382583885": {
      "message": "پاپ آؤٹ"
   },
   "2452145367257933677": {
      "message": "کالعدم کریں"
   },
   "2452522051596946166": {
      "message": "افوہ! $1​ کا پیش منظر دیکھتے وقت ایک مسئلہ پیش آگیا۔ دوبارہ کوشش کر رہے ہیں۔"
   },
   "2454642351139428112": {
      "message": "کالعدم کریں"
   },
   "2466251465475184755": {
      "message": "کوڑے دان خالی کریں؟ کوڑے دان میں موجود سبھی نوٹس مستقل طور پر حذف ہو جائیں گے۔"
   },
   "2475181823688399272": {
      "message": "آگے"
   },
   "2478862372619762755": {
      "message": "تبصرے کرنے کیلئے کوئی حصہ ہائی لائٹ کریں"
   },
   "2483363439634684283": {
      "message": "سائز 20"
   },
   "2504232652631703202": {
      "message": "مربوط"
   },
   "251025074207413762": {
      "message": "ایک تفصیل شامل کریں"
   },
   "2525633490863427854": {
      "message": "دوبارہ کریں"
   },
   "2527534830196374788": {
      "message": "Ctrl"
   },
   "2532280782491328445": {
      "message": "پچھلا تلاش کریں"
   },
   "2555961950726197809": {
      "message": "ناظر دکھا رہا ہے۔"
   },
   "2562881166530755046": {
      "message": "ڈرائنگز"
   },
   "257317112834806705": {
      "message": "فہرست اور گرڈ منظر کے درمیان ٹوگل کریں"
   },
   "2579261044590673579": {
      "message": "میری ڈرائیو"
   },
   "2579679351920691492": {
      "message": "پیچھے لے جائیں"
   },
   "2581526424350930407": {
      "message": "ترمیم کریں"
   },
   "2584557103820423944": {
      "message": "فہرست آئٹم کا حاشیہ گھٹائیں/بڑھائیں"
   },
   "2600731575260427177": {
      "message": "فائل موجود نہیں ہے اور ممکن ہے اسے حذف کردیا گیا ہو۔ براہ کرم فائل کو دوبارہ اپ لوڈ کرنے کی کوشش کریں۔"
   },
   "2601304136110057215": {
      "message": "نئی ڈرائنگ"
   },
   "2604527707881848686": {
      "message": "آئٹم کا حاشیہ مزید ختم نہیں کیا جا سکتا۔"
   },
   "2609409316752026806": {
      "message": "PDF"
   },
   "2609767652209789035": {
      "message": "لیبلز"
   },
   "2623861453769098676": {
      "message": "اس دستاویز کا پیش منظر دیکھتے ہوئے ایک مسئلہ پیش آگیا۔"
   },
   "2626653026098396543": {
      "message": "{NUM_ITEMS,plural, =0{Unused}=1{اس آئٹم کو منتقل کرنے سے اس کا ہر اس شخص کے ساتھ اشتراک ہو جائے گا جو اشتراک کردہ فولڈر \"{SHARED_FOLDER_NAME}\" کو دیکھ سکتا ہے۔}other{ان آئٹمز کو منتقل کرنے سے ان کا ہر اس شخص کے ساتھ اشتراک ہو جائے گا جو اشتراک کردہ فولڈر \"{SHARED_FOLDER_NAME}\" کو دیکھ سکتا ہے۔}}"
   },
   "2630254198275172065": {
      "message": "اس میں منتقل کریں…"
   },
   "2632263751512428257": {
      "message": "سالانہ"
   },
   "2645469029410848421": {
      "message": "{noteCount,plural, =1{لیبل نوٹ}other{لیبل نوٹس}}"
   },
   "2661850177130037208": {
      "message": "آئٹم کھولیں"
   },
   "2680303811435018716": {
      "message": "مزید آئٹمز شامل نہیں کیے جا سکتے ہیں"
   },
   "2681830832355823748": {
      "message": "سبھی شارٹ کٹس تلاش کریں"
   },
   "268402507078609011": {
      "message": "{imagesAdded,plural, =1{تصویر شامل ہو گئی}other{# تصاویر شامل ہو گئیں}}"
   },
   "2702485557996900362": {
      "message": "متصادم ترامیم کو درست کریں"
   },
   "2704959686524436777": {
      "message": "لوڈ ہو رہا ہے"
   },
   "2715199780155065699": {
      "message": "فائل میں بہت زیادہ شکلیں، متنی باکسز یا ڈرائنگز ہیں۔"
   },
   "2716433087531258659": {
      "message": "page up"
   },
   "2719125961689709460": {
      "message": "یادداشت"
   },
   "2742719907061406418": {
      "message": "XML"
   },
   "2758125083752925237": {
      "message": "(مالک)"
   },
   "2760106082595028595": {
      "message": "نوٹ بہت بڑا ہے۔"
   },
   "277430914014962533": {
      "message": "افوہ! $1​ کا پیش منظر دیکھتے وقت ایک مسئلہ پیش آگیا۔"
   },
   "2777453609143551768": {
      "message": "والیوم کنٹرول"
   },
   "2793841261389879255": {
      "message": "پچھلا صفحہ"
   },
   "2794676336056877832": {
      "message": "{every,plural, =1{ہر ماہ ایک ہی دن ماہانہ دہرایا جاتا ہے}other{ہر ماہ ایک ہی دن ہر # ماہ بعد دہرایا جاتا ہے}}"
   },
   "2798322202738486782": {
      "message": "{HOURS,plural, =0{0 گھنٹے }=1{1 گھنٹہ }other{# گھنٹے }}{MINUTES,plural, =0{0 منٹ }=1{1 منٹ }other{# منٹ }}{SECONDS,plural, =0{0 سیکنڈ۔}=1{1 سیکنڈ۔}other{# سیکنڈ۔}}"
   },
   "2803553109654833664": {
      "message": "گلابی"
   },
   "2818020101821669029": {
      "message": "تخلیق کردہ"
   },
   "2820045170951016567": {
      "message": "یاددہانیاں"
   },
   "2823533464825550362": {
      "message": "دستاویز کے کنٹرولز"
   },
   "2827039933590757722": {
      "message": "‏Windows شارٹ کٹ"
   },
   "2828060233316503200": {
      "message": "{NUM_ITEMS_1,plural, =0{unused plural form}=1{{NUM_ITEMS_2} آئٹم {XXX_1} سے {XXX_2} میں منتقل کر دیا گیا ہے۔}other{{NUM_ITEMS_2} آئٹمز کو {XXX_3} سے {XXX_4} میں منتقل کر دیا گیا ہے۔}}"
   },
   "2829226075651806940": {
      "message": "زوم ان کریں"
   },
   "2842462703735289745": {
      "message": "ہر وہ شخص جو اشتراک کردہ فولڈر \"$1​\" کو دیکھ سکتا ہے اس کو رسائی حاصل ہوگی۔"
   },
   "2853036885874864031": {
      "message": "ملکیت $1​ کو منتقل کر دی جائے گی۔"
   },
   "2854717396594966319": {
      "message": "OpenOffice Writer"
   },
   "2858566870229558873": {
      "message": "$2​شرائط$1​"
   },
   "2862675909830094845": {
      "message": "نیا لیبل بنائیں"
   },
   "2873089307546162154": {
      "message": "ٹھیک ہے"
   },
   "2877285560485318801": {
      "message": "موقوف کریں"
   },
   "2879276552944958066": {
      "message": "$1​ فولڈر پر واپس جائیں۔"
   },
   "2886313667612471214": {
      "message": "ریفریش درکار ہے۔ اس میں کئی منٹ لگ سکتے ہیں۔"
   },
   "2893055432094515558": {
      "message": "چیک باکسز دکھائے گئے"
   },
   "289798573180023043": {
      "message": "ٹھیک ہے"
   },
   "2901360496423912565": {
      "message": "اطلاع دیں"
   },
   "2902570047322934912": {
      "message": "اشتراک فعال کریں"
   },
   "2908917161758545146": {
      "message": "{count,plural, =1{نوٹ سے پن ہٹا دی گئی اور آرکائیو کر دیا گیا}other{# نوٹس سے پن ہٹا دی گئی اور آرکائیو کر دیے گئے}}"
   },
   "292972929665636688": {
      "message": "‏اب آپ Keep پر نئے نوٹس اور چیک لسٹس تخلیق کرنے کیلئے Google اسسٹنٹ کا استعمال کر سکتے ہیں۔"
   },
   "2935193106137642160": {
      "message": "زومنگ دستیاب نہیں ہے"
   },
   "2942094715879803305": {
      "message": "نشان زد آئٹمز حذف کریں"
   },
   "295331174171409695": {
      "message": "\"$1​\" کو ڈاؤن لوڈ کرنے کی اجازت اپ ڈیٹ کرتے ہوئے ایک مسئلہ پیش آگیا۔"
   },
   "2960516445247616550": {
      "message": "پرنٹنگ غیر دستیاب ہے"
   },
   "296391753033307868": {
      "message": "$1​ لیبل بن گیا اور نوٹ میں شامل ہو گیا۔"
   },
   "2964778642459027786": {
      "message": "کوڑے دان میں کوئی نوٹس نہیں ہیں"
   },
   "2971623719720688041": {
      "message": "کارروائی کالعدم ہو گئی"
   },
   "2971780287153684447": {
      "message": "‏Android آلات"
   },
   "2973306402585941108": {
      "message": "صبح"
   },
   "298817883481775869": {
      "message": "لوڈ ہو رہا ہے…"
   },
   "2990497076082409431": {
      "message": "\"$1​\" کو $2​ میں منتقل کر دیا گیا ہے۔"
   },
   "2993901764282547916": {
      "message": "ایپ میکر"
   },
   "3005058076425755361": {
      "message": "Backspace"
   },
   "3018905429279095639": {
      "message": "{NUM_ITEMS,plural, =1{آپ کو یہ فولڈر اس کے موجودہ فولڈرز سے منتقل کرنے کی اجازت نہیں ہے۔ اس کے بجائے فولڈر کو {START_SPAN_1}{NAME}{END_SPAN} میں شامل کریں۔}other{آپ کو ان فولڈرز کو ان کے موجودہ فولڈرز سے منتقل کرنے کی اجازت نہیں ہے۔ اس کے بجائے فولڈرز کو {START_SPAN_2}{NAME}{END_SPAN} میں شامل کریں۔}}"
   },
   "3043961722025425136": {
      "message": "تفصیل"
   },
   "3045997283325725532": {
      "message": "‏Google Keep میں نیا کیا ہے"
   },
   "306516303501625305": {
      "message": "توثیق ناکام ہو گئی ہے۔"
   },
   "3108098439469164127": {
      "message": "نئی ڈرائنگ کھول دی گئی"
   },
   "3109321241584918345": {
      "message": "مزید ایپس مربوط کریں…"
   },
   "3121560585545725724": {
      "message": "$1​, $2​"
   },
   "3140236589681731084": {
      "message": "$1​ گھنٹے میں"
   },
   "3147722095652727387": {
      "message": "مندرجہ ذیل صارفین کے ساتھ اشتراک نہیں ہو سکتا کیونکہ یا تو ان کے منتظم نے ان کی ڈومین سے باہر اشتراک غیر فعال کیا ہوا ہے یا پھر آپ کے منتظم نے آپ کی ڈومین سے باہر اشتراک غیر فعال کیا ہوا ہے۔"
   },
   "3149135495425830054": {
      "message": "'تجویز کریں' اور 'ازخود مکمل کریں' کی خصوصیات سائن ان ہونے پر دستیاب ہوتی ہیں"
   },
   "3150651996344750990": {
      "message": "{count,plural, =1{نوٹ آرکائیو سے نکال دیا گیا}other{# نوٹس آرکائیو سے نکال دیے گئے}}"
   },
   "3167198321908629554": {
      "message": "آپ کے نوٹس ریفریش اور دوبارہ لوڈ ہو رہے ہیں…"
   },
   "3176246635438298155": {
      "message": "Delete"
   },
   "3187117482772485385": {
      "message": "تھمب نیل کی تخلیق ہو رہی ہے..."
   },
   "3189854932778515441": {
      "message": "نوٹ آرکائیو میں ہے"
   },
   "3190546672187601036": {
      "message": "رات"
   },
   "3195812604657128345": {
      "message": "‏Drive فولڈر میں کھولنے کیلئے اسے منتخب کریں"
   },
   "32059145043728507": {
      "message": "{numberOfNotes,plural, =1{نوٹ بحال ہو گیا}other{# نوٹس بحال ہو گئے}}"
   },
   "3207650089232728475": {
      "message": "لیبلز تبدیل کریں"
   },
   "3211163842850942567": {
      "message": "زوم ان کریں"
   },
   "3217354672216773127": {
      "message": "$1​ کو فعال کیا گیا"
   },
   "3220641589840600333": {
      "message": "$1​ منظر میں سوئچ ہو گیا"
   },
   "3241696131593027453": {
      "message": "نوٹ منتخب کریں"
   },
   "3243916603465112517": {
      "message": "کم"
   },
   "3249966726137025950": {
      "message": "معاون کا فیملی گروپ"
   },
   "3250489229749307913": {
      "message": "الیکٹرانک پبلیکیشن"
   },
   "3258100527833044153": {
      "message": "خالی ڈرائنگ مسترد ہو گئی"
   },
   "3261131345401321392": {
      "message": "تبصرہ کرسکتے ہیں"
   },
   "3266448715145955862": {
      "message": "نوٹس آرکائیو سے نکال دیے گئے اور پن کر دیے گئے"
   },
   "3268028083415317236": {
      "message": "نہیں، شکریہ"
   },
   "3272496516667407797": {
      "message": "تفصیلات کو لوڈ کرتے وقت ایک مسئلہ پیش آگیا۔"
   },
   "3278046126264096288": {
      "message": "ہفتہ"
   },
   "3281684668260174833": {
      "message": "{numberOfNotes,plural, =1{نوٹ سے پن ہٹا دی گئی اور کوڑے دان میں ڈال دیا گیا}other{# نوٹس سے پن ہٹا دی گئی اور کوڑے دان میں ڈال دیے گئے}}"
   },
   "3288498486633948368": {
      "message": "‏\"$1​\" کو Google Drive میں شامل کر دیا گیا ہے۔"
   },
   "330603631583186798": {
      "message": "Word"
   },
   "3308935528045767909": {
      "message": "ڈرائنگ کے ساتھ نیا نوٹ"
   },
   "3312545971976531405": {
      "message": "Message"
   },
   "3326410145104517459": {
      "message": "اپنے خیالات کیپچر کریں $1​ کسی بھی آلہ سے"
   },
   "3345567742278474807": {
      "message": "اس نوٹ پر بطور نامناسب پرچم لگایا گیا ہے اور اس کا اشتراک نہیں کیا جا سکتا ہے۔"
   },
   "3348057264663626000": {
      "message": "انتخاب اوپر منتقل کیا گیا۔"
   },
   "3354260708176476985": {
      "message": "‏لوڈ ہو رہا ہے&hellip;"
   },
   "3362903141674317449": {
      "message": "معاون"
   },
   "336772567640975291": {
      "message": "اگلا ہفتہ"
   },
   "3371033609268806242": {
      "message": "$1​ لیبل حذف ہو گیا۔"
   },
   "3381619429606029445": {
      "message": "Visio"
   },
   "3382236845597426718": {
      "message": "کھولیں"
   },
   "3385831848537487538": {
      "message": "سفر"
   },
   "3409257542937182842": {
      "message": "دوبارہ کوشش کر رہے ہیں…"
   },
   "3409483962000136213": {
      "message": "چلائیں/موقوف کریں"
   },
   "3418767079436101103": {
      "message": "اس صفحہ کو لوڈ کرتے وقت ایک مسئلہ پیش آگیا۔"
   },
   "3419821606494999471": {
      "message": "تبصرے کی اطلاعات کا نظم کریں"
   },
   "3435089737264042207": {
      "message": "آن کریں"
   },
   "3447704623213039325": {
      "message": "گروسری آئٹم"
   },
   "3448234415275521882": {
      "message": "عام معلومات"
   },
   "3451851833460018584": {
      "message": "{NUM_COMMENTS,plural, =0{کوئی تبصرہ نہیں}=1{ایک تبصرہ}other{# تبصرے}}"
   },
   "3455405209271884570": {
      "message": "کھولیں"
   },
   "345585899501260401": {
      "message": "پکسلز"
   },
   "345718983715470367": {
      "message": "ماخذ"
   },
   "3468441711253011521": {
      "message": "Google Sheets"
   },
   "3473620774713000513": {
      "message": "حل شدہ"
   },
   "3485469306694683931": {
      "message": "‏اپنے Drive اکاؤنٹ میں کھولیں"
   },
   "3487924397596265480": {
      "message": "$1​ منتخب کیا گيا۔"
   },
   "3488766808236147068": {
      "message": "رنگ $1​ ہے۔ نوٹ پر کوئی دوسرا رنگ لاگو کرنے کیلئے اسے منتخب کریں۔"
   },
   "3496410038494993160": {
      "message": "مقبول کی بورڈ شارٹ کٹس"
   },
   "3518073392823563581": {
      "message": "کی بورڈ شارٹ کٹس"
   },
   "3528739824697875943": {
      "message": "فہرست کا آئٹم"
   },
   "3549581437554274388": {
      "message": "انتخاب دائیں منتقل کیا گیا۔"
   },
   "3551522853788442530": {
      "message": "پیچھے جائیں"
   },
   "3551608745198442336": {
      "message": "ڈرائنگ $1​/$2​"
   },
   "3553997866738769437": {
      "message": "ڈرائنگ میں ترمیم کریں"
   },
   "3555017093330694286": {
      "message": "اشتراک کردہ منجانب"
   },
   "3555297636767750285": {
      "message": "سبز"
   },
   "3561658662634401836": {
      "message": "عنوان"
   },
   "3569884090205828853": {
      "message": "OpenOffice Calc"
   },
   "3570074492517305433": {
      "message": "سائن اپ کریں"
   },
   "3571704286086017611": {
      "message": "یاد دہانی حذف کر دی گئی"
   },
   "3574963906259719128": {
      "message": "آپ کا براؤزر اس آڈیو فائل کو چلانے سے قاصر ہے۔"
   },
   "3580293729117872545": {
      "message": "تاریخ اختتام"
   },
   "3595000514985906359": {
      "message": "Excel"
   },
   "3595562664731337243": {
      "message": "لیبل کا نام تبدیل کریں"
   },
   "3603931013946597836": {
      "message": "{NUM_ITEMS,plural, =1{آپ {NUM_PARENTS} فولڈرز میں موجود ایک فائل کو منتقل کر رہے ہیں}other{آپ {NUM_PARENTS} فولڈرز میں موجود فائلوں کو منتقل کر رہے ہیں}}"
   },
   "3608606849109645545": {
      "message": "دستاویز کا ایک نیا نام درج کریں:"
   },
   "3609912631958780352": {
      "message": "کیلی گرافی ٹول"
   },
   "3611573349633408445": {
      "message": "ڈاؤن لوڈ کریں"
   },
   "3612936866865912552": {
      "message": "لوڈ ہو رہا ہے…"
   },
   "3617727970098875990": {
      "message": "سبھی شارٹ کٹس تلاش کریں"
   },
   "362521762755836201": {
      "message": "$1​ بجے تخلیق ہوا"
   },
   "3634885664399305142": {
      "message": "ڈرائنگ دستیاب نہیں ہے"
   },
   "3651893685901703652": {
      "message": "..."
   },
   "3657386785336906042": {
      "message": "بیک سلیش"
   },
   "3659554681396757189": {
      "message": "میرے ذریعہ کھولی گئی"
   },
   "366289214151975122": {
      "message": "$1​ میں موجود کوئی بھی شخص جس کے پاس لنک ہے"
   },
   "3663571259791438207": {
      "message": "بیجا استعمال کی اطلاع دیں"
   },
   "3664842788764635265": {
      "message": "کوئی نہیں"
   },
   "3666123569747918021": {
      "message": "اس دستاویز میں غیر محفوظ کردہ تبدیلیاں ہیں۔ کیا آپ اس صفحہ کو چھوڑنا اور اپنی تبدیلیوں کو مسترد کرنا چاہتے ہیں؟"
   },
   "3678477908297567934": {
      "message": "انڈرسکور"
   },
   "3690515530505404607": {
      "message": "اس ویڈیو کو چلاتے وقت ایک مسئلہ پیش آگیا۔"
   },
   "369764661829607970": {
      "message": "{NUM_ITEMS,plural, =0{کوئی آئٹمز نہیں ہیں}=1{1 آئٹم}other{# آئٹمز}}"
   },
   "3707311099386068778": {
      "message": "سبھی کو ہٹا دیں"
   },
   "3712215972250917265": {
      "message": "تبصرے"
   },
   "3721649886572275931": {
      "message": "سائز 8"
   },
   "372633345629975481": {
      "message": "نوٹس پن ہو گئے"
   },
   "372823375470132483": {
      "message": "کوڑے دان شدہ نوٹ غیر منتخب کریں"
   },
   "3734444903221631913": {
      "message": "{NUM_ITEMS_1,plural, =0{unused plural form}=1{unused plural form}other{‏آپ {NUM_ITEMS_2} آئٹمز Team Drives اور اشتراک کردہ فولڈرز سے باہر منتقل کر رہے ہیں، لہذا لوگ ان تک رسائی سے محروم ہو جائیں گے۔}}"
   },
   "3751183760611784323": {
      "message": "اسکرین کی چوڑائی میں آئٹم کو فٹ کرنے کے لیے زوم کیا گیا۔"
   },
   "3793086499925031123": {
      "message": "تلاش بار کھولیں / پچھلا تلاش کریں"
   },
   "3796511349428373407": {
      "message": "تاریخ کے اختیارات"
   },
   "37992665410817181": {
      "message": "دوبارہ کھولی گئی"
   },
   "3801617971018550169": {
      "message": "گزشتہ کل"
   },
   "381100310424863459": {
      "message": "Illustrator"
   },
   "3827179818223863356": {
      "message": "ہلکا سبز"
   },
   "3845302429676793049": {
      "message": "\"$1​\" کی تفصیل اپ ڈیٹ کرتے ہوئے ایک مسئلہ پیش آگیا۔"
   },
   "3856960241878617076": {
      "message": "تبصرے لوڈ ہو رہے ہیں، براہ کرم انتظار کریں"
   },
   "3858324058837632381": {
      "message": "اس آڈیو فائل کو چلاتے وقت ایک مسئلہ پیش آگیا۔"
   },
   "3869166581651870488": {
      "message": "ترمیم مکمل کریں"
   },
   "3874597373619381607": {
      "message": "حل شدہ تبصرے ظاہر ہیں"
   },
   "3877974536163446728": {
      "message": "$1​، $2​ منتخب کیا گيا"
   },
   "3888733084985311515": {
      "message": "فیملی گروپ دستیاب ہے۔"
   },
   "3897281533382850749": {
      "message": "آواز چلائیں"
   },
   "3907816292084809686": {
      "message": "کارروائی دوبارہ کی گئی"
   },
   "3909380459614154542": {
      "message": "لنک پر جائیں"
   },
   "3930910469078167425": {
      "message": "آرکائیو"
   },
   "3952341864324097024": {
      "message": "تلاش صاف کریں"
   },
   "3955575370175991097": {
      "message": "$1​ لیبل منظر میں سوئچ ہو گیا"
   },
   "3974822583047850066": {
      "message": "منسوخ کریں"
   },
   "3977699855735576796": {
      "message": "مزید صفحات لوڈ کرنے میں ایک مسئلہ پیش آگیا۔"
   },
   "3981269900634596036": {
      "message": "{numberOfNotes,plural, =1{نوٹ حذف کریں}other{نوٹس حذف کریں}}"
   },
   "3988418762222300024": {
      "message": "پیریڈ"
   },
   "4005725939358875643": {
      "message": "کارروائی کو کالعدم کر دیا گیا۔"
   },
   "4020393055976236243": {
      "message": "ملکیت $2​ میں \"$3​\" سے $1​ میں منتقل ہو جائے گی۔"
   },
   "4023299615382814997": {
      "message": "کوڑے دان میں ترمیم نہیں کی جا سکتی"
   },
   "4030906186910275934": {
      "message": "دیکھیں"
   },
   "4036523543547629779": {
      "message": "تصاویر"
   },
   "4044915502415235332": {
      "message": "پن کردہ نوٹ منتخب کریں"
   },
   "4052960606031736645": {
      "message": "{NUM_ITEMS,plural, =1{آپ {NUM_PARENTS} فولڈرز میں موجود ایک فولڈر کو منتقل کر رہے ہیں}other{آپ {NUM_PARENTS} فولڈرز میں موجود فولڈرز کو منتقل کر رہے ہیں}}"
   },
   "4061102590585232601": {
      "message": "$1​ ہٹا دیا"
   },
   "4064820890482961434": {
      "message": "چیک باکسز دکھائیں"
   },
   "4072353527895477784": {
      "message": "لوگ"
   },
   "407982090576503781": {
      "message": "میری ڈرائیو میں منتقل کریں؟"
   },
   "4081524305222967804": {
      "message": "نیلگوں سبز"
   },
   "4085493778209859942": {
      "message": "بہرحال چلائیں"
   },
   "4086409218932829944": {
      "message": "لیبلز میں ترمیم کریں"
   },
   "4087289538934418537": {
      "message": "آپ کے بنائے ہوئے نوٹس حذف ہونے کے بعد کسی کو نظر نہیں آئیں گے۔ آپ سے اشتراک کردہ نوٹس ان کو نظر آتے رہیں گے جن کو رسائی حاصل ہے۔"
   },
   "4095714830819118951": {
      "message": "مدد"
   },
   "4097921967754832323": {
      "message": "ہائفن"
   },
   "411137507354526852": {
      "message": "ماہ"
   },
   "4111452225725405610": {
      "message": "\"$1​\" سے ستارے کا نشان ہٹا دیا گیا۔"
   },
   "4117632433281998979": {
      "message": "ماہانہ"
   },
   "4122858386674768321": {
      "message": "$3​$2​$1​ سے منتقل کریں"
   },
   "4155905925766040098": {
      "message": "کوئی پیش منظر دستیاب نہیں ہے"
   },
   "4157091150222353401": {
      "message": "‏تبصرے DOCX, PPTX, اور XLSX فائلوں میں محفوظ اور Microsoft Office میں مرئی ہوتے ہیں"
   },
   "4174786386751618325": {
      "message": "تصویری نوٹ"
   },
   "4182427157920112948": {
      "message": "tilde"
   },
   "4186465168527990324": {
      "message": "\"$1​\" کو کامیابی کے ساتھ $2​ میں کھول دیا گیا"
   },
   "4204345954541079744": {
      "message": "اس لیبل کے ساتھ ابھی تک کوئی نوٹس نہیں ہیں"
   },
   "4206529410529166231": {
      "message": "{NUM_ITEMS,plural, =1{آپ {NUM_PARENTS} فولڈرز میں موجود ایک آئٹم منتقل کر رہے ہیں}other{آپ {NUM_PARENTS} فولڈرز میں موجود آئٹمز منتقل کر رہے ہیں}}"
   },
   "4209658291185545281": {
      "message": "کارروائی کالعدم نہیں ہو سکی"
   },
   "4211182812451835307": {
      "message": "ترمیم کر سکتا ہے"
   },
   "4214190403999219403": {
      "message": "زوم کریں"
   },
   "4214427276033711472": {
      "message": "ترتیبات"
   },
   "4216242742234357612": {
      "message": "سبھی نوٹس منتخب کریں"
   },
   "4216628828665009319": {
      "message": "مَگَر ناشپاتی سبز"
   },
   "4227767243455123953": {
      "message": "فہرست کا رویہ"
   },
   "4228870062013120023": {
      "message": "اگلے/پچھلے نوٹ پر نیویگیٹ کریں"
   },
   "4230101516585408149": {
      "message": "ایک نیا نوٹ تحریر کریں"
   },
   "4239183034054216803": {
      "message": "بھورا"
   },
   "4243437721135025638": {
      "message": "‏آپ کو اس Team Drive میں فائلیں منتقل کرنے کی اجازت نہیں ہے۔"
   },
   "4248787844477062707": {
      "message": "نیا لیبل بنائیں"
   },
   "4267845092591696061": {
      "message": "منتخب کردہ آئٹمز پر ستارے کا نشان لگائیں/ہٹائیں"
   },
   "4269096876505546324": {
      "message": "تاثرات بھیجیں"
   },
   "426927371216979233": {
      "message": "اصول"
   },
   "4280747719095153198": {
      "message": "حل شدہ تبصرہ"
   },
   "4286663890332754386": {
      "message": "اپ لوڈ ناکام ہوگیا۔"
   },
   "4293996570221590891": {
      "message": "سفید"
   },
   "4296310694082659873": {
      "message": "صافی ٹول"
   },
   "4299690446455033653": {
      "message": "Works"
   },
   "4310202846681054741": {
      "message": "{numberOfPreviews,plural, =1{لنک پیش منظر ہٹا دیا گیا}other{# لنک پیش مناظر ہٹا دیے گئے}}"
   },
   "4318861667254318892": {
      "message": "Google Video"
   },
   "4320831042030778": {
      "message": "منسوخ کریں"
   },
   "4320942249997687388": {
      "message": "End"
   },
   "4321382260116636620": {
      "message": "نوٹ منتخب کریں"
   },
   "4332252081504252077": {
      "message": "افوہ!"
   },
   "4343825450663233452": {
      "message": "دیکھ سکتا ہے"
   },
   "4343836986248234462": {
      "message": "فہرست کا آئٹم"
   },
   "4343848624651344174": {
      "message": "سہ پہر"
   },
   "435214284915110062": {
      "message": "تلاش بار کھولیں"
   },
   "435444400175963053": {
      "message": "$1​ آئٹمز کو $2​ میں منتقل کر دیا گیا ہے۔"
   },
   "4356312843186491987": {
      "message": "منتقل کریں"
   },
   "4391715930031906467": {
      "message": "اگلا تلاش کریں"
   },
   "4397482594800054550": {
      "message": "\"$1​\" کا نام تبدیل کرتے ہوئے ایک مسئلہ پیش آگیا۔"
   },
   "4412626362660239325": {
      "message": "‏Drive میں منظم کریں"
   },
   "4421168692772991468": {
      "message": "کوڑے دان"
   },
   "4422985761498356257": {
      "message": "ان کے ساتھ کھولیں"
   },
   "4429542915339609008": {
      "message": "معذرت، اس ایپ کے ساتھ متعدد فائلیں کھولنا تعاون یافتہ نہیں ہے۔"
   },
   "4439831283519683004": {
      "message": "خاکستری"
   },
   "4444571967705751871": {
      "message": "کوڑے دان"
   },
   "4448871104213529122": {
      "message": "تفصیلات چھپائیں"
   },
   "4457424709416639982": {
      "message": "میری ڈرائیو میں شامل کریں"
   },
   "4462389610494427551": {
      "message": "سینٹی میٹرز"
   },
   "4466605492523079635": {
      "message": "محفوظ کریں"
   },
   "4486429060311743289": {
      "message": "انتخاب صاف کریں"
   },
   "4494250072784000771": {
      "message": "اسٹائلس کا پتہ چلا۔ 'ٹچ کے ساتھ پین کریں' فعال کردہ ہے۔"
   },
   "45228242181482134": {
      "message": "چلائیں"
   },
   "4524999513489942668": {
      "message": "‏اپنی دلچسپی کی چیزوں کو ایک کلک کے ساتھ Keep میں محفوظ کرنے کیلئے $2​Google Keep Chrome ایکسٹینشن انسٹال کریں$1​۔"
   },
   "4533605085334699862": {
      "message": "اقتباسات"
   },
   "4543077011795639870": {
      "message": "آئٹم کا حاشیہ ختم کیا گيا۔"
   },
   "4550209323331625907": {
      "message": "$2​مزید جانیں$1​"
   },
   "4557086341175267918": {
      "message": "آف لائن اشتراک نہیں کیا جا سکتا"
   },
   "4558568516353053251": {
      "message": "اس فائل کے ناظرین تبصرے اور تجاویز دیکھ سکتے ہیں۔"
   },
   "4561316395348814504": {
      "message": "ایپ ڈاؤن لوڈز"
   },
   "4564682305303579317": {
      "message": "جاری رکھیں"
   },
   "456512308416555173": {
      "message": "کتابیں"
   },
   "4566838580250578446": {
      "message": "{every,plural, =1{ہر سال دہرایا جاتا ہے}other{ہر # سالوں میں دہرایا جاتا ہے}}"
   },
   "4583714435275461910": {
      "message": "بنیادی فہرست کا آئٹم"
   },
   "4586373282767984140": {
      "message": "پیلا"
   },
   "4595551195988564947": {
      "message": "‏Google اسسٹنٹ خریداری کی فہرست میں تبدیلی ہو رہی ہے۔"
   },
   "4607656353105320648": {
      "message": "{count,plural, =1{ہمیشہ کے لیے نوٹ حذف کریں؟}other{ہمیشہ کے لیے نوٹس حذف کریں؟}}"
   },
   "4607802784047113873": {
      "message": "معاونین شامل کریں"
   },
   "4608848277887462246": {
      "message": "مزید شیٹس"
   },
   "461126197624379601": {
      "message": "دوسروں کے ساتھ اس فائل پر بحث کرنے کیلئے یہاں تھپتھپائیں"
   },
   "4620034373159179678": {
      "message": "صفحہ $1​ از $2​"
   },
   "4632830890362652221": {
      "message": "{NUM_ITEMS,plural, =1{آپ ایک فولڈر میں موجود آئٹم کو منتقل کر رہے ہیں}other{آپ ایک فولڈر میں موجود آئٹمز کو منتقل کر رہے ہیں}}"
   },
   "4634925432725098930": {
      "message": "پکسل"
   },
   "4643940860676429496": {
      "message": "محفوظ کیا جا رہا ہے…"
   },
   "4675792829115971960": {
      "message": "ہم اس نوٹ پر پرچم لگائیں گے اور اسے آپ کے اکاؤنٹ سے ہٹا دیں گے۔"
   },
   "4685321580747790677": {
      "message": "{every,plural, =1{ہفتہ وار {days} کو دہرایا جاتا ہے}other{ہر # ہفتوں بعد {days} کو دہرایا جاتا ہے}}"
   },
   "4690120479780049536": {
      "message": "پوائنٹس"
   },
   "4691283408020124345": {
      "message": "فہرست منظر"
   },
   "4697169479015785830": {
      "message": "کیلی گرافی ٹول کا رنگ اور سائز منتخب کنندہ کھولیں"
   },
   "4697673185436885400": {
      "message": "‏Sheets نے $1​ براؤزر$2​ کی بورڈ شارٹ کٹ اوور رائیڈ کر دیا"
   },
   "4698144269846224816": {
      "message": "سائز 1"
   },
   "4722167255291887189": {
      "message": "سائز 2"
   },
   "4727507448375670209": {
      "message": "معاونین"
   },
   "4738612839683751348": {
      "message": "آئٹم کی مزید حاشیہ بندی نہیں کی جا سکتی۔"
   },
   "4740100782728373253": {
      "message": "‏Drive میں محفوظ کریں"
   },
   "4748046231232264180": {
      "message": "Google Forms"
   },
   "4751202914935960324": {
      "message": "یہ ای میل پہلے سے موجود ہے"
   },
   "4752655540567953719": {
      "message": "پوزیشن $1​"
   },
   "4762625944764691132": {
      "message": "مرکزی مینو"
   },
   "47670360985205683": {
      "message": "‏\"$1​\" $2​ فائل کے زیادہ سے زیادہ سائز سے تجاوز کر رہا ہے جسے Google اسکین نہیں کر سکتا۔ اس سے آپ کے کمپیوٹر کو نقصان پہنچ سکتا ہے، اس لیے یہ فائل تبھی چلائیں جب آپ خطرات سے واقف ہوں۔"
   },
   "4767722428137216885": {
      "message": "منسوخ کریں"
   },
   "477328789314249432": {
      "message": "نوٹس تلاش کریں"
   },
   "4773737319879079980": {
      "message": "ایپ کے ساتھ زیادہ تیزی سے نوٹس بنائیں"
   },
   "4775368111547931093": {
      "message": "کوئی تفصیل نہیں ہے"
   },
   "4805047680716507619": {
      "message": " - اس میں منتقل کریں:"
   },
   "4806763987633034948": {
      "message": "PKCS7 Signature"
   },
   "4807444103404336088": {
      "message": "\"$1​\" پر ستارے کا نشان لگاتے ہوئے ایک مسئلہ پیش آگیا۔"
   },
   "4821130290026382049": {
      "message": "مقبول کی بورڈ شارٹ کٹس"
   },
   "4833214200453019325": {
      "message": "$1​ از $2​"
   },
   "4840513623749850224": {
      "message": "موویز"
   },
   "4847795993918486929": {
      "message": "تصویر سے متن اخذ نہیں ہو سکا۔ بعد میں دوبارہ کوشش کریں۔"
   },
   "4853788427396558692": {
      "message": "‎$1​ MB‎"
   },
   "4858389278403807208": {
      "message": "نوٹ کوڑے دان میں ہے"
   },
   "4863652737159067460": {
      "message": "سائن ان کریں"
   },
   "4864051612562026766": {
      "message": "{count,plural, =1{1 منتخب کیا گیا}other{# منتخب کیے گئے}}"
   },
   "4878012031550736317": {
      "message": "{NUM_ITEMS,plural, =0{unused plural form}=1{لوگ اس فائل تک رسائی سے محروم ہو جائیں گے، اگر وہ \"{TEAM_DRIVE_NAME}\" کے اراکین نہیں ہیں۔}other{لوگ ان فائلز تک رسائی سے محروم ہو جائیں گے، اگر وہ \"{TEAM_DRIVE_NAME}\" کے اراکین نہیں ہیں۔}}"
   },
   "4888104357342241891": {
      "message": "یاد دہانیاں"
   },
   "490045476479394048": {
      "message": "تبصرہ کرنے کیلئے متن ہائی لائٹ کریں"
   },
   "4901386320110714275": {
      "message": "پاس ورڈ غلط ہے۔ براہ کرم دوبارہ کوشش کریں۔"
   },
   "4906669330059413958": {
      "message": "پاس ورڈ جمع کرائیں"
   },
   "4907349694646937491": {
      "message": "نوٹ کو انڈیکس $1​ میں منتقل کر دیا گیا"
   },
   "4915450884407029247": {
      "message": "$1​ لیبل شامل ہو گیا۔"
   },
   "4918998818369420588": {
      "message": "غیر مہذب کی اطلاع دیں"
   },
   "4930422592340561418": {
      "message": "میری ڈرائیو"
   },
   "4948512233726694061": {
      "message": "$4​صفحہ$1​$5​$3​$1​$7​/$2​$6​$8​$1​"
   },
   "4955094356920130803": {
      "message": "امبر"
   },
   "4957674814179289955": {
      "message": "اگلے/پچھلے فہرست آئٹم میں نیویگیٹ کریں"
   },
   "4963784280521435720": {
      "message": "محفوظ ہو رہی ہے…"
   },
   "4974059227183970715": {
      "message": "آپ '#' ٹائپ کر کے بھی لیبلز شامل کر سکتے ہیں۔"
   },
   "4982284738093713321": {
      "message": "منتظم"
   },
   "4988132901627446385": {
      "message": "تفصیلات کے پینل میں توسیع کی گئی۔"
   },
   "5006765610090288212": {
      "message": "$1​ رنگ کا اطلاق ہو گیا"
   },
   "5008901799534614532": {
      "message": "حذف کریں"
   },
   "5009448218905630614": {
      "message": "ہٹائیں"
   },
   "5011858093760184160": {
      "message": "ستارے کا نشان ہٹائیں"
   },
   "5013331898336483156": {
      "message": "ایک نئی ڈومین میں میری ڈرائیو پر منتقل کریں؟"
   },
   "501475221876543407": {
      "message": "آپ جو نوٹس شامل کرتے ہیں وہ یہاں ظاہر ہوتے ہیں"
   },
   "5023623739220371850": {
      "message": "تصدیق کرنے میں ناکامی۔ جب آپ سائن ان ہوں گے تو تبدیلیاں مطابقت پذیر ہو جائیں گی۔"
   },
   "5041572047197549869": {
      "message": "ہر ماہ ایک ہی دن"
   },
   "5045725997997672553": {
      "message": "{weekNumber,plural, =1{ماہ کے پہلے {day} کو}=2{ماہ کے دوسرے {day} کو}=3{ماہ کے تیسرے {day} کو}=4{ماہ کے چوتھے {day} کو}other{ماہ کے آخری {day} کو}}"
   },
   "5046219519278664288": {
      "message": "iPhone & iPad"
   },
   "5046371569383796818": {
      "message": "رکھیں"
   },
   "5052461293250181960": {
      "message": "page down"
   },
   "5054818452036081005": {
      "message": "$2​رازداری$1​"
   },
   "5060107422621709815": {
      "message": "ریفریش کرنے میں ناکامی"
   },
   "5078184843381528205": {
      "message": "نوٹ پن کریں"
   },
   "5085332075590890665": {
      "message": "کالعدم کریں"
   },
   "5086862627563516607": {
      "message": "{NUM_ITEMS,plural, =0{unused plural form}=1{\"{TEAM_DRIVE_NAME}\" کے اراکین کو اس آئٹم تک رسائی حاصل ہو گی۔}other{\"{TEAM_DRIVE_NAME}\" کے اراکین کو ان آئٹمز تک رسائی حاصل ہو گی۔}}"
   },
   "5094400861508407603": {
      "message": "نقطہ کو ہٹا دیا گیا"
   },
   "5095987896933771566": {
      "message": "دستاویز پرنٹ کریں"
   },
   "509815948423424872": {
      "message": "نیویگیشن"
   },
   "5098941979861776792": {
      "message": "Enter"
   },
   "5121976648047240846": {
      "message": "لیبل ہٹائیں"
   },
   "5130903421326358933": {
      "message": "‏منسلکہ کو Google Drive میں محفوظ کرتے وقت ایک مسئلہ پیش آگیا۔"
   },
   "5134649253619244584": {
      "message": "لیبل حذف کریں"
   },
   "5140285776541296873": {
      "message": "حسب ضرورت"
   },
   "5140450179685369890": {
      "message": "{NUM_ITEMS_1,plural, =0{unused plural form}=1{{NUM_ITEMS_2} فولڈر {XXX_1} میں منتقل کر دیا گیا ہے۔}other{{NUM_ITEMS_2} فولڈرز {XXX_2} میں منتقل کر دیے گئے ہیں۔}}"
   },
   "5151247077945318396": {
      "message": "جس فولڈر میں کھولنا ہے اسے منتخب کرنے میں ایک خرابی پیش آگئی۔"
   },
   "5159511879001144721": {
      "message": "کوبالٹ نیلا"
   },
   "5167365673547406876": {
      "message": "{NUM_ITEMS,plural, =0{unused plural form}=1{\"{TEAM_DRIVE_NAME}\" کے اراکین کو رسائی حاصل ہو گی۔}other{\"{TEAM_DRIVE_NAME}\" کے اراکین کو رسائی حاصل ہو گی۔}}"
   },
   "5178674191443894176": {
      "message": "لیبلز"
   },
   "5180454621500142444": {
      "message": "بحال کریں"
   },
   "5180989337128758117": {
      "message": "بایاں بریکٹ"
   },
   "5182569285908080938": {
      "message": "اختتامی تاریخ کے اختیارات"
   },
   "5184692850089055965": {
      "message": "تصویر سے متن اخذ کریں"
   },
   "5184785218378634051": {
      "message": "آئٹم اب زوم کیا ہوا نہیں ہے۔"
   },
   "5197718200713913936": {
      "message": "C++‎"
   },
   "5201670213497642487": {
      "message": "تفصیلات پینل کا ٹیب بار۔ ٹیبز کے درمیان سوئچ کرنے کیلئے بائیں اور دائیں تیر کے نشان والی کلیدیں دبائیں۔"
   },
   "5202835861850747976": {
      "message": "$2​مزید جانیں$1​"
   },
   "5204391636475413312": {
      "message": "محفوظ کریں"
   },
   "5238284741118437734": {
      "message": "کالعدم کریں"
   },
   "5238307666527496111": {
      "message": "ٹھیک ہے"
   },
   "5238371081785912565": {
      "message": "$1​ کے ساتھ کھولیں"
   },
   "5253765183290980485": {
      "message": "آپ کو صرف \"$1​\" میں آئٹمز شامل کرنے اور ان میں ترمیم کرنے کی اجازت ہے، لہذا آپ اس کارروائی کو کالعدم نہیں کر سکیں گے۔"
   },
   "5255388116256536182": {
      "message": "‏تبصرہ کرنے کی خاطر سیلز کا انتخاب کرنے کیلئے تیر والی کلیدیں استعمال کریں۔ انتخاب کو پھیلانے کیلئے تیر والی کلیدوں کو دبائے رکھ کر شفٹ کو پکڑے رکھیں۔ ایک تبصرہ تیار کرنے کیلئے Enter یا منسوخ کرنے کیلئے Escape استعمال دبائیں۔"
   },
   "5259541708332520733": {
      "message": "ماخذ ہٹا دیا گیا"
   },
   "5271615049826004958": {
      "message": "لنک پیش منظر کے اختیارات"
   },
   "5281121179861637423": {
      "message": "$1​ تک رسائی کیلئے ایک پاس ورڈ درکار ہے۔ براہ کرم پاس ورڈ درج کریں"
   },
   "5288037028604092288": {
      "message": "XPS"
   },
   "5299648222246616124": {
      "message": "backtick"
   },
   "5300527252159851865": {
      "message": "فائل کا مواد متوقع فائل فارمیٹ سے مماثل نہیں ہے۔"
   },
   "5320475549855398784": {
      "message": "یہ ڈرائنگ اس وقت دستیاب ہوگی جب آپ آن لائن ہوں گے۔"
   },
   "5321772883765574323": {
      "message": "\"$1​\" $2​ سے $3​ میں منتقل کر دیا گیا۔"
   },
   "5334959887390704534": {
      "message": "‏ہم اس لیبل کو حذف کر دیں گے اور اسے آپ کے سبھی Keep نوٹس سے ہٹا دیں گے۔ آپ کے نوٹس حذف نہیں ہوں گے۔"
   },
   "5336801339221383042": {
      "message": "Javascript"
   },
   "5336924963122494935": {
      "message": "اسے منتخب کریں"
   },
   "534191528712675978": {
      "message": "Pause"
   },
   "534228323125524312": {
      "message": "زوم آؤٹ کریں"
   },
   "5353129315502554762": {
      "message": "سٹائل شیٹ"
   },
   "5353173068672429342": {
      "message": "آلات ڈیبگ کریں"
   },
   "5362962746518601227": {
      "message": "{NUM_ITEMS,plural, =1{آپ ایک فولڈر میں موجود ایک فائل کو منتقل کر رہے ہیں}other{آپ ایک فولڈر میں موجود فائلوں کو منتقل کر رہے ہیں}}"
   },
   "5363853533596749934": {
      "message": "لیبل کا نام درج کریں"
   },
   "5372143986724491245": {
      "message": "$1​ دن پہلے"
   },
   "5372160981898991853": {
      "message": "Publisher"
   },
   "5385273191513151655": {
      "message": "تھمب نیل کی تخلیق ہو رہی ہے..."
   },
   "5392844646168201484": {
      "message": "سائز 3"
   },
   "5394695048211047984": {
      "message": "ایک تاریخ شامل کریں"
   },
   "5398036630337418486": {
      "message": "‏Doc کھولیں"
   },
   "5399553230649155346": {
      "message": "$1​ گھنٹہ میں"
   },
   "5403636185480096151": {
      "message": "ٹی وی"
   },
   "540596856674438371": {
      "message": "اشتراک نہیں کر سکتے کیونکہ اشتراک آف ہے۔"
   },
   "5408091115193390231": {
      "message": "AutoCAD"
   },
   "5413225497191133249": {
      "message": "نوٹس کو پن کریں یا سے پن ہٹائیں"
   },
   "5423742603774911808": {
      "message": "فہرست بہت بڑی ہے۔"
   },
   "5435749276779042277": {
      "message": "+ $1​ مزید"
   },
   "5447119197363232006": {
      "message": "‏Drive میں دکھائیں"
   },
   "5455566801812656827": {
      "message": "کم"
   },
   "5465081454525683943": {
      "message": "یہ نوٹ آپ کے اکاؤنٹ کے ساتھ مزید اشتراک کردہ نہیں ہے۔  رسائی کیلئے مالک سے پوچھیں یا اجازت والے کسی اکاؤنٹ پر سوئچ کریں۔"
   },
   "5467649767578147801": {
      "message": "{NUM_ITEMS,plural, =0{unused plural form}=1{لوگ اس فائل تک رسائی سے محروم ہو جائیں گے، اگر وہ \"{TEAM_DRIVE_NAME}\" کے اراکین نہیں ہیں یا وہ {DOMAIN_NAME} سے باہر ہیں۔}other{لوگ ان فائلز تک رسائی سے محروم ہو جائیں گے، اگر وہ \"{TEAM_DRIVE_NAME}\" کے اراکین نہیں ہیں یا وہ {DOMAIN_NAME} سے باہر ہیں۔}}"
   },
   "5472312735475866917": {
      "message": "$1​ کی طرف سے تبصرہ۔"
   },
   "547865385964196102": {
      "message": "$1​ منٹ پہلے"
   },
   "5478662967017843220": {
      "message": "گہرا نیلا"
   },
   "5480497191725157666": {
      "message": "Esc"
   },
   "5482604275203517054": {
      "message": "بائیں"
   },
   "5503885447744017882": {
      "message": "$2​ کے باہر $1​ میں منتقل کریں؟"
   },
   "5506390497558702263": {
      "message": "{count,plural, =1{نوٹ آرکائیو سے نکال دیا گیا اور پن کر دیا گیا}other{# نوٹس آرکائیو سے نکال دیے گئے اور پن کر دیے گئے}}"
   },
   "5520112019886360037": {
      "message": "بند کریں"
   },
   "5539958940810433464": {
      "message": "نوٹ کو کوڑے دان میں ڈالیں"
   },
   "5542817571710587822": {
      "message": "فائل میں بہت زیادہ تصویریں ہیں۔"
   },
   "5545146751578623220": {
      "message": "Caps-Lock"
   },
   "5555182241047709329": {
      "message": "ایک مقام منتخب کریں"
   },
   "5555599189512365009": {
      "message": "سمجھ آ گئی"
   },
   "556742419793425318": {
      "message": "مسترد کریں"
   },
   "5581834527128285229": {
      "message": "\"$1​\" کو میری ڈرائیو میں شامل کرتے ہوئے ایک مسئلہ پیش آگیا۔"
   },
   "5598649706113950710": {
      "message": "ایڈیٹر"
   },
   "5627470193961862490": {
      "message": "آئندہ یاد دہانیوں والے نوٹس یہاں ظاہر ہوتے ہیں"
   },
   "564165666160590723": {
      "message": "Windows Media Player"
   },
   "5657974964218523724": {
      "message": "کوڑے دان خالی کریں"
   },
   "566719933273904590": {
      "message": "لیبل پر جائیں"
   },
   "5670235154099791694": {
      "message": "انچ"
   },
   "5672326933907786881": {
      "message": "‏مقفل اسکرین کے نوٹس خودکار طور پر Google Keep میں محفوظ ہوتے ہیں۔"
   },
   "5678095606167600931": {
      "message": "نقطہ داخل کر دیا گیا"
   },
   "568072913338360182": {
      "message": "HTML"
   },
   "5707549724380589079": {
      "message": "نشان زد آئٹمز کو حذف کریں؟"
   },
   "5713014647314396479": {
      "message": "بعد میں"
   },
   "5714240424645614611": {
      "message": "‏Android پیکیج"
   },
   "5714760273477184428": {
      "message": "تبصرہ کرنے کی خاطر کوئی حصہ ہائی لائٹ کرنے کے لیے تیر کے نشانات کا استعمال کریں، پھر انٹر دبائیں"
   },
   "5738003914096572768": {
      "message": "فعال کردہ"
   },
   "5755541943799933389": {
      "message": "\"$1​\" پر ستارے کا نشان لگا دیا گیا۔"
   },
   "577619047319778196": {
      "message": "انتخاب ختم کریں"
   },
   "5801257863595278616": {
      "message": "انتخاب بائیں منتقل کیا گیا۔"
   },
   "5820033033803019104": {
      "message": "منظم کریں"
   },
   "5826302153453971149": {
      "message": "ہلکا گلابی"
   },
   "5840202488368071194": {
      "message": "تصویر والا نیا نوٹ"
   },
   "5840330517914556080": {
      "message": "زوم آؤٹ کریں"
   },
   "5854158607727111728": {
      "message": "Tab"
   },
   "585503297543253590": {
      "message": "آن"
   },
   "5870134033985574990": {
      "message": "کھولا جا رہا ہے…"
   },
   "5871966496153339793": {
      "message": "ویڈیو $1​ کا تھمب نیل ڈسپلے کرنا"
   },
   "5895666393386604578": {
      "message": "حاشیہ لگانے کیلئے، اپنی فہرست پر موجود آئٹمز کو گھسیٹیں یا شارٹ کٹ $1​ استعمال کریں۔"
   },
   "5909490544352162901": {
      "message": "اس نوٹ تک رسائی کیلئے مالک سے پوچھیں یا اجازت والے کسی اکاؤنٹ پر سوئچ کریں۔ آپ $1​ کے بطور سائن ان ہیں۔"
   },
   "5911012384539794869": {
      "message": "کھولنے کا عمل شروع ہونے میں ناکام ہوگیا۔"
   },
   "591481266986424156": {
      "message": "$1​ براؤزر یہ کی بورڈ شارٹ کٹ فی الحال $2​ کے لیے استعمال کر رہا ہے"
   },
   "5916010927050975496": {
      "message": "‎$1​ KB‎"
   },
   "5917528552332886959": {
      "message": "حل شدہ تبصرے دکھائیں"
   },
   "5947790263929501779": {
      "message": "نقطہ میں تبدیل کر دیا گیا"
   },
   "5949528478488617689": {
      "message": "ڈاؤن لوڈ کی اجازت"
   },
   "5950887255133612666": {
      "message": "شروع نہیں ہوا۔"
   },
   "5954965790623966933": {
      "message": "قرمزی"
   },
   "5961981688037913870": {
      "message": "$1​ شامل ہو گئی"
   },
   "5965683144165568126": {
      "message": "فہرست کی آئٹم کی دوبارہ ترتیب لگ رہی ہے"
   },
   "5969696744752069015": {
      "message": "کوئی پیش منظر دستیاب نہیں ہے۔"
   },
   "597927944425927829": {
      "message": "ملکیت \"$1​\" سے آپ تک منتقل ہو جائے گی۔"
   },
   "5984398071085567332": {
      "message": "Google Fusion Tables"
   },
   "5987609488177213747": {
      "message": "لیبل بنائیں"
   },
   "5989809255170931770": {
      "message": "{time,plural, =1{‏# سیکنڈ میں Keep اپ ڈیٹ ہو جائے گی}other{‏# سیکنڈز میں Keep اپ ڈیٹ ہو جائے گی}}"
   },
   "6005084567691342649": {
      "message": "یاددہانیاں"
   },
   "6009962986062136164": {
      "message": "$1​ لوڈ ہو رہا ہے۔"
   },
   "6011637630664474614": {
      "message": "Space"
   },
   "6030537159236285525": {
      "message": "فہرست آئٹم کو اگلی/گزشتہ پوزیشن پر منتقل کریں"
   },
   "60305871484579258": {
      "message": "Alt"
   },
   "6033916931543811803": {
      "message": "{NUM_ITEMS_1,plural, =0{unused plural form}=1{{NUM_ITEMS_2} فولڈر {XXX_1} سے {XXX_2} میں منتقل کر دیا گیا ہے۔}other{{NUM_ITEMS_2} فولڈرز {XXX_3} سے {XXX_4} میں منتقل کر دیے گئے ہیں۔}}"
   },
   "6043578784980337112": {
      "message": "$1​ فائلوں کو $2​ میں منتقل کر دیا گیا ہے۔"
   },
   "6062216008944363143": {
      "message": "{weekNumber,plural, =1{ہر {every} ماہ بعد مہینے کے پہلے {day} کو دہرایا جاتا ہے۔}=2{ہر {every} ماہ بعد مہینے کے دوسرے {day} کو دہرایا جاتا ہے۔}=3{ہر {every} ماہ بعد مہینے کے تیسرے {day} کو دہرایا جاتا ہے۔}=4{ہر {every} ماہ بعد مہینے کے چوتھے {day} کو دہرایا جاتا ہے۔}other{ہر {every} ماہ بعد مہینے کے آخری {day} کو دہرایا جاتا ہے۔}}"
   },
   "6069780031254134657": {
      "message": "مکمل کے بطور نشان زد کریں"
   },
   "6087078248621415351": {
      "message": "ترمیم شدہ $1​"
   },
   "6100883940579706314": {
      "message": "لنک کا پیش منظر"
   },
   "6105571474005679446": {
      "message": "پیش منظر میں کوئی مسئلہ پیش آگیا۔"
   },
   "6113237889871930608": {
      "message": "خالی نوٹ"
   },
   "6118623991445349480": {
      "message": "صفحہ $1​"
   },
   "6122643025527543706": {
      "message": "Ctrl"
   },
   "6127325177382263770": {
      "message": "URLs"
   },
   "6128550071219729739": {
      "message": "تصویر حذف ہو گئی"
   },
   "6131822680770571276": {
      "message": "PowerPoint"
   },
   "6140634664402328750": {
      "message": "ایپس کی فہرست"
   },
   "6149175749937815029": {
      "message": "سبھی آئٹمز دیکھیں"
   },
   "616807262818311711": {
      "message": "قسم"
   },
   "6185886893933834031": {
      "message": "منتخب کردہ کو رکھیں"
   },
   "6186753450686672643": {
      "message": "{every,plural, =1{روزانہ دہرایا جاتا ہے}other{ہر # دن بعد دہرایا جاتا ہے}}"
   },
   "6201176165479907499": {
      "message": "{count,plural, =1{نوٹ پن ہو گیا}other{# نوٹس پن ہو گئے}}"
   },
   "6203260615455347677": {
      "message": "Numbers"
   },
   "6209117354086898503": {
      "message": "پیچھے"
   },
   "6211895332551673425": {
      "message": "$2​میری ڈرائیو$1​ میں شامل کر دیا گیا"
   },
   "6212070333807533570": {
      "message": "$2​میری ڈرائیو$1​ میں شامل کر رہے ہیں…"
   },
   "6223207695466118454": {
      "message": "YouTube"
   },
   "6224687211096863620": {
      "message": "کوئی بھی فرد"
   },
   "6252259197986158120": {
      "message": "گزشتہ کل"
   },
   "6263940822259442857": {
      "message": "چیک باکسز چھپائیں"
   },
   "628140343505892786": {
      "message": "ترتیبات"
   },
   "6286379137937560558": {
      "message": "مضمون"
   },
   "6286806453721792102": {
      "message": "‏Drive میں منظم کریں"
   },
   "6305748545202493254": {
      "message": "تفصیلات کا جھروکا دکھائیں/چھپائیں"
   },
   "6306268376900894985": {
      "message": "‏{endDate} تک دہرایا جاتا ہے"
   },
   "6324768448533022780": {
      "message": "$1​ $2​"
   },
   "6336194821483049583": {
      "message": "ڈیفالٹ مقامی ایپ"
   },
   "6347484050944915390": {
      "message": "درخواست بھیج دی گئی ہے۔ منظوری پر آپ کو ایک ای میل موصول ہوگا۔"
   },
   "6352952829934775705": {
      "message": "مزید"
   },
   "6366376928558090914": {
      "message": "غذا"
   },
   "6375244206466599493": {
      "message": "سال"
   },
   "6375395544374251820": {
      "message": "مزید صفحات کو لوڈ کرتے وقت ایک مسئلہ پیش آگیا۔ دوبارہ کوشش کر رہے ہیں…"
   },
   "6377664889539934": {
      "message": "ٹچ کے ساتھ ڈرا کریں"
   },
   "6381941041429900831": {
      "message": "معاون شامل کریں"
   },
   "6386587519843563719": {
      "message": "بائنری فائل"
   },
   "639451288140270562": {
      "message": "‏Google Docs میں کاپی ہو گیا"
   },
   "6394816510866826521": {
      "message": "Dogfoody"
   },
   "6413404795391222793": {
      "message": "ایک نئی فہرست کمپوز کریں"
   },
   "6416495701611778255": {
      "message": "تجویز کردہ فریق ثالث ایپس"
   },
   "6419411265907669340": {
      "message": "ﺁﺝ"
   },
   "6424277546995954045": {
      "message": "‏کی بورڈ اوور رائیڈ موجودہ براؤزر کے ساتھ دستیاب نہیں ہے۔ اس خصوصیت کو فعال کرنے کیلئے Chrome، Firefox، IE/Edge یا Safari پر تبدیل کریں"
   },
   "6428000916830484004": {
      "message": "بھورا"
   },
   "6432019580434957057": {
      "message": "آڈیو"
   },
   "6443615802319581315": {
      "message": "{NUM_ITEMS,plural, =1{آپ کو یہ فائل اس کے موجودہ فولڈرز سے منتقل کرنے کی اجازت نہیں ہے۔ اس کے بجائے فائل کو [{START_SPAN_1}{NAME}{END_SPAN} میں شامل کریں۔}other{آپ کو یہ فائلیں ان کے موجودہ فولڈرز سے منتقل کرنے کی اجازت نہیں ہے۔ اس کے بجائے فائلوں کو {START_SPAN_2}{NAME}{END_SPAN} میں شامل کریں۔}}"
   },
   "6450508807204492448": {
      "message": "$1​ آئیکن"
   },
   "6457802200418354862": {
      "message": "ناظرین ڈاؤن لوڈ کر سکتے ہیں"
   },
   "6459405233858728718": {
      "message": "Google Slides"
   },
   "6464761738227651511": {
      "message": "$1​ منٹ پہلے"
   },
   "6466736813846482957": {
      "message": "پیچھے"
   },
   "6466858417983764649": {
      "message": "جگہوں اور اوقات کیلئے نوٹس پر یاد دہانیاں سیٹ کریں، صوتی نوٹس لیں، اور آن لائن یا چاہے آف لائن کام کریں۔"
   },
   "6472238195689960152": {
      "message": "سفید"
   },
   "6473102097014191455": {
      "message": "ڈرائنگ نوٹ"
   },
   "6477306554098527424": {
      "message": "‏Google اسسٹنٹ"
   },
   "6480376252068839019": {
      "message": "گرڈ کے اختیارات کھولیں"
   },
   "6496683100661104868": {
      "message": "$2​اوپن سورس لائسنسز$1​"
   },
   "6497197865876438261": {
      "message": "موسیقی"
   },
   "6507257480072167483": {
      "message": "لیبل نام تبدیل ہو کر $1​ ہو گیا۔"
   },
   "6510131849363684615": {
      "message": "آئندہ کل"
   },
   "6513721414466645971": {
      "message": "ہٹ گیا"
   },
   "6522917155620379865": {
      "message": "ڈاؤن لوڈ کریں"
   },
   "6524849072392100692": {
      "message": "‏Google Drive فولڈر"
   },
   "653160061888539741": {
      "message": "پیشرفت کا کنٹرول"
   },
   "6571686604846453345": {
      "message": "‏اس آئٹم کو Drive میں شامل کرتے وقت ایک مسئلہ پیش آگیا۔"
   },
   "6578339688410021742": {
      "message": "\"$1​\" کے تمام اراکین کو آئٹمز تک رسائی حاصل ہو گی۔"
   },
   "6579707685908557993": {
      "message": "شام"
   },
   "6582286158693833652": {
      "message": "مزید جانیں"
   },
   "6588176324871799870": {
      "message": "‏Google Apps اسکرپٹ"
   },
   "6618562607681757575": {
      "message": "کسی بھی فولڈر سے منتقل نہ کریں، بس $3​$2​$1​ میں شامل کریں"
   },
   "6622304228074863427": {
      "message": "ایپلیکیشن"
   },
   "6627510416186113122": {
      "message": "ہلکا نیلگوں سبز"
   },
   "6650600936729710500": {
      "message": "جوابات۔"
   },
   "6664835828596108553": {
      "message": "اختیار"
   },
   "670419277288558500": {
      "message": "ویڈیو/آڈیو"
   },
   "6707173584987026005": {
      "message": "آج"
   },
   "6710728478489145370": {
      "message": "بند کریں"
   },
   "6713235295664405475": {
      "message": "پر|کو"
   },
   "6715985122107380503": {
      "message": "ریکارڈنگز"
   },
   "6726462693927865256": {
      "message": "تفصیلات"
   },
   "6726879257388338969": {
      "message": "پرنٹ کریں"
   },
   "6732800471045353930": {
      "message": "اس نوٹ کا اشتراک زیادہ سے زیادہ لوگوں کے ساتھ کیا گیا ہے۔"
   },
   "673551770550324419": {
      "message": "چوڑائی میں فِٹ کریں"
   },
   "6747379635033535953": {
      "message": "نئے آئٹمز کو نیچے شامل کریں"
   },
   "6747528043814108113": {
      "message": "$1​ میں سوئچ ہو گیا"
   },
   "6749829802551750923": {
      "message": "اوپر"
   },
   "6750600017746655174": {
      "message": "اختیار"
   },
   "6750827506231593056": {
      "message": "اکاؤنٹس سوئچ کریں"
   },
   "6761622351199419182": {
      "message": "نوٹ آرکائیو میں ہے"
   },
   "6773222938695237983": {
      "message": "{NUM_ITEMS,plural, =0{Unused}=1{اس آئٹم کا اشتراک کریں؟}other{ان آئٹمز کا اشتراک کریں؟}}"
   },
   "6778577079172085976": {
      "message": "پن کردہ"
   },
   "678660085936036852": {
      "message": "تصاویر پر کارروائی ہو رہی ہے…"
   },
   "6787580031482277539": {
      "message": "کبھی نہیں"
   },
   "6797862596948579998": {
      "message": "‏Chrome ایپ"
   },
   "6798055902819777633": {
      "message": "ٹچ کے ساتھ پین کریں"
   },
   "6801348618370627980": {
      "message": "$1​ لیبل تخلیق ہو گیا۔"
   },
   "6815042072535422726": {
      "message": "آڈیو حذف کر دیا گیا"
   },
   "681598652078493281": {
      "message": "مزید جانیں"
   },
   "6822520214440117457": {
      "message": "دفتر"
   },
   "6823109315717909214": {
      "message": "اسے آزمائیں"
   },
   "6831650827360444197": {
      "message": "نوٹ کا اشتراک ختم کر دیا گیا۔"
   },
   "6833062695195555756": {
      "message": "صافی ٹول کے اختیارات کا مینو کھولیں"
   },
   "6833760103261954639": {
      "message": "اس صفحہ کو لوڈ کرتے وقت ایک مسئلہ پیش آگیا۔ دوبارہ کوشش کر رہے ہیں…"
   },
   "6861978427131390279": {
      "message": "تاثرات بھیجیں"
   },
   "687402923448150707": {
      "message": "غیر نشان زد کردہ"
   },
   "689017442055275529": {
      "message": "$1​ کا فیملی گروپ"
   },
   "6891563484025164308": {
      "message": "پیچھے"
   },
   "6898823203505321799": {
      "message": "تفصیلات"
   },
   "6904351530369058983": {
      "message": "مالک"
   },
   "691041991673354191": {
      "message": "مجھ کو ہٹا دیں"
   },
   "6918505531548047245": {
      "message": "ہائی لائٹر ٹول"
   },
   "6921237745237410511": {
      "message": "تبصرہ شامل کریں"
   },
   "6922953828399110511": {
      "message": "ناظر کو بند کریں"
   },
   "693770783324368110": {
      "message": "نوٹس سے پن ہٹا دی گئی اور کوڑے دان میں ڈال دیے گئے"
   },
   "695253297035211081": {
      "message": "کوڑے دان خالی کریں"
   },
   "6980199665979997122": {
      "message": "بحال کریں"
   },
   "6982682101118067511": {
      "message": "منظم کی جا رہی ہے…"
   },
   "701276785305022936": {
      "message": "خراب دستاویز۔ براہ کرم یقینی بنائیں کہ فائل جدید ترین فارمیٹ میں ہے۔"
   },
   "7017485862232001373": {
      "message": "\"$1​\" کو $2​ میں شامل کر دیا گیا۔"
   },
   "7019002927048576918": {
      "message": "$1​ تلاش کے فلٹرز"
   },
   "7030308038380934896": {
      "message": "‏Google Docs میں کاپی کرنے میں ناکام"
   },
   "7050021021988648361": {
      "message": "‏URL کاپی کریں"
   },
   "7050898523853841537": {
      "message": "فریکوئنسی کے اختیارات"
   },
   "7054631817922169541": {
      "message": "‏Google Keep میں غیر محفوظ کردہ تبدیلیاں ہیں۔ کیا آپ یہ صفحہ چھوڑنا اور اپنی تبدیلیاں مسترد کرنا چاہتے ہیں؟"
   },
   "705714112650622350": {
      "message": "‏آئٹم کو Google Drive میں شامل کرتے وقت ایک مسئلہ پیش آ گیا۔"
   },
   "7059437903473652416": {
      "message": "‏YouTube ویڈیو $1​ چلائیں"
   },
   "7065454163742312322": {
      "message": "مزید رنگ"
   },
   "7066744251212631722": {
      "message": "لائم"
   },
   "7084324152376766809": {
      "message": "$1​ دن پہلے"
   },
   "7084991134824194740": {
      "message": "مجھے یاد دلائیں"
   },
   "7086801490719148597": {
      "message": "اسے غیر منتخب کریں"
   },
   "7094548885298700726": {
      "message": "گہرا بھورا"
   },
   "7120211249329066227": {
      "message": "آپ نے 'اسسٹنٹ' حاصل کر لیا ہے!"
   },
   "7121259585839664942": {
      "message": "منسوخ کریں"
   },
   "7126326627883991568": {
      "message": "موجودہ ڈرائنگ حذف کریں"
   },
   "7126535013613878060": {
      "message": "اپنے اہم نوٹس کو سب سے اوپر پن کریں۔"
   },
   "7135182401951359795": {
      "message": "ملکیت آپ کو منتقل کر دی جائے گی۔"
   },
   "7141983486405549971": {
      "message": "Insert"
   },
   "7145753028985071097": {
      "message": "نوٹ کی ترتیب دوبارہ لگ رہی ہے"
   },
   "7146242673022399081": {
      "message": "ٹیکسٹ"
   },
   "7148992630785407972": {
      "message": "یہ فائل پاس ورڈ کے ذریعے تحفظ یافتہ ہے اور اس کا پیش منظر نہیں دیکھا جا سکتا ہے۔"
   },
   "7153847618034547771": {
      "message": "فعال کریں"
   },
   "7161134329606048317": {
      "message": "بند کریں"
   },
   "7161718175684624843": {
      "message": "لیبل ہٹائیں"
   },
   "7164532930742017984": {
      "message": "لنک کے ساتھ کوئی بھی فرد"
   },
   "7166989725427500881": {
      "message": "کوڑے دان شدہ نوٹ منتخب کریں"
   },
   "7174189954350964804": {
      "message": "دوبارہ کوشش کریں"
   },
   "7174908348310449675": {
      "message": "اپنی یاد دہانیوں کے ڈیفالٹس کو حسب ضرورت بنائیں"
   },
   "7181961085183734135": {
      "message": "اس فائ‏ل کیلئے پرنٹنگ غیر فعال ہے"
   },
   "7201188472754345797": {
      "message": "{NUM_ITEMS,plural, =0{unused plural form}=1{لوگ اس فائل تک رسائی سے محروم ہو جائیں گے، اگر وہ \"{DESTINATION_DOMAIN}\" سے باہر ہیں۔}other{لوگ ان فائلز تک رسائی سے محروم ہو جائیں گے، اگر وہ \"{DESTINATION_DOMAIN}\" سے باہر ہیں۔}}"
   },
   "7218693060378095915": {
      "message": "نیا"
   },
   "722264179594523168": {
      "message": "منسوخ کریں"
   },
   "7225445911355686176": {
      "message": "آرکائیو کردہ نوٹ منتخب کریں"
   },
   "722702934847795304": {
      "message": "Project"
   },
   "7231231875581131930": {
      "message": "{NUM_ITEMS,plural, =0{Unused}=1{اس آئٹم کو \"{TEAM_DRIVE_NAME}\" میں واپس منتقل نہیں کیا جا سکتا لہذا آپ اس عمل کو کالعدم نہیں کر سکیں گے۔}other{کم از کم ایک آئٹم کو \"{TEAM_DRIVE_NAME}\" میں واپس منتقل نہیں کیا جا سکتا لہذا آپ اس عمل کو کالعدم نہیں کر سکیں گے۔}}"
   },
   "723223692006219983": {
      "message": "پوائنٹ"
   },
   "7247530225058410142": {
      "message": "$2​ $1​"
   },
   "7247965266239591227": {
      "message": "\"$1​\" کو کھولنے میں ایک مسئلہ پیش آگیا۔"
   },
   "7251490702980298031": {
      "message": "ہائی لائٹر ٹول کا رنگ اور سائز منتخب کنندہ کھولیں"
   },
   "7265183966796883739": {
      "message": "حل شدہ تبصرے چھپائیں"
   },
   "7278398674737413598": {
      "message": "دستاویز کو تبدیل کرنے سے قاصر۔"
   },
   "7278859550373246865": {
      "message": "{count,plural, =1{نوٹ آرکائیو ہو گیا}other{# نوٹس آرکائیو ہو گئے}}"
   },
   "7290932540630116546": {
      "message": "یاد دہانی سیٹ ہو گئی۔ $1​"
   },
   "7295254213841803546": {
      "message": "تبدیلیاں مسترد کریں؟  آپ کی تبدیلیاں محفوظ نہیں ہوں گی۔"
   },
   "7299749713933143099": {
      "message": "جامنی"
   },
   "7304355547638486270": {
      "message": "آڈیو ڈاؤن لوڈ کریں ($1​)"
   },
   "7306962184871750459": {
      "message": "ملکیت $3​ میں \"$4​\" سے $1​ میں \"$2​\" تک منتقل ہو جائے گی۔"
   },
   "7337660181466605745": {
      "message": "‏Drive میں \"$1​\" اپ ڈیٹ کرنے میں ناکامی ہوئی۔"
   },
   "7342923890755029722": {
      "message": "بند کریں"
   },
   "7344507440412470266": {
      "message": "انتخاب پھیلا دیا گيا۔"
   },
   "734478884582426793": {
      "message": "کمپریسڈ آرکائیو"
   },
   "7353547650196788656": {
      "message": "سرخ"
   },
   "7364571366369083618": {
      "message": "ویڈیو"
   },
   "7376703418960184879": {
      "message": "کاپی کریں"
   },
   "7377239345926788722": {
      "message": "کارروائیاں"
   },
   "7382688299146249119": {
      "message": "آئٹم ڈاؤن لوڈ کریں"
   },
   "7388342865555961406": {
      "message": "$1​ دن میں"
   },
   "7393771571081973549": {
      "message": "C"
   },
   "7420117636241237177": {
      "message": "\"درآمد کریں: $2​\" لیبل کے تحت آپ کے میل اکاؤنٹ میں $1​ سے پیغامات کو کھول دیا گیا۔"
   },
   "7426603384368095928": {
      "message": "پھر سے سائن ان کرنے کیلئے صفحہ دوبارہ لوڈ کریں اور کام کرنا جاری رکھیں۔"
   },
   "7427333772418801813": {
      "message": "$1​+ مزید بٹن پھیل گیا"
   },
   "7429084719905985261": {
      "message": "Objective C"
   },
   "7432956605646331928": {
      "message": "SQL"
   },
   "7440735091552109962": {
      "message": "$2​ (ترمیم کردہ $1​)"
   },
   "7441891675459021164": {
      "message": "‏Drive میں محفوظ ہو رہا ہے"
   },
   "744753705925710199": {
      "message": "معذرت، ان سبھی فائلوں کیلئے ہم اس ایپ کو اجازت نہیں دے سکے جن کو آپ نے کھولنے کی کوشش کی۔ براہ کرم دوبارہ کوشش کریں۔"
   },
   "7452116603589558390": {
      "message": "پن کردہ نوٹ غیر منتخب کریں"
   },
   "7453297286571818554": {
      "message": "‏Google Docs میں کاپی کریں"
   },
   "7453307802804717178": {
      "message": "ہلکا نیلا"
   },
   "7458942806393710991": {
      "message": "آرکائیو کردہ نوٹ غیر منتخب کریں"
   },
   "7464780237502381438": {
      "message": "مزید ایپس منسلک کریں"
   },
   "7468842863971844562": {
      "message": "نئی فہرست"
   },
   "7469895656894091562": {
      "message": "یہ ای میل درست نہیں ہے"
   },
   "7482924911694634213": {
      "message": "{weekNumber,plural, =1{ماہ کے پہلے {day} کو ماہانہ دہرایا جاتا ہے}=2{]ماہ کے دوسرے {day} کو ماہانہ دہرایا جاتا ہے}=3{ماہ کے تیسرے {day} کو ماہانہ دہرایا جاتا ہے}=4{ماہ کے چوتھے {day} کو ماہانہ دہرایا جاتا ہے}other{ماہ کے آخری {day} کو ماہانہ دہرایا جاتا ہے}}"
   },
   "7483088916037874359": {
      "message": "فائل بہت بڑی ہے۔ "
   },
   "7488945223835574498": {
      "message": "Postscript"
   },
   "7503234138288940590": {
      "message": "تلاش کریں"
   },
   "7507827375601925075": {
      "message": "نوٹ کو اگلی/گزشتہ پوزیشن پر منتقل کریں"
   },
   "7516769578943800930": {
      "message": "نشان زد کردہ"
   },
   "7528204871156404767": {
      "message": "Safari"
   },
   "7529683448345488779": {
      "message": "درج کردہ پاس ورڈ غلط تھا؛ براہ کرم کوئی دوسرا پاس ورڈ درج کریں۔"
   },
   "7530677128711603655": {
      "message": "\"$1​\" کیلئے تلاش کے نتائج"
   },
   "754367112212424716": {
      "message": "آج بعد میں"
   },
   "7564771400033548584": {
      "message": "{selectedCount,plural, =1{# منتخب کردہ}other{# منتخب کردہ}}"
   },
   "7565383798249439151": {
      "message": "$1​ دنوں میں"
   },
   "7579280421767578228": {
      "message": "کسی دن کیلئے یاد دہانی"
   },
   "7586291841734385643": {
      "message": "پاپ آؤٹ کریں"
   },
   "7587936635257676112": {
      "message": "$1​ شامل کر دیا"
   },
   "7598582624136632660": {
      "message": "تلاش بار کھولیں / اگلا تلاش کریں"
   },
   "7598850438299201663": {
      "message": "\"$1​\" کھل رہی ہے…"
   },
   "7599358608613738069": {
      "message": "حذف کریں"
   },
   "7604275940271852148": {
      "message": "اپنے میل اکاؤنٹ میں کھولیں"
   },
   "7604400308311739073": {
      "message": "پن کریں"
   },
   "7610628906656867728": {
      "message": "آرکائیو"
   },
   "7610654194202731772": {
      "message": "حذف کریں"
   },
   "7624042048123264803": {
      "message": "نوٹ کھولیں"
   },
   "7629685876277801112": {
      "message": "اس نقشے کی فائل کو ڈسپلے کرتے وقت ایک مسئلہ پیش آ گیا۔"
   },
   "7630723924002267143": {
      "message": "کی بورڈ شارٹ کٹس فعال ہیں۔"
   },
   "7631302417932873160": {
      "message": "فائل کو وائرسز کیلئے اسکین نہیں کر سکتے"
   },
   "7648759818896108920": {
      "message": "$1​+"
   },
   "7649506133540465463": {
      "message": "کارروائی کالعدم نہیں کی جا سکی۔"
   },
   "7653702763016575386": {
      "message": "نیلا"
   },
   "7656983816661099886": {
      "message": "چیزیں"
   },
   "7659047104232758352": {
      "message": "وہ|یہ"
   },
   "7669677145513127809": {
      "message": "‏Team Drives کے درمیان منتقل کریں؟"
   },
   "7669846901402551021": {
      "message": "ﺁﺝ"
   },
   "7690349821507417537": {
      "message": "فہرست آئٹم $1​ کو ہٹا دیا گيا"
   },
   "7690355160889785521": {
      "message": "سبز"
   },
   "7691521283331762131": {
      "message": "آپ کے آرکائیو کردہ نوٹس یہاں ظاہر ہوتے ہیں"
   },
   "7709557808259730054": {
      "message": "منظوریاں"
   },
   "7709889936233398701": {
      "message": "ہٹائیں"
   },
   "7715735412192018288": {
      "message": "مدد"
   },
   "7715892737835649602": {
      "message": "آپ '#' ٹائپ کر کے بھی لیبلز شامل کر سکتے ہیں۔"
   },
   "772000107335590599": {
      "message": "$1​ منٹ میں"
   },
   "7724602581120994002": {
      "message": "نارنجی"
   },
   "7728066040934031356": {
      "message": "جامنی"
   },
   "7734578122414851725": {
      "message": "PHP"
   },
   "7735981667219692675": {
      "message": "{resultCount,plural, =1{# تلاش کا نتیجہ}other{# تلاش کے نتائج}}"
   },
   "774390292128857049": {
      "message": "تلاش کریں"
   },
   "7751981235297474273": {
      "message": "کالعدم کریں"
   },
   "7754093419850121316": {
      "message": "⌘"
   },
   "7757440777278143092": {
      "message": "گہرا خاکستری"
   },
   "7772544658778579390": {
      "message": "دستاویز میں تلاش کریں"
   },
   "777546328624962090": {
      "message": "‏یہ فائل اپ لوڈ نہیں کر سکتے۔ ہم ‎$2​MB‎ اور $3​ میگاپکسلز سے کم کی $1​ فائلیں قبول کرتے ہیں۔"
   },
   "778181404304502404": {
      "message": "آئٹم کو زوم آؤٹ کیا گیا۔"
   },
   "7791050524692390574": {
      "message": "رنگ"
   },
   "7800318069267901681": {
      "message": "ترمیم کردہ"
   },
   "7814778057875152792": {
      "message": "‏Google Drive میں منتخب کردہ فولڈر میں منسلکہ کو منتقل کرتے وقت ایک مسئلہ پیش آگیا۔"
   },
   "7821512290975371360": {
      "message": "شوخ گلابی"
   },
   "7828886646639771557": {
      "message": "ایک نوٹ لیں…"
   },
   "7830513726270865588": {
      "message": "کیلنڈر"
   },
   "7842164552344536314": {
      "message": "منظم کیا جا رہا ہے…"
   },
   "7844842290699524598": {
      "message": "لیبل کی حد تک پہنچ گئے۔ ایک نیا لیبل شامل کرنے کیلئے ایک موجودہ لیبل حذف کریں۔"
   },
   "7845751753397906805": {
      "message": "متضاد ترامیم ملیں"
   },
   "785840448809859989": {
      "message": "وقت کے اختیارات"
   },
   "7865240075542402013": {
      "message": "ستارے کا نشان شامل کریں"
   },
   "7868324478160174739": {
      "message": "نیلا"
   },
   "7873060817438017568": {
      "message": "$2​ - $1​"
   },
   "7873698934773957560": {
      "message": "کوئی نہیں"
   },
   "787773550893657271": {
      "message": "پچھلی ڈرائنگ کھول دی گئی"
   },
   "7888520165977111723": {
      "message": "‏Team Drive میں منتقل کریں؟َ"
   },
   "7895643887742936844": {
      "message": "سیمی کولن"
   },
   "7906726367011430855": {
      "message": "مربوط کریں"
   },
   "7910887984113996757": {
      "message": "اشتراک آن کریں"
   },
   "7922692430438844436": {
      "message": "کھولیں"
   },
   "792315196550007047": {
      "message": "کوئی مماثل نتائج نہیں ہیں۔"
   },
   "7943657844420237650": {
      "message": "OpenOffice Impress"
   },
   "7946114032014914338": {
      "message": "{repeatSentence}. {endSentence}"
   },
   "7947001788143789176": {
      "message": "لوڈ ہو رہی ہے…"
   },
   "7959130747647079558": {
      "message": "{selectedCount,plural, =1{# نوٹ منتخب ہو گیا}other{# نوٹس منتخب ہو گئے}}"
   },
   "7976461426527138085": {
      "message": "فہرستیں"
   },
   "7988058806865329896": {
      "message": "تاریخ اور وقت منتخب کریں"
   },
   "7991475666499751798": {
      "message": "یاددہانی کو 'ہو گئی' کے بطور نشان زد کریں"
   },
   "7996360883730444101": {
      "message": "معذرت، اس فائل کو کھولتے وقت ایک خرابی پیش آگئی۔ براہ کرم دوبارہ کوشش کریں۔"
   },
   "7998118521140187915": {
      "message": "حل شدہ تبصرے پوشیدہ ہیں"
   },
   "8003252582874834655": {
      "message": "‏آئٹمز کو Team Drive میں منتقل کرنے سے رسائی اور ملکیت تبدیل ہو جاتی ہے۔"
   },
   "8010075936095394680": {
      "message": "فائل ورژن بہت پرانا ہے۔ براہ کرم یقینی بنائیں کہ فائل جدید ترین فارمیٹ میں ہے۔ "
   },
   "8011497727123874703": {
      "message": "$1​ فولڈر بٹن"
   },
   "8013687642711017862": {
      "message": "{NUM_ITEMS_1,plural, =0{unused plural form}=1{آپ ایک آئٹم اشتراک کردہ فولڈرز سے باہر منتقل کر رہے ہیں، لہذا لوگ اس تک رسائی سے محروم ہو جائیں گے۔}other{آپ {NUM_ITEMS_2} آئٹمز اشتراک کردہ فولڈرز سے باہر منتقل کر رہے ہیں، لہذا لوگ ان تک رسائی سے محروم ہو جائیں گے۔}}"
   },
   "8019402848412685977": {
      "message": "\"$2​\" کا نام تبدیل کرکے \"$1​\" کر دیا گیا۔"
   },
   "802668096552856965": {
      "message": "{checkedItemCount,plural, =1{# مکمل شدہ آئٹم}other{# مکمل شدہ آئٹمز}}"
   },
   "8043514121228710092": {
      "message": "تصویر شامل کریں"
   },
   "8044700199531805239": {
      "message": "$3​$1​$2​ کو مربوط کر دیا گيا ہے۔"
   },
   "8046884224424523922": {
      "message": "{NUM_ITEMS_1,plural, =0{unused plural form}=1{{NUM_ITEMS_2} فائل {XXX_1} سے {XXX_2} میں منتقل کر دی گئی ہے۔}other{{NUM_ITEMS_2} فائلز {XXX_3} سے {XXX_4} میں منتقل کر دی گئی ہیں۔}}"
   },
   "8063817953234049242": {
      "message": "انتخاب کرنے کا ٹول"
   },
   "8066398070826666542": {
      "message": "{count,plural, =1{+ # مکمل شدہ آئٹم}other{+ # مکمل شدہ آئٹمز}}"
   },
   "8069384932934428393": {
      "message": "$1​ منٹ میں"
   },
   "807840433749698811": {
      "message": "سبزی مائل نیلا"
   },
   "8080583426915938264": {
      "message": "آپ کے کمپیوٹر پر موجود ایپس"
   },
   "8085493757603803516": {
      "message": "انتخاب میں ترمیم کریں"
   },
   "8090743714060857028": {
      "message": "ناظرین ڈاؤن لوڈ نہیں کر سکتے ہیں"
   },
   "8095838445486198080": {
      "message": "{FILE_SIZE,plural, =0{0 بائٹس}=1{1 بائٹ}other{# بائٹس}}"
   },
   "8111632928339277375": {
      "message": "{NUM_FOLDERS,plural, =1{ایک فولڈر سے منتقل کریں}=2{دونوں فولڈرز سے منتقل کریں}other{تمام # فولڈرز سے منتقل کریں}}"
   },
   "8125425371755035523": {
      "message": "کالعدم کریں"
   },
   "8133866583554546341": {
      "message": "$1​, $2​"
   },
   "8135145577663029437": {
      "message": "دونوں کو رکھیں"
   },
   "8139785559888164453": {
      "message": "مزید جانیں"
   },
   "8144512434938656483": {
      "message": "یا"
   },
   "8146560259680897627": {
      "message": "منسوخ کریں"
   },
   "8149439558305434788": {
      "message": "$1​، $2​"
   },
   "8159493406018222636": {
      "message": "تاثرات بھیجیں"
   },
   "8163781449224244510": {
      "message": "انتخاب سکیڑ دیا گيا۔"
   },
   "8174654098152723289": {
      "message": "تفصیل میں ترمیم کریں"
   },
   "818217888086545352": {
      "message": "پیلا"
   },
   "8189126656205301402": {
      "message": "‏Google Docs میں کاپی کریں"
   },
   "8194941811853358224": {
      "message": "\"$1​\" سے ستارے کا نشان ہٹاتے ہوئے ایک مسئلہ پیش آگیا۔"
   },
   "821942580510564685": {
      "message": "یہ دستاویز دیکھنے کیلئے براہ کرم اس کا پاس ورڈ درج کریں"
   },
   "8223878224920694193": {
      "message": "ہر بار"
   },
   "8224193807932432983": {
      "message": "کارروائیاں"
   },
   "8225614702924834215": {
      "message": "مزید اختیارات"
   },
   "8231449936104909428": {
      "message": "‏\"$1​\" کو Drive میں منتخب فولڈر میں منتقل کرتے ہوئے ایک مسئلہ پیش آگیا۔"
   },
   "8233945959714786736": {
      "message": "گزشتہ"
   },
   "8242655297101700529": {
      "message": "میری ڈرائیو"
   },
   "826433162451399549": {
      "message": "آئندہ کل"
   },
   "8273434617910595878": {
      "message": "نیچے"
   },
   "8281141013543828574": {
      "message": "Raw Image"
   },
   "8292708563843446267": {
      "message": "آئٹمز کی ملکیت \"$1​\" کے پاس ہو گی۔"
   },
   "8304474373444239435": {
      "message": "$1​ کی طرف سے جواب۔"
   },
   "8305505634689906340": {
      "message": "'$1​' کے اندر ہی تلاش کریں"
   },
   "8322416564157128458": {
      "message": "اشتراک"
   },
   "8332720954679654953": {
      "message": "ایپ ڈاؤن لوڈز"
   },
   "8337582740675387693": {
      "message": "Java"
   },
   "8342620486324515462": {
      "message": "برخاست کریں"
   },
   "837692854094319105": {
      "message": "مندرجہ ذیل صارفین کے ساتھ اشتراک نہیں ہو سکتا کیونکہ ان کے منتظم نے ان کی ڈومین سے باہر اشتراک غیر فعال کیا ہوا ہے۔"
   },
   "8379952094517631162": {
      "message": "نہیں"
   },
   "8409190394690387796": {
      "message": "ایک تبصرہ شامل کریں"
   },
   "8412098268689886334": {
      "message": "ضم کریں"
   },
   "8412733496413412439": {
      "message": "آف لائن"
   },
   "84334343973701810": {
      "message": "Home"
   },
   "8452647597930138120": {
      "message": "تبصرہ کرنے کیلئے کوئی سیل ہائی لائٹ کریں"
   },
   "8453627484113670693": {
      "message": "ہلکا نارنگی"
   },
   "8467894483369467251": {
      "message": "Flash"
   },
   "8471029293590878384": {
      "message": "موقوف کریں"
   },
   "8493378997610580289": {
      "message": "مزید شارٹ کٹس"
   },
   "8505989225387082493": {
      "message": "لیبل شامل کریں"
   },
   "8509270263487836281": {
      "message": "سائن ان کریں"
   },
   "8517148045938431718": {
      "message": "خرابیوں کو ٹھیک کریں"
   },
   "8535303351837089357": {
      "message": "‏‎{‎modifierKey}+Z اور ‎{‎modifierKey}+‎Y‎‎ کے ساتھ آپ تبدیلیاں کالعدم یا انہیں دوبارہ کر سکتے ہیں۔"
   },
   "8562196940800756925": {
      "message": "مارکر ٹول"
   },
   "8589423377647285975": {
      "message": "$1​ $2​ فہرست آئٹم $3​۔"
   },
   "8591848339430983053": {
      "message": "نوٹس"
   },
   "8595175575778060149": {
      "message": "مزید"
   },
   "8596279649507974639": {
      "message": "یہاں منتقل کریں"
   },
   "8602525917014156029": {
      "message": "مقامات"
   },
   "8616342546716995946": {
      "message": "سمجھ آگئی"
   },
   "8621067185485606452": {
      "message": "ECMAScript"
   },
   "8621178077822096827": {
      "message": "فہرست آئٹم $1​ کو داخل کر دیا گیا"
   },
   "8626694988569301667": {
      "message": "ڈرائنگ دستیاب نہیں ہے"
   },
   "8637215430007224613": {
      "message": "اگلی ڈرائنگ کھول دی گئی"
   },
   "8646821180780920830": {
      "message": "لیبلز"
   },
   "8652657235429996594": {
      "message": "جلدی"
   },
   "8660016472468563221": {
      "message": "کولن"
   },
   "8663507590720636709": {
      "message": "$1​ +$2​ مزید"
   },
   "8663993454460982287": {
      "message": "چیک باکسز چھپائے گئے"
   },
   "8674222789100049233": {
      "message": "بند کریں"
   },
   "86815590954366945": {
      "message": "آرکائیو کردہ مواد کی فہرست"
   },
   "8708723278154759600": {
      "message": "نوٹس آرکائیو ہو گئے"
   },
   "8726038895018570620": {
      "message": "لنک پر جائیں"
   },
   "8734569874711220205": {
      "message": "نیویگیشن مینو"
   },
   "8738345098829705526": {
      "message": "سائز 12"
   },
   "8742388056829916665": {
      "message": "رچ لنک پیش منظر ڈسپلے کریں"
   },
   "8773943264600860531": {
      "message": "Internet Explorer"
   },
   "8775097441636640256": {
      "message": "$2​ - $1​"
   },
   "8781837301864053001": {
      "message": "Rich Text"
   },
   "8786673003584562680": {
      "message": "Pg-Up"
   },
   "8792038552136453044": {
      "message": "افوہ! کچھ غلط ہوگیا"
   },
   "8793166064242077041": {
      "message": "اس تصویر کو ڈسپلے کرتے وقت ایک مسئلہ پیش آگیا۔"
   },
   "8822326207328431952": {
      "message": "تصویر کے اپ لوڈز دستیاب نہیں ہیں"
   },
   "8825353897919495748": {
      "message": "{NUM_ITEMS,plural, =0{unused plural form}=1{کیا آپ واقعی یہ فائل منتقل کرنا چاہتے ہیں؟}other{کیا آپ واقعی ان فائلوں کو منتقل کرنا چاہتے ہیں؟}}"
   },
   "8845176264121061589": {
      "message": "سبھی آئٹمز کو غیر نشان زد کریں"
   },
   "8851252390780816895": {
      "message": "کلائنٹ لاگ"
   },
   "8852550049823214385": {
      "message": "پھر"
   },
   "8860658114732392347": {
      "message": "یاد دہانی حذف کریں"
   },
   "8867634760949689122": {
      "message": "فائل کو تبدیل نہیں کیا جا سکا: تبدیل کرنے کا وقت ختم ہو گیا۔ براہ کرم بعد میں دوبارہ کوشش کریں۔"
   },
   "8868758864963683383": {
      "message": "نوٹ غیر منتخب کریں"
   },
   "8869202143464930500": {
      "message": "ملکیت $1​ میں منتقل کریں؟"
   },
   "887001400549949730": {
      "message": "نئی ونڈو میں کھولیں"
   },
   "888015650266122140": {
      "message": "بار"
   },
   "8889019648958415451": {
      "message": "نامعلوم فائل"
   },
   "8917554093651202032": {
      "message": "$1​ چلائیں"
   },
   "8919660666733306860": {
      "message": "Image"
   },
   "8923591894816841670": {
      "message": "انتخاب نیچے منتقل کیا گیا۔"
   },
   "8925842014466254066": {
      "message": "‏Google Docs میں کاپی ہو رہا ہے"
   },
   "8930959387403789939": {
      "message": "یاد دہانی"
   },
   "8931267220766224111": {
      "message": "‏Google Keep کی یاد دہانیاں آن کریں؟ آپ کو براؤزر اطلاعات کی اجازت دینے کی ضرورت پڑ سکتی ہے۔"
   },
   "8938626240031421092": {
      "message": "چیک باکسز ٹوگل کریں"
   },
   "8943760679396635042": {
      "message": "$1​ کو ڈسپلے کر رہا ہے۔"
   },
   "8953555255469284376": {
      "message": "تصاویر یہاں ڈراپ کریں"
   },
   "8962132866274125834": {
      "message": "دوبارہ کریں"
   },
   "896590342186332268": {
      "message": "سائز 16"
   },
   "8975305711699693093": {
      "message": "تبصروں والا کالم چھپائیں"
   },
   "8978442832029227748": {
      "message": "Google Jamboard"
   },
   "8979104019474011578": {
      "message": "{every,plural, =1{ہفتہ وار دہرایا جاتا ہے}other{ہر # ہفتے بعد دہرایا جاتا ہے}}"
   },
   "8979615310931291676": {
      "message": "ترمیم کردہ بوقت $1​"
   },
   "8988925599985431446": {
      "message": "پن ہٹائیں"
   },
   "900086393693234779": {
      "message": "گھر"
   },
   "9003585743562048321": {
      "message": "نیٹ ورک کی خرابی کی وجہ سے تبصروں کی مطابقت پذیری کرنا ناکام ہو گیا۔"
   },
   "9012753183662045049": {
      "message": "لیبل کا اس سے چھوٹا ایک نام درج کریں"
   },
   "9021945828354340363": {
      "message": "{count,plural, =1{اس نوٹ کا آپ کے ساتھ مزید اشتراک نہیں کیا جائے گا۔}other{ان نوٹس کا آپ کے ساتھ مزید اشتراک نہیں کیا جائے گا۔}}"
   },
   "9024023699330078373": {
      "message": "‏یہ آئٹم کھولنے سے یہ آپ کی Drive میں شامل ہو جائے گا"
   },
   "9058308423774656474": {
      "message": "Hangul Word Processor"
   },
   "9063863448028905602": {
      "message": "نتائج سے ہٹائیں"
   },
   "9072994494820207560": {
      "message": "نشان زد آئٹم"
   },
   "9083935734710258396": {
      "message": "مسترد کریں"
   },
   "9094248058931620597": {
      "message": "تفصیلات کے پینل کو سکیڑ دیا گیا۔"
   },
   "911586799466052745": {
      "message": "OpenOffice Draw"
   },
   "911698676339750373": {
      "message": "فیملی گروپ"
   },
   "9121915169985572840": {
      "message": "رنگ تبدیل کریں"
   },
   "9124422680181020503": {
      "message": "ڈرائنگ حذف ہو گئی"
   },
   "9131268871618792263": {
      "message": "{NUM_ITEMS,plural, =0{unused plural form}=1{unused plural form}other{‏Team Drives کے اراکین رسائی سے محروم ہو جائیں گے جب تک ان آئٹمز کا اشتراک ان کے ساتھ نہ ہو جائے۔}}"
   },
   "9149141099919589043": {
      "message": "کوما سے الگ کردہ اقدار"
   },
   "9155213204821633067": {
      "message": "$1​ غیر منتخب کیا گيا۔"
   },
   "9180910903828232576": {
      "message": "{NUM_ITEMS_1,plural, =0{unused plural form}=1{{NUM_ITEMS_2} فولڈر {XXX_1} میں شامل کر دیا گیا ہے۔}other{{NUM_ITEMS_2} فولڈرز {XXX_2} میں شامل کر دیے گئے ہیں۔}}"
   },
   "9197837492705576727": {
      "message": "اگلے آئٹم پر جائیں"
   },
   "919969969251998566": {
      "message": "اس آرکائیو کو اپنے میل اکاؤنٹ میں کھولیں۔"
   },
   "9203454763088526300": {
      "message": "متن کی شناخت نہیں کی جا سکتی۔"
   },
   "9208632284144316801": {
      "message": "دہرائیں"
   },
   "9213031420087755232": {
      "message": "صفحہ صاف کریں"
   },
   "9220412150349575379": {
      "message": "انچز"
   },
   "938074023403688885": {
      "message": "ہٹائیں"
   },
   "951963820437151566": {
      "message": "Google Sites"
   },
   "960732173870658714": {
      "message": "‏Google Keep دستاویز"
   },
   "969509857504028202": {
      "message": "‏فائلوں کو کسی Team Drive سے باہر منتقل کرنے سے رسائی اور ملکیت تبدیل ہو جاتی ہے۔"
   },
   "976103457024703736": {
      "message": "\"$1​\" نہیں کھل سکی۔"
   },
   "985197728509875956": {
      "message": "کیمیکل ماڈل"
   },
   "991852286447868510": {
      "message": "$1​ کی تلاش جاری ہے"
   },
   "99635082918315028": {
      "message": "تصویر سے متن اخذ کر لیا گیا"
   },
   "996381410993745580": {
      "message": "Photoshop"
   },
   "996406443443155276": {
      "message": "\"$1​\" نہیں کھل سکا۔"
   },
   "appDesc": {
      "description": "App description",
      "message": "آپ کے ذہن میں جو کچھ ہے اسے تیزی سے کیپجر کریں اور ان خیالات کا دوستوں اور فیملی کے ساتھ اشتراک کریں۔"
   },
   "appName": {
      "description": "App name",
      "message": "Google Keep - نوٹس اور فہرستیں"
   },
   "shortName": {
      "description": "App short name",
      "message": "Google Keep"
   }
}
