{
   "1001407065815272462": {
      "message": "$2​నా డిస్క్$1​కు జోడించలేకపోయాము"
   },
   "1013939682284715002": {
      "message": "నిర్వహించు"
   },
   "1029576232144989689": {
      "message": "అలాగే మీరు&nbsp;$2​Google Keep Chrome పొడిగింపు$1​తో తదుపరి అవసరాల కోసం లింక్‌లను సేవ్ చేయవచ్చు."
   },
   "1039394921418415681": {
      "message": "సైన్ ఇన్ చేయి"
   },
   "1040405721361467195": {
      "message": "వ్యాఖ్య చేయడం కోసం పదాలను ఎంచుకోవడానికి బాణం కీలను ఉపయోగించండి. ఎంపికను విస్తరించడం కోసం shiftని నొక్కి, పట్టుకుని బాణం కీలను నొక్కండి. వ్యాఖ్యని సృష్టించడం కోసం Enter లేదా రద్దు చేయడం కోసం Escape ఉపయోగించండి."
   },
   "1061011362310586469": {
      "message": "భాగస్వామ్యం కలిగి ఉన్నవారు"
   },
   "1083918249169198626": {
      "message": "కీబోర్డ్‌ సత్వరమార్గాలు నిలిపివేయబడ్డాయి."
   },
   "1101371910696766077": {
      "message": "కాపీ రూపొందించు"
   },
   "1105774658609209931": {
      "message": "Chrome పొడిగింపు"
   },
   "1122146167985532789": {
      "message": "నిన్న"
   },
   "1127320433256851404": {
      "message": "వీడియో ప్లేయర్"
   },
   "1131044617724567645": {
      "message": "PDFలలోని వ్యాఖ్యలు ఫైల్‌కు సేవ్ చేయబడతాయి మరియు ఇతర యాప్‌లలో కనిపిస్తాయి"
   },
   "1137446830169628669": {
      "message": "అంశం ఇండెంట్ చేయబడింది."
   },
   "1158660505977623040": {
      "message": "శాశ్వతంగా తొలగించు"
   },
   "1162642135048988280": {
      "message": "పత్రం పేరు మార్చండి"
   },
   "1163324543881570799": {
      "message": "Google డాక్స్"
   },
   "1166244120191806795": {
      "message": "అభిప్రాయాన్ని పంపు"
   },
   "1177768120450365955": {
      "message": "ఎంచుకున్న అంశాలను దిగువకు తరలించు"
   },
   "1179891706526242218": {
      "message": "తదుపరి"
   },
   "1185164838496022543": {
      "message": "దయచేసి పేజీని మళ్లీ లోడ్ చేయడానికి ఇక్కడ క్లిక్ చేయండి."
   },
   "1213005208968286932": {
      "message": "పరిష్కరించబడినట్లుగా గుర్తు పెట్టబడింది"
   },
   "124010372300613445": {
      "message": "{numNotes,plural, =1{ఆర్కైవ్ చేయని గమనిక సృష్టించబడింది}other{# ఆర్కైవ్ చేయని గమనికలు సృష్టించబడ్డాయి}}"
   },
   "124900027451629830": {
      "message": "ప్లే చేయి"
   },
   "125608713654167241": {
      "message": "నీలి ఆకుపచ్చ రంగు"
   },
   "1256362146573583104": {
      "message": "సంగ్రహించు"
   },
   "1259492729704800881": {
      "message": "గమనికను ఆర్కైవ్ చేస్తుంది"
   },
   "1263685395252160366": {
      "message": "LaTeX"
   },
   "1271038294394884640": {
      "message": "రద్దు చేయి"
   },
   "12768758038718216": {
      "message": "ఆర్కైవ్ చేసిన గమనికను పిన్ చేయి"
   },
   "1280430284217153733": {
      "message": "సమయాన్ని జోడించండి"
   },
   "1330083198022464084": {
      "message": "కొత్త గమనికను సృష్టించు"
   },
   "1333255388111908292": {
      "message": "కిరాణా సరుకులు"
   },
   "1335763707789999819": {
      "message": "{NUM_ITEMS,plural, =1{ఈ అంశాన్ని దాని ప్రస్తుత ఫోల్డర్‌ల నుండి తరలించడానికి మీకు అనుమతి లేదు. బదులుగా అంశాన్ని {START_SPAN_1}{NAME}{END_SPAN}కి జోడించండి.}other{ఈ అంశాలను వాటి ప్రస్తుత ఫోల్డర్‌ల నుండి తరలించడానికి మీకు అనుమతి లేదు. బదులుగా అంశాలను {START_SPAN_2}{NAME}{END_SPAN}కి జోడించండి.}}"
   },
   "1338300799355131761": {
      "message": "శీర్షిక లేని గమనిక"
   },
   "1349697396109290623": {
      "message": "$1​ యొక్క అధిక రిజల్యూషన్‌ను ప్రదర్శిస్తోంది"
   },
   "1359937199332190522": {
      "message": "{NUM_ITEMS_1,plural, =0{unused plural form}=1{{NUM_ITEMS_2} ఫైల్ {XXX_1}కి జోడించబడింది.}other{{NUM_ITEMS_2} ఫైల్‌లు {XXX_2}కి జోడించబడ్డాయి.}}"
   },
   "136335357683289450": {
      "message": "మూసివేయి"
   },
   "1368808491835583439": {
      "message": "ముదురు ఊదా రంగు"
   },
   "1379850360723600538": {
      "message": "పాస్‌వర్డ్ రక్షిత ఫైల్‌లకు మద్దతు లేదు."
   },
   "1397887822627488928": {
      "message": "భాగస్వామ్యం చేయాల్సిన వ్యక్తి లేదా ఇమెయిల్"
   },
   "139942704574044780": {
      "message": "అంగీకరిస్తున్నాను"
   },
   "1419896259743862406": {
      "message": "దీనితో తెరువు"
   },
   "1432850707344442376": {
      "message": "$1​ లేబుల్‌ను సృష్టించు"
   },
   "1434081385486479995": {
      "message": "ప్రస్తుతం షేర్ చేయడం అందుబాటులో లేదు"
   },
   "1439211265324766071": {
      "message": "గమనిక ట్రాష్‌లో ఉంది"
   },
   "1441487391064925653": {
      "message": "సహాయ కేంద్రంలో అన్ని సత్వరమార్గాలను వీక్షించండి"
   },
   "1441712877952841568": {
      "message": "సవరించినది $1​"
   },
   "1442722292947881614": {
      "message": "రకాలు"
   },
   "1446829548948002072": {
      "message": "కామా"
   },
   "1453330983536591773": {
      "message": "లేత బూడిద రంగు"
   },
   "1463389029497634261": {
      "message": "వాల్యూమ్ తగ్గించండి"
   },
   "1465828580966685215": {
      "message": "ఖాతాలోని గమనికలను తొలగించు"
   },
   "1466663154000252842": {
      "message": "కొందరు వ్యక్తులు ప్రాప్యతను కోల్పోవచ్చు"
   },
   "1467797923781828000": {
      "message": "$1​ అంశాలు $2​కి జోడించబడ్డాయి."
   },
   "1473312930157933007": {
      "message": "మీ నిర్వాహకులు మీ డొమైన్ వెలుపల భాగస్వామ్యాన్ని నిలిపివేసినందున క్రింది వినియోగదారులకు భాగస్వామ్యం చేయడం సాధ్యపడదు."
   },
   "1475258635371833968": {
      "message": "$2​, $1​"
   },
   "1475261522522402536": {
      "message": "స్థలాన్ని ఎంచుకోండి"
   },
   "1478393252643397554": {
      "message": "నారింజ రంగు"
   },
   "1482452362096735080": {
      "message": "{numOccurrences} సార్లు పునరావృతమవుతుంది"
   },
   "1499433769420882987": {
      "message": "$1​ని ప్రదర్శిస్తోంది"
   },
   "1505876360160857231": {
      "message": "$1​ TB"
   },
   "1507063529674142853": {
      "message": "నెలలో చివరి రోజున"
   },
   "1507445189431379166": {
      "message": "తొలగించు"
   },
   "1512114410402431831": {
      "message": "రీఫ్రెష్ చేయండి"
   },
   "1512454807955173272": {
      "message": "Keep ఆన్‌లైన్‌లో ఉన్నప్పుడు నవీకరించబడుతుంది"
   },
   "1513178578981188988": {
      "message": "Edge"
   },
   "1532717559893630620": {
      "message": "$1​ లేబుల్ $2​కి విలీనం చేయబడింది."
   },
   "1536051766421561160": {
      "message": "సమానం గుర్తు"
   },
   "153659275234722804": {
      "message": "తీసివేయి"
   },
   "1543499632005215694": {
      "message": "{NUM_ITEMS,plural, =0{Unused plural form}=1{\"{ADDED_PARENT_NAME}\"కు తరలించబడుతున్న ఫైల్ కారణంగా DLP గుర్తింపులు ప్రారంభించబడ్డాయి. ఈ ఫైల్‌లో సున్నితమైన సమాచారం ఉండవచ్చు.}other{\"{ADDED_PARENT_NAME}\"కు తరలించబడుతున్న కొన్ని ఫైల్‌ల కారణంగా DLP గుర్తింపులు ప్రారంభించబడ్డాయి. ఈ ఫైల్‌లలో సున్నితమైన సమాచారం ఉండవచ్చు.}}"
   },
   "1568379678795589771": {
      "message": "చతురస్రం"
   },
   "1586968957182554447": {
      "message": "నిలిపివేయండి"
   },
   "1588268697057804046": {
      "message": "$1​ గంటల క్రితం"
   },
   "1606998668553414638": {
      "message": "ప్రాప్యతను అభ్యర్థించు"
   },
   "1612117309990202511": {
      "message": "చుక్కలు"
   },
   "1623657263486883050": {
      "message": "సెం.మీ"
   },
   "1633798963327779260": {
      "message": "రేపు"
   },
   "1655692513689044870": {
      "message": "మీరు సైన్ అవుట్ చేయబడ్డారు."
   },
   "1656911987308166143": {
      "message": "తొలగించు"
   },
   "1661251023749398110": {
      "message": "ఆడియోను డౌన్‌లోడ్ చేయి"
   },
   "1665821947855814052": {
      "message": "పరిమాణం"
   },
   "1675900304699098572": {
      "message": "{count,plural, =1{గమనిక అన్‌పిన్ చేయబడింది}other{# గమనికలు అన్‌పిన్ చేయబడ్డాయి}}"
   },
   "1680617124502957636": {
      "message": "ప్రస్తుతం కనెక్ట్ చేయడం సాధ్యపడదు. తర్వాత మళ్లీ ప్రయత్నించండి."
   },
   "1680818623013843452": {
      "message": "లూసిడ్ చార్ట్"
   },
   "1683762293389974494": {
      "message": "తొలగించు"
   },
   "1694896269813520248": {
      "message": "డ్రాయింగ్‌ను జోడించు"
   },
   "1697160643589236962": {
      "message": "$1​ PB"
   },
   "1703175513040690135": {
      "message": "$1​లోని ఎవరైనా"
   },
   "1704004075228783011": {
      "message": "{every,plural, =1{నెలలో చివరి రోజున ప్రతి నెల పునరావృతమవుతుంది}other{నెలలో చివరి రోజున ప్రతి # నెలలకు పునరావృతమవుతుంది}}"
   },
   "1711424025297585662": {
      "message": "ఒక|ఆ|ఈ"
   },
   "171683163267149669": {
      "message": "$1​ GB"
   },
   "1730171019350750807": {
      "message": "నలుపు"
   },
   "1737240194537729525": {
      "message": "ప్రతి వారం"
   },
   "1738407623218213194": {
      "message": "అనామకం"
   },
   "1739900012825270238": {
      "message": "మునుపటి అంశానికి వెళ్లండి"
   },
   "1740371341228065086": {
      "message": "మళ్లీ లోడ్ చేయి"
   },
   "1745782414562966515": {
      "message": "\"$1​\" లేబుల్‌ను \"$2​\" లేబుల్‌తో విలీనం చేయాలా? \"$1​\"తో లేబుల్ చేయబడిన అన్ని గమనికలు \"$2​\"తో లేబుల్ చేయబడతాయి మరియు \"$1​\" లేబుల్ తొలగించబడుతుంది."
   },
   "1746512984326924716": {
      "message": "ఈ చర్య రద్దు చేయబడదు."
   },
   "1783719421893050637": {
      "message": "కొలతలు"
   },
   "178927681797742562": {
      "message": "సైన్ ఇన్ చేయి"
   },
   "1791115075948268631": {
      "message": "కీబోర్డ్ సత్వర మార్గ సహాయాన్ని తెరవండి"
   },
   "179545118447015250": {
      "message": "గ్రిడ్ వీక్షణ"
   },
   "1803966010993357655": {
      "message": "ఇతరాలు"
   },
   "1808245543551507519": {
      "message": "ఆడియో"
   },
   "1808500458645743749": {
      "message": "లాక్ స్క్రీన్ గమనికలు Google Keepకి స్వయంచాలకంగా సేవ్ చేయబడతాయి. మీ అత్యంత ఇటీవలి గమనిక లాక్ స్క్రీన్‌లో ఉంటుంది."
   },
   "1810354345035313773": {
      "message": "మార్కర్ సాధనం రంగును మరియు పరిమాణ ఎంపికను తెరుస్తుంది"
   },
   "1819225489062185613": {
      "message": "ఇతరాలు"
   },
   "1823222042913714987": {
      "message": "పాస్‌వర్డ్‌ను సమర్పించు"
   },
   "1829174126565818591": {
      "message": "Firefox"
   },
   "1830157062072535681": {
      "message": "$1​ని ప్రదర్శిస్తోంది"
   },
   "1852745815330163711": {
      "message": "Google డ్రాయింగ్‌లు"
   },
   "1857224091554117760": {
      "message": "ఎరుపు రంగు"
   },
   "1870691479127746185": {
      "message": "కుడి"
   },
   "187077078156858455": {
      "message": "ఆడియో గమనిక"
   },
   "189303170370862360": {
      "message": "$2​ అంశాల్లో $1​"
   },
   "1900571668686750716": {
      "message": "vCard"
   },
   "1901215424950227523": {
      "message": "$1​ లేబుల్ ఉనికిలో లేదు"
   },
   "1918176455405610789": {
      "message": "పూర్తయింది"
   },
   "1936219394601788126": {
      "message": "మాతృ"
   },
   "1938115711058331119": {
      "message": "వ్యాఖ్యల నిలువు వరుసను చూపు"
   },
   "195154114623528341": {
      "message": "స్థానాన్ని జోడించు"
   },
   "1956794332842050061": {
      "message": "తదుపరి పేజీ"
   },
   "1965626377712226216": {
      "message": "Keynote"
   },
   "1967536906522187719": {
      "message": "ఈ షీట్‌ను పరిదృశ్యం చేయడంలో సమస్య ఉంది."
   },
   "1968405748623909021": {
      "message": "ఈ అంశాన్ని తెరవడానికి లేదా సవరించడానికి దిగువ అనువర్తనాల్లో ఒకదాన్ని ప్రయత్నించండి"
   },
   "1969531182936822963": {
      "message": "చర్య రద్దు చేయబడింది"
   },
   "1973454937875679500": {
      "message": "లేబుల్ పేరుని నమోదు చేయండి"
   },
   "1975630610063119352": {
      "message": "{charsRemaining,plural, =1{# అక్షరం మిగిలి ఉంది}other{# అక్షరాలు మిగిలి ఉన్నాయి}}"
   },
   "1980209166254310911": {
      "message": "రోజు"
   },
   "1988244842147989817": {
      "message": "ట్రాష్‌లోని గమనికలు 7 రోజుల తర్వాత తొలగించబడతాయి."
   },
   "200005227964332868": {
      "message": "మరిన్ని"
   },
   "2003845117979929469": {
      "message": "వివరాలు"
   },
   "200488920523496447": {
      "message": "అంశంలోకి జూమ్ చేయబడింది."
   },
   "2039757863628752523": {
      "message": "తరచుదనం ఎంపికలు"
   },
   "205876860571942679": {
      "message": "Google నా మ్యాప్‌లు"
   },
   "2059084517358086391": {
      "message": "కనుగొనే పట్టీని మూసివేయి"
   },
   "2061440050632248160": {
      "message": "ఆర్కైవ్ చేయి"
   },
   "2068023589621557589": {
      "message": "TrueType ఫాంట్"
   },
   "2073322475696388995": {
      "message": "ముందువైపుకు దాటవేయండి"
   },
   "2074454463201225704": {
      "message": "జూమ్‌ను రీసెట్ చేస్తుంది"
   },
   "207810168108507460": {
      "message": "$1​ గంట క్రితం"
   },
   "2085048987351765091": {
      "message": "అర్థమైంది"
   },
   "2091811447965921066": {
      "message": "వీరిని తీసివేయి"
   },
   "2107379241532042955": {
      "message": "స్థానం"
   },
   "2107589831642088814": {
      "message": "\"$3​$2​$1​\"ని సృష్టించండి"
   },
   "2109979457438465538": {
      "message": "లేబుల్ ఎంపిక మెనుని తెరిచారు"
   },
   "2113092209746357267": {
      "message": "Chrome"
   },
   "2118635459760443566": {
      "message": "తదుపరి"
   },
   "2119255452378336327": {
      "message": "$1​కి బుల్లెట్ పూర్వస్థితికి మార్చబడింది"
   },
   "212796670323571824": {
      "message": "సరే"
   },
   "213665695896111861": {
      "message": "గమనికలు"
   },
   "2138593281154109183": {
      "message": "ఆర్కైవ్ చేయి"
   },
   "214517458278879973": {
      "message": "$1​గా సైన్ ఇన్ చేయండి"
   },
   "2147952938331523160": {
      "message": "పేరు మార్చు..."
   },
   "2154372123324862271": {
      "message": "స్లాష్"
   },
   "2166966123760559393": {
      "message": "కొత్త లేబుల్‌ను సృష్టించు"
   },
   "2168461275182666804": {
      "message": "సవరించు"
   },
   "2181197458532159304": {
      "message": "{numberOfNotes,plural, =1{గమనిక ట్రాష్‌కు తరలించబడింది}other{# గమనికలు ట్రాష్‌కు తరలించబడ్డాయి}}"
   },
   "2184278444368405837": {
      "message": "$1​ అంశాలు"
   },
   "2187239650627580457": {
      "message": "సమర్పించు"
   },
   "2189621188983913867": {
      "message": "మరిన్ని యాప్‌లను కనెక్ట్ చేయి"
   },
   "2190049738646901760": {
      "message": "{count,plural, =1{గమనికను తొలగించాలా?}other{గమనికలను తొలగించాలా?}}"
   },
   "2195440644060728966": {
      "message": "{NUM_ITEMS,plural, =1{మీరు ఒక ఫోల్డర్‌లో ఉన్న ఫోల్డర్‌ను తరలిస్తున్నారు}other{మీరు ఒక ఫోల్డర్‌లో ఉన్న ఫోల్డర్‌లను తరలిస్తున్నారు}}"
   },
   "2198096971937872560": {
      "message": "రిమైండర్:"
   },
   "220168959069469607": {
      "message": "మరిన్ని చర్యలు"
   },
   "2202265279234683999": {
      "message": "కీబోర్డ్ సత్వరమార్గాలు"
   },
   "2203926649090909861": {
      "message": "జాబితా అంశం $1​వ సూచికకు తరలించబడింది"
   },
   "2215890921415017560": {
      "message": "పూర్తి స్క్రీన్ మోడ్"
   },
   "2216904725760458480": {
      "message": "ప్రతి రోజు"
   },
   "221715292685577880": {
      "message": "అవును"
   },
   "2226562046914098941": {
      "message": "ఈ ఫైల్ ప్రివ్యూ చేయలేనంత పెద్దదిగా ఉంది"
   },
   "2226937423434054727": {
      "message": "$1​, $2​ నుండి $3​, $4​ వరకు ఎంచుకోబడింది"
   },
   "223198388381606871": {
      "message": "నీలి ఊదా రంగు"
   },
   "2264311811697505466": {
      "message": "రిఫ్రెష్ చేయి"
   },
   "2270469222412517777": {
      "message": "వచనాన్ని గుర్తించడం సాధ్యం కాదు"
   },
   "2270633624888102832": {
      "message": "గమనికను అన్‌పిన్ చేయి"
   },
   "2280650195464600721": {
      "message": "నావిగేషన్"
   },
   "2282423663539387332": {
      "message": "రానున్నవి"
   },
   "2285069188138705005": {
      "message": "కనెక్ట్ చేయబడిన అనువర్తనాలు"
   },
   "2286685488296851497": {
      "message": "{NUM_ITEMS_1,plural, =0{unused plural form}=1{మీరు ఒక అంశాన్ని \"{SHARED_FOLDER_NAME}\" భాగస్వామ్య ఫోల్డర్ నుండి వెలుపలికి తరలిస్తున్నారు, దీని వలన వ్యక్తులు ప్రాప్యతను కోల్పోతారు.}other{మీరు {NUM_ITEMS_2} అంశాలను \"{SHARED_FOLDER_NAME}\" భాగస్వామ్య ఫోల్డర్ నుండి వెలుపలికి తరలిస్తున్నారు, దీని వలన వ్యక్తులు ప్రాప్యతను కోల్పోతారు.}}"
   },
   "228741435562395266": {
      "message": "ముద్రణ సదుపాయం ఇంకా అందుబాటులో లేదు"
   },
   "2289534534793293486": {
      "message": "ఆర్కైవ్ నుండి తీసివేయి"
   },
   "2289812403593835836": {
      "message": "పేజీలు"
   },
   "229177484946387188": {
      "message": "Google Earth"
   },
   "2292696732672795285": {
      "message": "వాల్యూమ్ పెంచండి"
   },
   "2299671629154778581": {
      "message": "గమనికలు అన్‌పిన్ చేసి, ఆర్కైవ్ చేయబడ్డాయి"
   },
   "2308018963132768704": {
      "message": "పరిమాణం 4"
   },
   "2310145944356900158": {
      "message": "ఎంచుకోబడినవి"
   },
   "2311880726221661199": {
      "message": "అధిక రిజల్యూషన్‌లను లోడ్ చేస్తోంది"
   },
   "2324955914430674498": {
      "message": "\"$1​\" కోసం శోధన ఫలితాలు లేవు"
   },
   "2329167963662998826": {
      "message": "Google Keep స్థాన రిమైండర్‌ల కోసం స్థలాల సూచనలను మెరుగుపరచడానికి మీ స్థానాన్ని ఉపయోగించాలనుకుంటోంది."
   },
   "2346361265476305332": {
      "message": "యజమాని ఈ ఆడియో ఫైల్ డౌన్‌లోడ్‌‌లను నిరోధించారు."
   },
   "2357623745116912085": {
      "message": "{NUM_ITEMS,plural, =0{unused plural form}=1{\"{TEAM_DRIVE_NAME}\" సభ్యులు ఈ అంశాన్ని వారితో భాగస్వామ్యం చేస్తే మినహా ప్రాప్యతను కోల్పోతారు.}other{\"{TEAM_DRIVE_NAME}\" సభ్యులు ఈ అంశాలను వారితో భాగస్వామ్యం చేస్తే మినహా ప్రాప్యతను కోల్పోతారు.}}"
   },
   "2357761837816388330": {
      "message": "ఆఫ్‌లైన్"
   },
   "2359614137862708172": {
      "message": "Shift"
   },
   "2364374826543847335": {
      "message": "మూలాధారాన్ని తీసివేయి"
   },
   "236689092839978781": {
      "message": "పునరావృతం చేయవద్దు"
   },
   "2370656573843123707": {
      "message": "కుడి కుండలీకరణం"
   },
   "2373760032138505521": {
      "message": "లేబుల్ ఇప్పటికే ఉంది"
   },
   "2386536768112358461": {
      "message": "Pg-Down"
   },
   "2396804279177914769": {
      "message": "బృందం డిస్క్‌కు యాజమాన్యాన్ని బదిలీ చేయాలా?"
   },
   "2405795704816921421": {
      "message": "$1​ ఫైల్"
   },
   "2408383448126741628": {
      "message": "వ్యవధి"
   },
   "2408933271548524782": {
      "message": "లాక్ చేయబడింది"
   },
   "2423877407428530040": {
      "message": "ఫైల్‌లో చాలా ఎక్కువ చార్ట్‌లు ఉన్నాయి."
   },
   "2433429041384246549": {
      "message": "మ్యూట్ చేయి"
   },
   "2444198666025646119": {
      "message": "ఊదా రంగు"
   },
   "2449254824382583885": {
      "message": "పాప్ అవుట్ చేయి"
   },
   "2452145367257933677": {
      "message": "చర్య రద్దు"
   },
   "2452522051596946166": {
      "message": "అయ్యో! $1​ని పరిదృశ్యం చేస్తున్నప్పుడు సమస్య ఏర్పడింది. మళ్లీ ప్రయత్నిస్తున్నాము."
   },
   "2454642351139428112": {
      "message": "చర్య రద్దు చేయి"
   },
   "2466251465475184755": {
      "message": "ట్రాష్‌ను ఖాళీ చేయాలా?  ట్రాష్‌లోని అన్ని గమనికలు శాశ్వతంగా తొలగించబడతాయి."
   },
   "2475181823688399272": {
      "message": "తదుపరి"
   },
   "2478862372619762755": {
      "message": "వ్యాఖ్య చేయాల్సిన నిర్దిష్ట స్థలాన్ని హైలైట్ చేయండి"
   },
   "2483363439634684283": {
      "message": "పరిమాణం 20"
   },
   "2504232652631703202": {
      "message": "కనెక్ట్ చేయబడింది"
   },
   "251025074207413762": {
      "message": "వివరణను జోడించండి"
   },
   "2525633490863427854": {
      "message": "చర్య పునరావృతం చేయి"
   },
   "2527534830196374788": {
      "message": "Ctrl"
   },
   "2532280782491328445": {
      "message": "మునుపటిదాన్ని కనుగొను"
   },
   "2555961950726197809": {
      "message": "వ్యూయర్‌ను చూపుతోంది."
   },
   "2562881166530755046": {
      "message": "డ్రాయింగ్‌లు"
   },
   "257317112834806705": {
      "message": "జాబితా మరియు గ్రిడ్ వీక్షణ మధ్య టోగుల్ చేయండి"
   },
   "2579261044590673579": {
      "message": "నా డిస్క్"
   },
   "2579679351920691492": {
      "message": "వెనుకవైపుకు దాటవేయండి"
   },
   "2581526424350930407": {
      "message": "సవరించు"
   },
   "2584557103820423944": {
      "message": "ఇండెంట్/డిడెంట్ జాబితా అంశంన"
   },
   "2600731575260427177": {
      "message": "ఫైల్ లేదు, ఒక వేళ తొలగించబడి ఉండవచ్చు. దయచేసి ఫైల్‌ను మళ్లీ అప్‌లోడ్ చేయడానికి ప్రయత్నించండి."
   },
   "2601304136110057215": {
      "message": "కొత్త డ్రాయింగ్"
   },
   "2604527707881848686": {
      "message": "ఇక మీదట అంశం డిడెంట్ చేయబడదు."
   },
   "2609409316752026806": {
      "message": "PDF"
   },
   "2609767652209789035": {
      "message": "లేబుల్‌లు"
   },
   "2623861453769098676": {
      "message": "ఈ పత్రాన్ని పరిదృశ్యం చేస్తున్నప్పుడు సమస్య ఏర్పడింది."
   },
   "2626653026098396543": {
      "message": "{NUM_ITEMS,plural, =0{Unused}=1{ఈ అంశాన్ని తరలిస్తే, ఇది \"{SHARED_FOLDER_NAME}\" భాగస్వామ్య ఫోల్డర్‌ను చూడగలిగే వారందరితో భాగస్వామ్యం చేయబడుతుంది.}other{ఈ అంశాలను తరలిస్తే, ఇవి \"{SHARED_FOLDER_NAME}\" భాగస్వామ్య ఫోల్డర్‌ను చూడగలిగే వారందరితో భాగస్వామ్యం చేయబడతాయి.}}"
   },
   "2630254198275172065": {
      "message": "దీనికి తరలించు..."
   },
   "2632263751512428257": {
      "message": "ప్రతి సంవత్సరం"
   },
   "2645469029410848421": {
      "message": "{noteCount,plural, =1{లేబుల్ ఉన్న గమనిక}other{లేబుల్ ఉన్న గమనికలు}}"
   },
   "2661850177130037208": {
      "message": "అంశాన్ని తెరవండి"
   },
   "2680303811435018716": {
      "message": "మరిన్ని అంశాలను జోడించడం సాధ్యపడదు"
   },
   "2681830832355823748": {
      "message": "అన్ని సత్వరమార్గాలను శోధించండి"
   },
   "268402507078609011": {
      "message": "{imagesAdded,plural, =1{చిత్రం జోడించబడింది}other{# చిత్రాలు జోడించబడ్డాయి}}"
   },
   "2702485557996900362": {
      "message": "వైరుధ్య సవరణలను పరిష్కరించండి"
   },
   "2704959686524436777": {
      "message": "లోడ్ చేస్తోంది"
   },
   "2715199780155065699": {
      "message": "ఫైల్‌లో చాలా ఎక్కువ ఆకారాలు, వచన పెట్టెలు లేదా రేఖాచిత్రాలు ఉన్నాయి."
   },
   "2716433087531258659": {
      "message": "page up"
   },
   "2719125961689709460": {
      "message": "గమనిక"
   },
   "2742719907061406418": {
      "message": "XML"
   },
   "2758125083752925237": {
      "message": "(యజమాని)"
   },
   "2760106082595028595": {
      "message": "గమనిక చాలా పెద్దదిగా ఉంది."
   },
   "277430914014962533": {
      "message": "అయ్యో! $1​ని పరిదృశ్యం చేస్తున్నప్పుడు సమస్య ఏర్పడింది."
   },
   "2777453609143551768": {
      "message": "వాల్యూమ్ నియంత్రణ"
   },
   "2793841261389879255": {
      "message": "మునుపటి పేజీ"
   },
   "2794676336056877832": {
      "message": "{every,plural, =1{నెలలో అదే రోజున ప్రతి నెల పునరావృతమవుతుంది}other{నెలలో అదే రోజున ప్రతి # నెలలకు పునరావృతమవుతుంది}}"
   },
   "2798322202738486782": {
      "message": "{HOURS,plural, =0{0 గంటలు }=1{1 గంట }other{# గంటలు }}{MINUTES,plural, =0{0 నిమిషాలు }=1{1 నిమిషం }other{# నిమిషాలు }}{SECONDS,plural, =0{0 సెకన్లు.}=1{1 సెకను.}other{# సెకన్లు.}}"
   },
   "2803553109654833664": {
      "message": "లేత గులాబీ రంగు"
   },
   "2818020101821669029": {
      "message": "సృష్టించినది"
   },
   "2820045170951016567": {
      "message": "రిమైండర్‌లు"
   },
   "2823533464825550362": {
      "message": "పత్రం నియంత్రణలు"
   },
   "2827039933590757722": {
      "message": "Windows సత్వరమార్గం"
   },
   "2828060233316503200": {
      "message": "{NUM_ITEMS_1,plural, =0{unused plural form}=1{{NUM_ITEMS_2} అంశం {XXX_1} నుండి {XXX_2}కి తరలించబడింది.}other{{NUM_ITEMS_2} అంశాలు {XXX_3} నుండి {XXX_4}కి తరలించబడ్డాయి.}}"
   },
   "2829226075651806940": {
      "message": "దగ్గరికి జూమ్ చేయి"
   },
   "2842462703735289745": {
      "message": "షేర్ చేసిన ఫోల్డర్ \"$1​\"ని చూడగలిగే వారందరు యాక్సెస్‌ను పొందుతారు."
   },
   "2853036885874864031": {
      "message": "యాజమాన్యం $1​కు బదిలీ చేయబడుతుంది."
   },
   "2854717396594966319": {
      "message": "OpenOffice రైటర్"
   },
   "2858566870229558873": {
      "message": "$2​నిబంధనలు$1​"
   },
   "2862675909830094845": {
      "message": "కొత్త లేబుల్‌ను సృష్టించు"
   },
   "2873089307546162154": {
      "message": "సరే"
   },
   "2877285560485318801": {
      "message": "పాజ్ చేయి"
   },
   "2879276552944958066": {
      "message": "$1​ ఫోల్డర్‌కి తిరిగి వెళ్లు."
   },
   "2886313667612471214": {
      "message": "రీఫ్రెష్ చేయాలి. దీనికి కొన్ని నిమిషాలు పట్టవచ్చు."
   },
   "2893055432094515558": {
      "message": "తనిఖీ పెట్టెలు చూపబడ్డాయి"
   },
   "289798573180023043": {
      "message": "సరే"
   },
   "2901360496423912565": {
      "message": "నివేదించు"
   },
   "2902570047322934912": {
      "message": "భాగస్వామ్యాన్ని ప్రారంభించండి"
   },
   "2908917161758545146": {
      "message": "{count,plural, =1{గమనిక అన్‌పిన్ చేసి, ఆర్కైవ్ చేయబడింది}other{# గమనికలు అన్‌పిన్ చేసి, ఆర్కైవ్ చేయబడ్డాయి}}"
   },
   "292972929665636688": {
      "message": "ఇప్పుడు మీరు Keepలో కొత్త గమనికలను మరియు తనిఖీ జాబితాలను సృష్టించడానికి Google అసిస్టెంట్‌ని ఉపయోగించవచ్చు."
   },
   "2935193106137642160": {
      "message": "జూమ్ చర్య అందుబాటులో లేదు"
   },
   "2942094715879803305": {
      "message": "ఎంచుకున్న అంశాలను తొలగించు"
   },
   "295331174171409695": {
      "message": "\"$1​\" డౌన్‌లోడ్ అనుమతిని నవీకరించడంలో సమస్య ఏర్పడింది."
   },
   "2960516445247616550": {
      "message": "ముద్రణ సదుపాయం అందుబాటులో లేదు"
   },
   "296391753033307868": {
      "message": "$1​ లేబుల్ సృష్టించబడింది మరియు గమనికకు జోడించబడింది."
   },
   "2964778642459027786": {
      "message": "ట్రాష్‌లో గమనికలు లేవు"
   },
   "2971623719720688041": {
      "message": "చర్య రద్దు చేయబడింది"
   },
   "2971780287153684447": {
      "message": "Android పరికరాలు"
   },
   "2973306402585941108": {
      "message": "ఉదయం"
   },
   "298817883481775869": {
      "message": "లోడ్ చేస్తోంది..."
   },
   "2990497076082409431": {
      "message": "\"$1​\" $2​కి తరలించబడింది."
   },
   "2993901764282547916": {
      "message": "ఆప్ మేకర్"
   },
   "3005058076425755361": {
      "message": "Backspace"
   },
   "3018905429279095639": {
      "message": "{NUM_ITEMS,plural, =1{ఈ ఫోల్డర్‌ను దాని ప్రస్తుత ఫోల్డర్‌ల నుండి తరలించడానికి మీకు అనుమతి లేదు. బదులుగా ఫోల్డర్‌ను {START_SPAN_1}{NAME}{END_SPAN}కి జోడించండి.}other{ఈ ఫోల్డర్‌లను వాటి ప్రస్తుత ఫోల్డర్‌ల నుండి తరలించడానికి మీకు అనుమతి లేదు. బదులుగా ఫోల్డర్‌లను {START_SPAN_2}{NAME}{END_SPAN}కి జోడించండి.}}"
   },
   "3043961722025425136": {
      "message": "వివరణ"
   },
   "3045997283325725532": {
      "message": "Google Keepలో కొత్తగా ఉన్నవి"
   },
   "306516303501625305": {
      "message": "ప్రామాణీకరణ విఫలమైంది."
   },
   "3108098439469164127": {
      "message": "కొత్త డ్రాయింగ్ తెరవబడింది"
   },
   "3109321241584918345": {
      "message": "మరిన్ని అనువర్తనాలను కనెక్ట్ చేయి..."
   },
   "3121560585545725724": {
      "message": "$1​, $2​"
   },
   "3140236589681731084": {
      "message": "$1​ గంటల్లో"
   },
   "3147722095652727387": {
      "message": "క్రింది వినియోగదారుల యొక్క నిర్వాహకులు వారి డొమైన్‌కి భాగస్వామ్యం చేయడాన్ని నిలిపివేసినందున లేదా మీ నిర్వాహకులు మీ డొమైన్ వెలుపల భాగస్వామ్యం చేయడాన్ని నిలిపివేసినందున వారితో భాగస్వామ్యం చేయడం సాధ్యపడదు."
   },
   "3149135495425830054": {
      "message": "సైన్ ఇన్ అయినప్పుడు సూచన మరియు స్వీయపూర్తి అందుబాటులో ఉంటాయి"
   },
   "3150651996344750990": {
      "message": "{count,plural, =1{గమనిక ఆర్కైవ్ నుండి తీసివేయబడింది}other{# గమనికలు ఆర్కైవ్ నుండి తీసివేయబడ్డాయి}}"
   },
   "3167198321908629554": {
      "message": "మీ గమనికలను రీఫ్రెష్ చేస్తోంది మరియు మళ్లీ లోడ్ చేస్తోంది…"
   },
   "3176246635438298155": {
      "message": "Delete"
   },
   "3187117482772485385": {
      "message": "సూక్ష్మచిత్రాన్ని సృష్టిస్తోంది..."
   },
   "3189854932778515441": {
      "message": "గమనిక ఆర్కైవ్‌లో ఉంది"
   },
   "3190546672187601036": {
      "message": "రాత్రి"
   },
   "3195812604657128345": {
      "message": "సంగ్రహించాల్సిన డిస్క్ ఫోల్డర్‌ని ఎంచుకోండి"
   },
   "32059145043728507": {
      "message": "{numberOfNotes,plural, =1{గమనిక పునరుద్ధరించబడింది}other{# గమనికలు పునరుద్ధరించబడ్డాయి}}"
   },
   "3207650089232728475": {
      "message": "లేబుల్‌లను మార్చు"
   },
   "3211163842850942567": {
      "message": "దగ్గరికి జూమ్ చేయండి"
   },
   "3217354672216773127": {
      "message": "$1​కి ప్రారంభించబడింది"
   },
   "3220641589840600333": {
      "message": "$1​ వీక్షణకు మార్చబడింది"
   },
   "3241696131593027453": {
      "message": "గమనికను ఎంపిక చేస్తుంది"
   },
   "3243916603465112517": {
      "message": "తక్కువ"
   },
   "3249966726137025950": {
      "message": "సహకారి యొక్క కుటుంబ సమూహం"
   },
   "3250489229749307913": {
      "message": "ఎలక్ట్రానిక్ పబ్లికేషన్"
   },
   "3258100527833044153": {
      "message": "ఖాళీ రేఖాపటం విస్మరించబడింది"
   },
   "3261131345401321392": {
      "message": "వ్యాఖ్యానించగలరు"
   },
   "3266448715145955862": {
      "message": "గమనికలు ఆర్కైవ్ నుండి తీసివేసి, పిన్ చేయబడ్డాయి"
   },
   "3268028083415317236": {
      "message": "వద్దు, ధన్యవాదాలు"
   },
   "3272496516667407797": {
      "message": "వివరాలను లోడ్ చేస్తున్నప్పుడు సమస్య ఏర్పడింది."
   },
   "3278046126264096288": {
      "message": "వారం"
   },
   "3281684668260174833": {
      "message": "{numberOfNotes,plural, =1{గమనిక అన్‌పిన్ చేసి, ట్రాష్‌కు తరలించబడింది}other{# గమనికలు అన్‌పిన్ చేసి, ట్రాష్‌కు తరలించబడ్డాయి}}"
   },
   "3288498486633948368": {
      "message": "\"$1​\" Google డిస్క్‌కి జోడించబడింది."
   },
   "330603631583186798": {
      "message": "Word"
   },
   "3308935528045767909": {
      "message": "డ్రాయింగ్‌తో కొత్త గమనిక"
   },
   "3312545971976531405": {
      "message": "సందేశం"
   },
   "3326410145104517459": {
      "message": "ఏ పరికరం నుండి అయినా $1​ మీ ఆలోచనలను సంగ్రహించండి"
   },
   "3345567742278474807": {
      "message": "ఈ గమనిక అనుచితమైనదిగా ఫ్లాగ్ చేయబడింది, కనుక దీన్ని భాగస్వామ్యం చేయలేరు."
   },
   "3348057264663626000": {
      "message": "ఎంపిక పైకి తరలించబడింది."
   },
   "3354260708176476985": {
      "message": "లోడ్ చేస్తోంది&hellip;"
   },
   "3362903141674317449": {
      "message": "సహకారి"
   },
   "336772567640975291": {
      "message": "తదుపరి వారం"
   },
   "3371033609268806242": {
      "message": "$1​ లేబుల్ తొలగించబడింది."
   },
   "3381619429606029445": {
      "message": "Visio"
   },
   "3382236845597426718": {
      "message": "తెరువు"
   },
   "3385831848537487538": {
      "message": "ప్రయాణం"
   },
   "3409257542937182842": {
      "message": "మళ్లీ ప్రయత్నిస్తున్నాము..."
   },
   "3409483962000136213": {
      "message": "ప్లే చేయండి/పాజ్ చేయండి"
   },
   "3418767079436101103": {
      "message": "ఈ పేజీని లోడ్ చేస్తున్నప్పుడు సమస్య ఏర్పడింది."
   },
   "3419821606494999471": {
      "message": "వ్యాఖ్య నోటిఫికేషన్‌లను నిర్వహించండి"
   },
   "3435089737264042207": {
      "message": "ఆన్ చేయి"
   },
   "3447704623213039325": {
      "message": "కిరాణా వస్తువు"
   },
   "3448234415275521882": {
      "message": "సాధారణ సమాచారం"
   },
   "3451851833460018584": {
      "message": "{NUM_COMMENTS,plural, =0{వ్యాఖ్యలు లేవు}=1{ఒక వ్యాఖ్య}other{# వ్యాఖ్యలు}}"
   },
   "3455405209271884570": {
      "message": "సంగ్రహించు"
   },
   "345585899501260401": {
      "message": "పిక్సెల్‌లు"
   },
   "345718983715470367": {
      "message": "మూలాధారం"
   },
   "3468441711253011521": {
      "message": "Google షీట్‌లు"
   },
   "3473620774713000513": {
      "message": "పరిష్కరించబడింది"
   },
   "3485469306694683931": {
      "message": "మీ డిస్క్ ఖాతాలోకి సంగ్రహించండి"
   },
   "3487924397596265480": {
      "message": "$1​ ఎంచుకోబడింది."
   },
   "3488766808236147068": {
      "message": "రంగు $1​. గమనికకు వర్తింపజేయడానికి మరొక రంగును ఎంచుకోండి."
   },
   "3496410038494993160": {
      "message": "ప్రసిద్ధ కీబోర్డ్ సత్వరమార్గాలు"
   },
   "3518073392823563581": {
      "message": "కీబోర్డ్ సత్వరమార్గాలు"
   },
   "3528739824697875943": {
      "message": "జాబితా అంశం"
   },
   "3549581437554274388": {
      "message": "ఎంపిక కుడివైపుకు తరలించబడింది."
   },
   "3551522853788442530": {
      "message": "వెనుకకు వెళ్లు"
   },
   "3551608745198442336": {
      "message": "డ్రాయింగ్ $1​/$2​"
   },
   "3553997866738769437": {
      "message": "డ్రాయింగ్‌ను సవరించు"
   },
   "3555017093330694286": {
      "message": "వీరి నుండి భాగస్వామ్యం చేయబడింది"
   },
   "3555297636767750285": {
      "message": "ఆకుపచ్చ"
   },
   "3561658662634401836": {
      "message": "శీర్షిక"
   },
   "3569884090205828853": {
      "message": "OpenOffice క్యాల్‌సి"
   },
   "3570074492517305433": {
      "message": "సైన్ అప్ చేయి"
   },
   "3571704286086017611": {
      "message": "రిమైండర్ తొలగించబడింది"
   },
   "3574963906259719128": {
      "message": "మీ బ్రౌజర్ ఈ ఆడియో ఫైల్‌ను ప్లే చేయలేకపోయింది."
   },
   "3580293729117872545": {
      "message": "ముగిసేది"
   },
   "3595000514985906359": {
      "message": "Excel"
   },
   "3595562664731337243": {
      "message": "లేబుల్ పేరు మార్చు"
   },
   "3603931013946597836": {
      "message": "{NUM_ITEMS,plural, =1{మీరు {NUM_PARENTS} ఫోల్డర్‌ల్లో ఉన్న ఫైల్‌ను తరలిస్తున్నారు}other{మీరు {NUM_PARENTS} ఫోల్డర్‌ల్లో ఉన్న ఫైల్‌లను తరలిస్తున్నారు}}"
   },
   "3608606849109645545": {
      "message": "కొత్త పత్రం పేరును నమోదు చేయండి:"
   },
   "3609912631958780352": {
      "message": "దస్తూరి సాధనం"
   },
   "3611573349633408445": {
      "message": "డౌన్‌లోడ్ చేయి"
   },
   "3612936866865912552": {
      "message": "లోడ్ అవుతోంది..."
   },
   "3617727970098875990": {
      "message": "అన్ని సత్వరమార్గాలను శోధించండి"
   },
   "362521762755836201": {
      "message": "సృష్టించినది $1​"
   },
   "3634885664399305142": {
      "message": "డ్రాయింగ్ అందుబాటులో లేదు"
   },
   "3651893685901703652": {
      "message": "..."
   },
   "3657386785336906042": {
      "message": "బ్యాక్‌స్లాష్"
   },
   "3659554681396757189": {
      "message": "నేను తెరిచినది"
   },
   "366289214151975122": {
      "message": "$1​లో లింక్ కలిగి ఉన్న ఎవరైనా"
   },
   "3663571259791438207": {
      "message": "దుర్వినియోగాన్ని నివేదించు"
   },
   "3664842788764635265": {
      "message": "ఏదీ వద్దు"
   },
   "3666123569747918021": {
      "message": "ఈ పత్రం సేవ్ చేయని మార్పులను కలిగి ఉంది. మీరు పేజీ నుండి నిష్క్రమించి, మీ మార్పులను విస్మరించాలనుకుంటున్నారా?"
   },
   "3678477908297567934": {
      "message": "అండర్‌స్కోర్"
   },
   "3690515530505404607": {
      "message": "ఈ వీడియోను ప్లే చేస్తున్నప్పుడు సమస్య ఏర్పడింది."
   },
   "369764661829607970": {
      "message": "{NUM_ITEMS,plural, =0{అంశాలు లేవు}=1{1 అంశం}other{# అంశాలు}}"
   },
   "3707311099386068778": {
      "message": "అన్నీ తీసివేయి"
   },
   "3712215972250917265": {
      "message": "వ్యాఖ్యలు"
   },
   "3721649886572275931": {
      "message": "పరిమాణం 8"
   },
   "372633345629975481": {
      "message": "గమనికలు పిన్ చేయబడ్డాయి"
   },
   "372823375470132483": {
      "message": "ట్రాష్‌లో ఉంచిన గమనిక ఎంపికను తీసివేయి"
   },
   "3734444903221631913": {
      "message": "{NUM_ITEMS_1,plural, =0{unused plural form}=1{unused plural form}other{మీరు {NUM_ITEMS_2} అంశాలను బృంద డిస్క్‌లు మరియు భాగస్వామ్య ఫోల్డర్‌ల నుండి వెలుపలికి తరలిస్తున్నారు, దీని వలన వ్యక్తులు ప్రాప్యతను కోల్పోతారు.}}"
   },
   "3751183760611784323": {
      "message": "స్క్రీన్ వెడల్పుకు అంశం సరిపోయేలా జూమ్ చేయబడింది."
   },
   "3793086499925031123": {
      "message": "శోధన పట్టీని తెరవండి / మునుపటి దాన్ని కనుగొనండి"
   },
   "3796511349428373407": {
      "message": "తేదీ ఎంపికలు"
   },
   "37992665410817181": {
      "message": "మళ్లీ తెరవబడింది"
   },
   "3801617971018550169": {
      "message": "నిన్న"
   },
   "381100310424863459": {
      "message": "Illustrator"
   },
   "3827179818223863356": {
      "message": "లేత ఆకుపచ్చ రంగు"
   },
   "3845302429676793049": {
      "message": "\"$1​\" వివరణను నవీకరించడంలో సమస్య ఏర్పడింది."
   },
   "3856960241878617076": {
      "message": "వ్యాఖ్యలు లోడ్ అవుతున్నాయి, దయచేసి వేచి ఉండండి"
   },
   "3858324058837632381": {
      "message": "ఈ ఆడియో ఫైల్‌ను ప్లే చేస్తున్నప్పుడు సమస్య ఏర్పడింది."
   },
   "3869166581651870488": {
      "message": "సవరణను ముగించండి"
   },
   "3874597373619381607": {
      "message": "పరిష్కరించిన వ్యాఖ్యలు చూపబడుతున్నాయి"
   },
   "3877974536163446728": {
      "message": "$1​, $2​ ఎంచుకోబడింది"
   },
   "3888733084985311515": {
      "message": "కుటుంబ సమూహం అందుబాటులో ఉంది."
   },
   "3897281533382850749": {
      "message": "అన్‌మ్యూట్ చేయి"
   },
   "3907816292084809686": {
      "message": "చర్య పునరావృతం చేయబడింది"
   },
   "3909380459614154542": {
      "message": "లింక్‌కు వెళ్లు"
   },
   "3930910469078167425": {
      "message": "ఆర్కైవ్"
   },
   "3952341864324097024": {
      "message": "శోధన ఫలితం తీసివేయి"
   },
   "3955575370175991097": {
      "message": "$1​ లేబుల్ వీక్షణకు మార్చబడింది"
   },
   "3974822583047850066": {
      "message": "రద్దు చేయి"
   },
   "3977699855735576796": {
      "message": "మరిన్ని పేజీలను లోడ్ చేస్తున్నప్పుడు సమస్య ఏర్పడింది."
   },
   "3981269900634596036": {
      "message": "{numberOfNotes,plural, =1{గమనికను తొలగించు}other{గమనికలను తొలగించు}}"
   },
   "3988418762222300024": {
      "message": "చుక్క"
   },
   "4005725939358875643": {
      "message": "చర్య రద్దు చేయబడింది."
   },
   "4020393055976236243": {
      "message": "యాజమాన్యం in $2​లోని \"$3​\" నుండి $1​కు బదిలీ చేయబడుతుంది."
   },
   "4023299615382814997": {
      "message": "ట్రాష్‌లో సవరించడం సాధ్యపడదు"
   },
   "4030906186910275934": {
      "message": "వీక్షించండి"
   },
   "4036523543547629779": {
      "message": "చిత్రాలు"
   },
   "4044915502415235332": {
      "message": "పిన్ చేసిన గమనికను ఎంపిక చేస్తుంది"
   },
   "4052960606031736645": {
      "message": "{NUM_ITEMS,plural, =1{మీరు {NUM_PARENTS} ఫోల్డర్‌ల్లో ఉన్న ఫోల్డర్‌ను తరలిస్తున్నారు}other{మీరు {NUM_PARENTS} ఫోల్డర్‌ల్లో ఉన్న ఫోల్డర్‌లను తరలిస్తున్నారు}}"
   },
   "4061102590585232601": {
      "message": "$1​ తీసివేయబడ్డారు"
   },
   "4064820890482961434": {
      "message": "తనిఖీ పెట్టెలను చూపు"
   },
   "4072353527895477784": {
      "message": "వ్యక్తులు"
   },
   "407982090576503781": {
      "message": "నా డిస్క్‌కు తరలించాలా?"
   },
   "4081524305222967804": {
      "message": "నీలి ఆకుపచ్చ రంగు"
   },
   "4085493778209859942": {
      "message": "అయినా ప్లే చేయి"
   },
   "4086409218932829944": {
      "message": "లేబుల్‌లను సవరించండి"
   },
   "4087289538934418537": {
      "message": "తొలగిస్తే, మీరు సృష్టించిన గమనికలు ఎవరికీ కనిపించవు. మీతో భాగస్వామ్యం చేసిన గమనికలు ప్రాప్యత కలిగి ఉన్న వారికి కనిపిస్తూనే ఉంటాయి."
   },
   "4095714830819118951": {
      "message": "సహాయం"
   },
   "4097921967754832323": {
      "message": "హైఫన్"
   },
   "411137507354526852": {
      "message": "నెల"
   },
   "4111452225725405610": {
      "message": "\"$1​\"కి ఉన్న నక్షత్రం తీసివేయబడింది."
   },
   "4117632433281998979": {
      "message": "ప్రతి నెల"
   },
   "4122858386674768321": {
      "message": "$3​$2​$1​ నుండి తరలించు"
   },
   "4155905925766040098": {
      "message": "పరిదృశ్యం అందుబాటులో లేదు"
   },
   "4157091150222353401": {
      "message": "వ్యాఖ్యలు DOCX, PPTX మరియు XLSX ఫైళ్లకు సేవ్ చేయబడతాయి మరియు Microsoft Officeలో కనిపిస్తాయి"
   },
   "4174786386751618325": {
      "message": "ఫోటో గమనిక"
   },
   "4182427157920112948": {
      "message": "టిల్డ్"
   },
   "4186465168527990324": {
      "message": "\"$1​\" $2​కి విజయవంతంగా సంగ్రహించబడింది"
   },
   "4204345954541079744": {
      "message": "ఇంకా ఈ లేబుల్ ఉన్న గమనికలు ఏవీ లేవు"
   },
   "4206529410529166231": {
      "message": "{NUM_ITEMS,plural, =1{మీరు {NUM_PARENTS} ఫోల్డర్‌ల్లో ఉన్న అంశాన్ని తరలిస్తున్నారు}other{మీరు {NUM_PARENTS} ఫోల్డర్‌ల్లో ఉన్న అంశాలను తరలిస్తున్నారు}}"
   },
   "4209658291185545281": {
      "message": "చర్యను రద్దు చేయడం సాధ్యపడలేదు"
   },
   "4211182812451835307": {
      "message": "సవరించగలరు"
   },
   "4214190403999219403": {
      "message": "జూమ్ చేయి"
   },
   "4214427276033711472": {
      "message": "సెట్టింగ్‌లు"
   },
   "4216242742234357612": {
      "message": "అన్ని గమనికలను ఎంపిక చేస్తుంది"
   },
   "4216628828665009319": {
      "message": "వెన్నపండు ఆకుపచ్చ"
   },
   "4227767243455123953": {
      "message": "జాబితా ప్రవర్తన"
   },
   "4228870062013120023": {
      "message": "తదుపరి/మునుపటి గమనికకు నావిగేట్ చేస్తుంది"
   },
   "4230101516585408149": {
      "message": "కొత్త గమనికను కంపోజ్ చేయండి"
   },
   "4239183034054216803": {
      "message": "గోధుమ రంగు"
   },
   "4243437721135025638": {
      "message": "మీకు ఈ బృంద డిస్క్‌లోని ఫైల్‌లను తరలించడానికి అనుమతి లేదు."
   },
   "4248787844477062707": {
      "message": "కొత్త లేబుల్‌ను సృష్టించు"
   },
   "4267845092591696061": {
      "message": "ఎంచుకున్న అంశాలకు నక్షత్రం ఉంచండి/నక్షత్రం తీసివేయండి"
   },
   "4269096876505546324": {
      "message": "అభిప్రాయాన్ని పంపు"
   },
   "426927371216979233": {
      "message": "నియమాలు"
   },
   "4280747719095153198": {
      "message": "వ్యాఖ్య పరిష్కరించబడింది"
   },
   "4286663890332754386": {
      "message": "అప్‌లోడ్ విఫలమైంది."
   },
   "4293996570221590891": {
      "message": "తెలుపు రంగు"
   },
   "4296310694082659873": {
      "message": "ఎరేజర్ సాధనం"
   },
   "4299690446455033653": {
      "message": "Works"
   },
   "4310202846681054741": {
      "message": "{numberOfPreviews,plural, =1{లింక్ పరిదృశ్యం తీసివేయబడింది}other{# లింక్ పరిదృశ్యాలు తీసివేయబడ్డాయి}}"
   },
   "4318861667254318892": {
      "message": "Google వీడియో"
   },
   "4320831042030778": {
      "message": "రద్దు చేయి"
   },
   "4320942249997687388": {
      "message": "End"
   },
   "4321382260116636620": {
      "message": "గమనికను ఎంచుకోండి"
   },
   "4332252081504252077": {
      "message": "అయ్యో!"
   },
   "4343825450663233452": {
      "message": "వీక్షించగలరు"
   },
   "4343836986248234462": {
      "message": "జాబితా అంశం"
   },
   "4343848624651344174": {
      "message": "మధ్యాహ్నం"
   },
   "435214284915110062": {
      "message": "శోధన పట్టీని తెరవండి"
   },
   "435444400175963053": {
      "message": "$1​ అంశాలు $2​కి తరలించబడ్డాయి."
   },
   "4356312843186491987": {
      "message": "తరలించు"
   },
   "4391715930031906467": {
      "message": "తదుపరిదాన్ని కనుగొను"
   },
   "4397482594800054550": {
      "message": "\"$1​\" పేరు మార్చడంలో సమస్య ఏర్పడంది."
   },
   "4412626362660239325": {
      "message": "డిస్క్‌లో నిర్వహించండి"
   },
   "4421168692772991468": {
      "message": "ట్రాష్"
   },
   "4422985761498356257": {
      "message": "దీనితో తెరువు"
   },
   "4429542915339609008": {
      "message": "క్షమించండి, ఈ అనువర్తనంతో ఒకేసారి అనేక ఫైల్‌లను తెరవడానికి మద్దతు లేదు."
   },
   "4439831283519683004": {
      "message": "బూడిద రంగు"
   },
   "4444571967705751871": {
      "message": "ట్రాష్"
   },
   "4448871104213529122": {
      "message": "వివరాలను దాచు"
   },
   "4457424709416639982": {
      "message": "నా డిస్క్‌కు జోడించు"
   },
   "4462389610494427551": {
      "message": "సెంటీమీటర్లు"
   },
   "4466605492523079635": {
      "message": "సేవ్ చేయి"
   },
   "4486429060311743289": {
      "message": "ఎంపికను తీసివేయి"
   },
   "4494250072784000771": {
      "message": "స్టైలస్ గుర్తించబడింది. టచ్‌తో ప్యాన్ ప్రారంభించబడింది."
   },
   "45228242181482134": {
      "message": "ప్లే చేయి"
   },
   "4524999513489942668": {
      "message": "మీరు శ్రద్ధ వహించే అంశాలను ఒక క్లిక్‌తో Keepకి సేవ్ చేయడానికి $2​Google Keep Chrome పొడిగింపు$1​ను ఇన్‌స్టాల్ చేసుకోండి."
   },
   "4533605085334699862": {
      "message": "సూక్తులు"
   },
   "4543077011795639870": {
      "message": "అంశం డిడెంట్ చేయబడింది."
   },
   "4550209323331625907": {
      "message": "$2​మరింత తెలుసుకోండి$1​"
   },
   "4557086341175267918": {
      "message": "ఆఫ్‌లైన్‌లో భాగస్వామ్యం సాధ్యపడదు"
   },
   "4558568516353053251": {
      "message": "ఈ ఫైల్ వీక్షకులు వ్యాఖ్యలు మరియు సూచనలను చూడగలరు."
   },
   "4561316395348814504": {
      "message": "అనువర్తన డౌన్‌లోడ్‌లు"
   },
   "4564682305303579317": {
      "message": "కొనసాగించు"
   },
   "456512308416555173": {
      "message": "పుస్తకాలు"
   },
   "4566838580250578446": {
      "message": "{every,plural, =1{ప్రతి సంవత్సరం పునరావృతమవుతుంది}other{ప్రతి # సంవత్సరాలకు పునరావృతమవుతుంది}}"
   },
   "4583714435275461910": {
      "message": "మాతృ జాబితా అంశం"
   },
   "4586373282767984140": {
      "message": "పసుపు రంగు"
   },
   "4595551195988564947": {
      "message": "Google సహాయకం షాపింగ్ జాబితా మారుతోంది."
   },
   "4607656353105320648": {
      "message": "{count,plural, =1{గమనికను శాశ్వతంగా తొలగించాలా?}other{గమనికలను శాశ్వతంగా తొలగించాలా?}}"
   },
   "4607802784047113873": {
      "message": "సహకారిని జోడించు"
   },
   "4608848277887462246": {
      "message": "మరిన్ని షీట్‌లు"
   },
   "461126197624379601": {
      "message": "ఇతరులతో ఈ ఫైల్ గురించి చర్చించడానికి ఇక్కడ నొక్కండి"
   },
   "4620034373159179678": {
      "message": "$2​లో $1​వ పేజీ"
   },
   "4632830890362652221": {
      "message": "{NUM_ITEMS,plural, =1{మీరు ఒక ఫోల్డర్‌లో ఉన్న అంశాన్ని తరలిస్తున్నారు}other{మీరు ఒక ఫోల్డర్‌లో ఉన్న అంశాలను తరలిస్తున్నారు}}"
   },
   "4634925432725098930": {
      "message": "px"
   },
   "4643940860676429496": {
      "message": "సేవ్ చేస్తోంది..."
   },
   "4675792829115971960": {
      "message": "మేము ఈ గమనికను ఫ్లాగ్ చేస్తాము మరియు దీన్ని మీ ఖాతా నుండి తీసివేస్తాము."
   },
   "4685321580747790677": {
      "message": "{every,plural, =1{ప్రతి వారం {days} రోజుల్లో పునరావృతమవుతుంది}other{ప్రతి # వారాలకు {days} రోజుల్లో పునరావృతమవుతుంది}}"
   },
   "4690120479780049536": {
      "message": "పాయింట్‌లు"
   },
   "4691283408020124345": {
      "message": "జాబితా వీక్షణ"
   },
   "4697169479015785830": {
      "message": "దస్తూరి సాధనం రంగును మరియు పరిమాణ ఎంపికను తెరుస్తుంది"
   },
   "4697673185436885400": {
      "message": "$1​ బ్రౌజర్$2​ కీబోర్డ్ సత్వరమార్గం షీట్‌ల ద్వారా భర్తీ చేయబడింది"
   },
   "4698144269846224816": {
      "message": "పరిమాణం 1"
   },
   "4722167255291887189": {
      "message": "పరిమాణం 2"
   },
   "4727507448375670209": {
      "message": "సహకారులు"
   },
   "4738612839683751348": {
      "message": "ఇక మీదట అంశం ఇండెంట్ చేయబడదు."
   },
   "4740100782728373253": {
      "message": "డిస్క్‌కు సేవ్ చేయి"
   },
   "4748046231232264180": {
      "message": "Google ఫారమ్‌లు"
   },
   "4751202914935960324": {
      "message": "ఈ ఇమెయిల్ ఇప్పటికే ఉంది"
   },
   "4752655540567953719": {
      "message": "స్థానం $1​"
   },
   "4762625944764691132": {
      "message": "ప్రధాన మెను"
   },
   "47670360985205683": {
      "message": "\"$1​\" ($2​) Google స్కాన్ చేయగలిగే గరిష్ట ఫైల్ పరిమాణాన్ని మించిపోయింది. ఈ ఫైల్ మీ కంప్యూటర్‌కి హాని కలిగించవచ్చు, మీరు సమస్యలను అర్థం చేసుకుంటేనే ఈ ఫైల్‌ని ప్లే చేయండి."
   },
   "4767722428137216885": {
      "message": "రద్దు చేయి"
   },
   "477328789314249432": {
      "message": "గమనికలను శోధించండి"
   },
   "4773737319879079980": {
      "message": "అనువర్తనంతో గమనికలు వేగవంతం చేయండి"
   },
   "4775368111547931093": {
      "message": "వివరణ లేదు"
   },
   "4805047680716507619": {
      "message": " - దీనికి తరలించు:"
   },
   "4806763987633034948": {
      "message": "PKCS7 సిగ్నేచర్"
   },
   "4807444103404336088": {
      "message": "\"$1​\"కి నక్షత్రం జోడించడంలో సమస్య ఏర్పడింది."
   },
   "4821130290026382049": {
      "message": "ప్రసిద్ధ కీబోర్డ్ సత్వరమార్గాలు"
   },
   "4833214200453019325": {
      "message": "$2​లో $1​"
   },
   "4840513623749850224": {
      "message": "చలన చిత్రాలు"
   },
   "4847795993918486929": {
      "message": "చిత్ర వచనాన్ని సంగ్రహించడం సాధ్యపడదు. తర్వాత మళ్లీ ప్రయత్నించండి."
   },
   "4853788427396558692": {
      "message": "$1​ MB"
   },
   "4858389278403807208": {
      "message": "గమనిక ట్రాష్‌లో ఉంది"
   },
   "4863652737159067460": {
      "message": "సైన్ ఇన్ చేయి"
   },
   "4864051612562026766": {
      "message": "{count,plural, =1{1 ఎంచుకోబడింది}other{# ఎంచుకోబడ్డాయి}}"
   },
   "4878012031550736317": {
      "message": "{NUM_ITEMS,plural, =0{unused plural form}=1{వ్యక్తులు \"{TEAM_DRIVE_NAME}\" యొక్క సభ్యులు కాకపోతే, వారు ఈ ఫైల్‌కి యాక్సెస్‌ను కోల్పోతారు}other{వ్యక్తులు \"{TEAM_DRIVE_NAME}\" యొక్క సభ్యులు కాకపోతే, వారు ఈ ఫైల్‌లకు యాక్సెస్‌ను కోల్పోతారు.}}"
   },
   "4888104357342241891": {
      "message": "రిమైండర్‌లు"
   },
   "490045476479394048": {
      "message": "వ్యాఖ్య చేయాల్సిన వచనాన్ని హైలైట్ చేయండి"
   },
   "4901386320110714275": {
      "message": "పాస్‌వర్డ్ చెల్లదు. దయచేసి మళ్లీ ప్రయత్నించండి."
   },
   "4906669330059413958": {
      "message": "పాస్‌వర్డ్‌ను సమర్పించు"
   },
   "4907349694646937491": {
      "message": "గమనిక $1​వ సూచికకు తరలించబడింది"
   },
   "4915450884407029247": {
      "message": "$1​ లేబుల్ జోడించబడింది."
   },
   "4918998818369420588": {
      "message": "దుర్వినియోగాన్ని నివేదించు"
   },
   "4930422592340561418": {
      "message": "నా డిస్క్"
   },
   "4948512233726694061": {
      "message": "$4​పేజీ$1​$5​$3​$1​$7​/$2​$6​$8​$1​"
   },
   "4955094356920130803": {
      "message": "కాషాయరంగు"
   },
   "4957674814179289955": {
      "message": "తదుపరి/మునుపటి జాబితా అంశానికి నావిగేట్ చేయండి"
   },
   "4963784280521435720": {
      "message": "సేవ్ చేస్తోంది..."
   },
   "4974059227183970715": {
      "message": "అలాగే మీరు '#' టైప్ చేయడం ద్వారా లేబుల్‌లను జోడించవచ్చు."
   },
   "4982284738093713321": {
      "message": "నిర్వాహకుడు"
   },
   "4988132901627446385": {
      "message": "వివరాల ప్యానెల్ విస్తరించబడింది."
   },
   "5006765610090288212": {
      "message": "$1​ రంగు వర్తింపజేయబడింది"
   },
   "5008901799534614532": {
      "message": "తొలగించు"
   },
   "5009448218905630614": {
      "message": "తీసివేయి"
   },
   "5011858093760184160": {
      "message": "నక్షత్రాన్ని తీసివేయి"
   },
   "5013331898336483156": {
      "message": "కొత్త డొమైన్‌లో నా డిస్క్‌కు తరలించాలా?"
   },
   "501475221876543407": {
      "message": "మీరు జోడించే గమనికలు ఇక్కడ కనిపిస్తాయి"
   },
   "5023623739220371850": {
      "message": "ప్రామాణీకరించడంలో విఫలమైంది. మార్పులు మీరు సైన్ ఇన్ చేసినప్పుడు సమకాలీకరించబడతాయి."
   },
   "5041572047197549869": {
      "message": "ప్రతి నెల అదే రోజున"
   },
   "5045725997997672553": {
      "message": "{weekNumber,plural, =1{నెలలో మొదటి {day} రోజున}=2{నెలలో రెండవ {day} రోజున}=3{నెలలో మూడవ {day} రోజున}=4{నెలలో నాల్గవ {day} రోజున}other{నెలలో చివరి {day} రోజున}}"
   },
   "5046219519278664288": {
      "message": "iPhone & iPad"
   },
   "5046371569383796818": {
      "message": "అలాగే ఉంచు"
   },
   "5052461293250181960": {
      "message": "page down"
   },
   "5054818452036081005": {
      "message": "$2​గోప్యత$1​"
   },
   "5060107422621709815": {
      "message": "రిఫ్రెష్ చేయడం విఫలమైంది"
   },
   "5078184843381528205": {
      "message": "గమనికను పిన్ చేయి"
   },
   "5085332075590890665": {
      "message": "చర్యరద్దు చేయి"
   },
   "5086862627563516607": {
      "message": "{NUM_ITEMS,plural, =0{unused plural form}=1{\"{TEAM_DRIVE_NAME}\" సభ్యులు ఈ అంశానికి ప్రాప్యతను పొందుతారు.}other{\"{TEAM_DRIVE_NAME}\" సభ్యులు ఈ అంశాలకు ప్రాప్యతను పొందుతారు.}}"
   },
   "5094400861508407603": {
      "message": "బుల్లెట్ తీసివేయబడింది"
   },
   "5095987896933771566": {
      "message": "పత్రాన్ని ముద్రించండి"
   },
   "509815948423424872": {
      "message": "నావిగేషన్"
   },
   "5098941979861776792": {
      "message": "Enter"
   },
   "5121976648047240846": {
      "message": "లేబుల్‌ను తీసివేయి"
   },
   "5130903421326358933": {
      "message": "జోడింపుని Google డిస్క్‌కి సేవ్ చేయడంలో సమస్య ఏర్పడింది."
   },
   "5134649253619244584": {
      "message": "లేబుల్‌ను తొలగించు"
   },
   "5140285776541296873": {
      "message": "అనుకూలం"
   },
   "5140450179685369890": {
      "message": "{NUM_ITEMS_1,plural, =0{unused plural form}=1{{XXX_1}కి {NUM_ITEMS_2} ఫోల్డర్ తరలించబడింది.}other{{XXX_2}కి {NUM_ITEMS_2} ఫోల్డర్‌లు తరలించబడ్డాయి.}}"
   },
   "5151247077945318396": {
      "message": "సంగ్రహించాల్సిన ఫోల్డర్‌ను ఎంచుకుంటున్నప్పుడు లోపం సంభవించింది."
   },
   "5159511879001144721": {
      "message": "నల్ల కావిరాయి నీలం"
   },
   "5167365673547406876": {
      "message": "{NUM_ITEMS,plural, =0{unused plural form}=1{\"{TEAM_DRIVE_NAME}\" సభ్యులు యాక్సెస్ పొందుతారు.}other{\"{TEAM_DRIVE_NAME}\" సభ్యులు యాక్సెస్ పొందుతారు.}}"
   },
   "5178674191443894176": {
      "message": "లేబుల్‌లు"
   },
   "5180454621500142444": {
      "message": "పునరుద్ధరించండి"
   },
   "5180989337128758117": {
      "message": "ఎడమ కుండలీకరణం"
   },
   "5182569285908080938": {
      "message": "ముగింపు తేదీ ఎంపికలు"
   },
   "5184692850089055965": {
      "message": "చిత్ర వచనాన్ని సంగ్రహించు"
   },
   "5184785218378634051": {
      "message": "అంశం ఇకపై జూమ్ చేయబడదు."
   },
   "5197718200713913936": {
      "message": "C++"
   },
   "5201670213497642487": {
      "message": "వివరాల ప్యానెల్ ట్యాబ్ బార్. ట్యాబ్‌‍ల మధ్య మారడానికి ఎడమ మరియు కుడి బాణం కీలను నొక్కండి."
   },
   "5202835861850747976": {
      "message": "$2​మరింత తెలుసుకోండి$1​"
   },
   "5204391636475413312": {
      "message": "సేవ్ చేయి"
   },
   "5238284741118437734": {
      "message": "చర్యరద్దు"
   },
   "5238307666527496111": {
      "message": "సరే"
   },
   "5238371081785912565": {
      "message": "$1​తో తెరువు"
   },
   "5253765183290980485": {
      "message": "మీకు \"$1​\"లో అంశాలను జోడించడానికి మరియు సవరించడానికి మాత్రమే అనుమతి ఉంది, కాబట్టి మీరు ఈ చర్యను ఒకసారి అమలు చేసాక తిరిగి రద్దు చేయలేరు."
   },
   "5255388116256536182": {
      "message": "వ్యాఖ్య చేయడం కోసం గడులను ఎంచుకోవడానికి బాణం కీలను ఉపయోగించండి. ఎంపికను విస్తరించడం కోసం shiftని నొక్కి, పట్టుకుని బాణం కీలను నొక్కండి. వ్యాఖ్యని సృష్టించడం కోసం Enter లేదా రద్దు చేయడం కోసం Escape నొక్కండి."
   },
   "5259541708332520733": {
      "message": "మూలాధారం తీసివేయబడింది"
   },
   "5271615049826004958": {
      "message": "లింక్ పరిదృశ్య ఎంపికలు"
   },
   "5281121179861637423": {
      "message": "$1​ను ప్రాప్యత చేయడానికి పాస్‌వర్డ్ అవసరం. దయచేసి పాస్‌వర్డ్‌ను నమోదు చేయండి"
   },
   "5288037028604092288": {
      "message": "XPS"
   },
   "5299648222246616124": {
      "message": "బ్యాక్‌టిక్"
   },
   "5300527252159851865": {
      "message": "ఫైల్ కంటెంట్ ఆశించే ఫైల్ ఆకృతికి సరిపోలడం లేదు."
   },
   "5320475549855398784": {
      "message": "ఈ డ్రాయింగ్ మీరు ఇంటర్నెట్‌కు కనెక్ట్ అయినప్పుడు అందుబాటులోకి వస్తుంది."
   },
   "5321772883765574323": {
      "message": "\"$1​\" అంశం $2​ నుండి $3​కి తరలించబడింది."
   },
   "5334959887390704534": {
      "message": "మేము ఈ లేబుల్‌ను తొలగిస్తాము మరియు మీ అన్ని Keep గమనికల నుండి దీన్ని తీసివేస్తాము. మీ గమనికలు తొలగించబడవు."
   },
   "5336801339221383042": {
      "message": "జావాస్క్రిప్ట్"
   },
   "5336924963122494935": {
      "message": "దీన్ని ఎంచుకోండి"
   },
   "534191528712675978": {
      "message": "Pause"
   },
   "534228323125524312": {
      "message": "దూరంగా జూమ్ చేయండి"
   },
   "5353129315502554762": {
      "message": "స్టైల్ షీట్"
   },
   "5353173068672429342": {
      "message": "డీబగ్ సాధనాలు"
   },
   "5362962746518601227": {
      "message": "{NUM_ITEMS,plural, =1{మీరు ఒక ఫోల్డర్‌లో ఉన్న ఫైల్‌ను తరలిస్తున్నారు}other{మీరు ఒక ఫోల్డర్‌లో ఉన్న ఫైల్‌లను తరలిస్తున్నారు}}"
   },
   "5363853533596749934": {
      "message": "లేబుల్ పేరును నమోదు చేయండి"
   },
   "5372143986724491245": {
      "message": "$1​ రోజు క్రితం"
   },
   "5372160981898991853": {
      "message": "Publisher"
   },
   "5385273191513151655": {
      "message": "సూక్ష్మచిత్రాన్ని సృష్టిస్తోంది..."
   },
   "5392844646168201484": {
      "message": "పరిమాణం 3"
   },
   "5394695048211047984": {
      "message": "తేదీని జోడించండి"
   },
   "5398036630337418486": {
      "message": "పత్రాన్ని తెరువు"
   },
   "5399553230649155346": {
      "message": "$1​ గంటలో"
   },
   "5403636185480096151": {
      "message": "టీవీ"
   },
   "540596856674438371": {
      "message": "భాగస్వామ్యం ఆఫ్ చేయబడినందున భాగస్వామ్యం చేయలేరు."
   },
   "5408091115193390231": {
      "message": "AutoCAD"
   },
   "5413225497191133249": {
      "message": "గమనికలను పిన్ చేయి లేదా అన్‌పిన్ చేయి"
   },
   "5423742603774911808": {
      "message": "జాబితా చాలా పెద్దదిగా ఉంది."
   },
   "5435749276779042277": {
      "message": "+ మరో $1​"
   },
   "5447119197363232006": {
      "message": "డిస్క్‌లో చూపు"
   },
   "5455566801812656827": {
      "message": "తక్కువ"
   },
   "5465081454525683943": {
      "message": "ఈ గమనిక మీ ఖాతాతో భాగస్వామ్యం చేయబడదు. ప్రాప్యత కోసం యజమానిని అడగండి లేదా అనుమతితో ఖాతాకు మారండి."
   },
   "5467649767578147801": {
      "message": "{NUM_ITEMS,plural, =0{unused plural form}=1{వ్యక్తులు \"{TEAM_DRIVE_NAME}\" యొక్క సభ్యులు కాకపోతే లేదా {DOMAIN_NAME}లోని వారు కాకపోతే వారు ఈ ఫైల్‌కి యాక్సెస్‌ను కోల్పోతారు.}other{వ్యక్తులు \"{TEAM_DRIVE_NAME}\" యొక్క సభ్యులు కాకపోతే లేదా {DOMAIN_NAME}లోని వారు కాకపోతే వారు ఈ ఫైల్‌లకు యాక్సెస్‌ను కోల్పోతారు.}}"
   },
   "5472312735475866917": {
      "message": "$1​ చేసిన వ్యాఖ్య."
   },
   "547865385964196102": {
      "message": "$1​ నిమిషాల క్రితం"
   },
   "5478662967017843220": {
      "message": "ముదురు నీలి రంగు"
   },
   "5480497191725157666": {
      "message": "Esc"
   },
   "5482604275203517054": {
      "message": "ఎడమ"
   },
   "5503885447744017882": {
      "message": "$2​లోని లేని $1​కి తరలించాలా?"
   },
   "5506390497558702263": {
      "message": "{count,plural, =1{గమనిక ఆర్కైవ్ నుండి తీసివేసి, పిన్ చేయబడింది}other{# గమనికలు ఆర్కైవ్ నుండి తీసివేసి, పిన్ చేయబడ్డాయి}}"
   },
   "5520112019886360037": {
      "message": "మూసివేయి"
   },
   "5539958940810433464": {
      "message": "గమనికను ట్రాష్‌లోకి పంపుతుంది"
   },
   "5542817571710587822": {
      "message": "ఫైల్‌లో చాలా ఎక్కువ చిత్రాలు ఉన్నాయి."
   },
   "5545146751578623220": {
      "message": "Caps-Lock"
   },
   "5555182241047709329": {
      "message": "స్థానాన్ని ఎంచుకోండి"
   },
   "5555599189512365009": {
      "message": "అర్థమైంది"
   },
   "556742419793425318": {
      "message": "విస్మరించు"
   },
   "5581834527128285229": {
      "message": "\"$1​\"ని నా డిస్క్‌కి జోడించడంలో సమస్య ఏర్పడింది."
   },
   "5598649706113950710": {
      "message": "ఎడిటర్"
   },
   "5627470193961862490": {
      "message": "భవిష్యత్తు రిమైండర్‌లు ఉండే గమనికలు ఇక్కడ కనిపిస్తాయి"
   },
   "564165666160590723": {
      "message": "Windows మీడియా ప్లేయర్"
   },
   "5657974964218523724": {
      "message": "ట్రాష్ ఖాళీ చేయి"
   },
   "566719933273904590": {
      "message": "లేబుల్‌కు వెళ్లండి"
   },
   "5670235154099791694": {
      "message": "అం."
   },
   "5672326933907786881": {
      "message": "లాక్ స్క్రీన్ గమనికలు Google Keepకి స్వయంచాలకంగా సేవ్ చేయబడతాయి."
   },
   "5678095606167600931": {
      "message": "బుల్లెట్‌‌ చొప్పించబడింది"
   },
   "568072913338360182": {
      "message": "HTML"
   },
   "5707549724380589079": {
      "message": "ఎంచుకున్న అంశాలను తొలగించాలా?"
   },
   "5713014647314396479": {
      "message": "తర్వాత"
   },
   "5714240424645614611": {
      "message": "Android ప్యాకేజీ"
   },
   "5714760273477184428": {
      "message": "వ్యాఖ్య చేయాల్సిన ప్రాంతాన్ని హైలైట్ చేయడానికి బాణాలను వాడండి, ఆపై enterని నొక్కండి"
   },
   "5738003914096572768": {
      "message": "ప్రారంభించబడ్డాయి"
   },
   "5755541943799933389": {
      "message": "\"$1​\"కి నక్షత్రం జోడించబడింది."
   },
   "577619047319778196": {
      "message": "ఎంపికను క్లియర్ చేయి"
   },
   "5801257863595278616": {
      "message": "ఎంపిక ఎడమవైపుకు తరలించబడింది."
   },
   "5820033033803019104": {
      "message": "నిర్వహించు"
   },
   "5826302153453971149": {
      "message": "లేత గులాబి రంగు"
   },
   "5840202488368071194": {
      "message": "చిత్రం ఉండే కొత్త గమనిక"
   },
   "5840330517914556080": {
      "message": "దూరంగా జూమ్ చేయి"
   },
   "5854158607727111728": {
      "message": "Tab"
   },
   "585503297543253590": {
      "message": "తేదీన"
   },
   "5870134033985574990": {
      "message": "సంగ్రహిస్తోంది..."
   },
   "5871966496153339793": {
      "message": "$1​ వీడియో యొక్క సూక్ష్మచిత్రాన్ని ప్రదర్శిస్తోంది"
   },
   "5895666393386604578": {
      "message": "ఇండెంట్ చేయడానికి, మీ జాబితాలో అంశాలను లాగండి లేదా $1​ షార్ట్‌కట్‌ని ఉపయోగించండి."
   },
   "5909490544352162901": {
      "message": "ఈ గమనికకు ప్రాప్యత కోసం యజమానిని అడగండి లేదా అనుమతి కలిగి ఉన్న ఖాతాకు మారండి. మీరు $1​గా సైన్ ఇన్ అయ్యారు."
   },
   "5911012384539794869": {
      "message": "సంగ్రహణ విధిని ప్రారంభించడంలో విఫలమైంది."
   },
   "591481266986424156": {
      "message": "ప్రస్తుతం ఈ కీబోర్డ్ సత్వరమార్గాన్ని $1​ బ్రౌజర్ $2​ కోసం ఉపయోగిస్తోంది"
   },
   "5916010927050975496": {
      "message": "$1​ KB"
   },
   "5917528552332886959": {
      "message": "పరిష్కరించిన వ్యాఖ్యలను చూపు"
   },
   "5947790263929501779": {
      "message": "బుల్లెట్‌‌కి మార్చబడింది"
   },
   "5949528478488617689": {
      "message": "డౌన్‌లోడ్ అనుమతి"
   },
   "5950887255133612666": {
      "message": "ప్రారంభించబడలేదు."
   },
   "5954965790623966933": {
      "message": "ముదురు ఎరుపు"
   },
   "5961981688037913870": {
      "message": "$1​ జోడించబడింది"
   },
   "5965683144165568126": {
      "message": "జాబితా అంశం క్రమాన్ని మార్చండి"
   },
   "5969696744752069015": {
      "message": "పరిదృశ్యం అందుబాటులో లేదు."
   },
   "597927944425927829": {
      "message": "యాజమాన్యం \"$1​\" నుండి మీకు బదిలీ అవుతుంది."
   },
   "5984398071085567332": {
      "message": "Google ఫ్యూజన్ పట్టికలు"
   },
   "5987609488177213747": {
      "message": "లేబుల్‌ను సృష్టించు"
   },
   "5989809255170931770": {
      "message": "{time,plural, =1{Keep # సెకనులో నవీకరించబడుతుంది}other{Keep # సెకన్లలో నవీకరించబడుతుంది}}"
   },
   "6005084567691342649": {
      "message": "రిమైండర్‌లు"
   },
   "6009962986062136164": {
      "message": "$1​ని లోడ్ చేస్తోంది."
   },
   "6011637630664474614": {
      "message": "Space"
   },
   "6030537159236285525": {
      "message": "జాబితా అంశాన్ని తదుపరి/మునుపటి స్థానానికి తరలించండి"
   },
   "60305871484579258": {
      "message": "Alt"
   },
   "6033916931543811803": {
      "message": "{NUM_ITEMS_1,plural, =0{unused plural form}=1{{XXX_1} నుండి {XXX_2}కి {NUM_ITEMS_2} ఫోల్డర్ తరలించబడింది.}other{{XXX_3} నుండి {XXX_4}కి {NUM_ITEMS_2} ఫోల్డర్‌లు తరలించబడ్డాయి.}}"
   },
   "6043578784980337112": {
      "message": "$1​ ఫైల్‌లు $2​కి తరలించబడ్డాయి."
   },
   "6062216008944363143": {
      "message": "{weekNumber,plural, =1{నెలలో మొదటి {day} రోజున ప్రతి {every} నెలలకు పునరావృతమవుతుంది}=2{నెలలో రెండవ {day} రోజున ప్రతి {every} నెలలకు పునరావృతమవుతుంది}=3{నెలలో మూడవ {day} రోజున ప్రతి {every} నెలలకు పునరావృతమవుతుంది}=4{నెలలో నాల్గవ {day} రోజున ప్రతి {every} నెలలకు పునరావృతమవుతుంది}other{నెలలో చివరి {day} రోజున ప్రతి {every} నెలలకు పునరావృతమవుతుంది}}"
   },
   "6069780031254134657": {
      "message": "పూర్తయింది అని గుర్తు పెట్టు"
   },
   "6087078248621415351": {
      "message": "సవరించినది $1​"
   },
   "6100883940579706314": {
      "message": "లింక్ పరిదృశ్యం"
   },
   "6105571474005679446": {
      "message": "పరిదృశ్యంతో సమస్య ఏర్పడింది."
   },
   "6113237889871930608": {
      "message": "ఖాళీ గమనిక"
   },
   "6118623991445349480": {
      "message": "$1​వ పేజీ"
   },
   "6122643025527543706": {
      "message": "Ctrl"
   },
   "6127325177382263770": {
      "message": "URLలు"
   },
   "6128550071219729739": {
      "message": "చిత్రం తొలగించబడింది"
   },
   "6131822680770571276": {
      "message": "PowerPoint"
   },
   "6140634664402328750": {
      "message": "అనువర్తనాల జాబితా"
   },
   "6149175749937815029": {
      "message": "అన్ని అంశాలను వీక్షించండి"
   },
   "616807262818311711": {
      "message": "రకం"
   },
   "6185886893933834031": {
      "message": "ఎంచుకున్న వాటిని భద్రపరచు"
   },
   "6186753450686672643": {
      "message": "{every,plural, =1{ప్రతి రోజు పునరావృతమవుతుంది}other{ప్రతి # రోజులకు పునరావృతమవుతుంది}}"
   },
   "6201176165479907499": {
      "message": "{count,plural, =1{గమనిక పిన్ చేయబడింది}other{# గమనికలు పిన్ చేయబడ్డాయి}}"
   },
   "6203260615455347677": {
      "message": "సంఖ్యలు"
   },
   "6209117354086898503": {
      "message": "వెనుకకు"
   },
   "6211895332551673425": {
      "message": "$2​నా డిస్క్$1​కి జోడించబడింది/జోడించబడ్డాయి"
   },
   "6212070333807533570": {
      "message": "$2​నా డిస్క్$1​కి జోడిస్తోంది..."
   },
   "6223207695466118454": {
      "message": "YouTube"
   },
   "6224687211096863620": {
      "message": "ఎవరైనా"
   },
   "6252259197986158120": {
      "message": "నిన్న"
   },
   "6263940822259442857": {
      "message": "తనిఖీ పెట్టెలను దాచు"
   },
   "628140343505892786": {
      "message": "సెట్టింగ్‌లు"
   },
   "6286379137937560558": {
      "message": "కథనం"
   },
   "6286806453721792102": {
      "message": "డిస్క్‌లో నిర్వహించండి"
   },
   "6305748545202493254": {
      "message": "వివరాల పేన్‌ను చూపండి/దాచండి"
   },
   "6306268376900894985": {
      "message": "{endDate} వరకు పునరావృతమవుతుంది"
   },
   "6324768448533022780": {
      "message": "$1​ $2​"
   },
   "6336194821483049583": {
      "message": "డిఫాల్ట్ స్థానిక అనువర్తనం"
   },
   "6347484050944915390": {
      "message": "అభ్యర్థన పంపబడింది. ఆమోదించిన తర్వాత మీరు ఇమెయిల్‌ను స్వీకరిస్తారు."
   },
   "6352952829934775705": {
      "message": "మరిన్ని"
   },
   "6366376928558090914": {
      "message": "ఆహారం"
   },
   "6375244206466599493": {
      "message": "సంవత్సరం"
   },
   "6375395544374251820": {
      "message": "మరిన్ని పేజీలను లోడ్ చేస్తున్నప్పుడు సమస్య ఏర్పడింది. మళ్లీ ప్రయత్నిస్తున్నాము..."
   },
   "6377664889539934": {
      "message": "టచ్‌తో గీయండి"
   },
   "6381941041429900831": {
      "message": "సహకారిని జోడించు"
   },
   "6386587519843563719": {
      "message": "బైనరీ ఫైల్"
   },
   "639451288140270562": {
      "message": "Google డాక్స్‌కి కాపీ చేయబడింది"
   },
   "6394816510866826521": {
      "message": "డాగ్‌ఫుడ్"
   },
   "6413404795391222793": {
      "message": "కొత్త జాబితాను కంపోజ్ చేస్తుంది"
   },
   "6416495701611778255": {
      "message": "సూచిత మూడవ-పక్ష అనువర్తనాలు"
   },
   "6419411265907669340": {
      "message": "ఈ రోజు"
   },
   "6424277546995954045": {
      "message": "ప్రస్తుత బ్రౌజర్‌లో కీబోర్డ్ భర్తీ అందుబాటులో లేదు.\nఈ లక్షణాన్ని ప్రారంభించడానికి, Chrome, Firefox, IE/Edge లేదా Safariకి మార్చండి"
   },
   "6428000916830484004": {
      "message": "గోధుమ రంగు"
   },
   "6432019580434957057": {
      "message": "ఆడియో"
   },
   "6443615802319581315": {
      "message": "{NUM_ITEMS,plural, =1{ఈ ఫైల్‌ను దాని ప్రస్తుత ఫోల్డర్‌ల నుండి తరలించడానికి మీకు అనుమతి లేదు. బదులుగా ఫైల్‌ను {START_SPAN_1}{NAME}{END_SPAN}కి జోడించండి.}other{ఈ ఫైల్‌లను వాటి ప్రస్తుత ఫోల్డర్‌ల నుండి తరలించడానికి మీకు అనుమతి లేదు. బదులుగా ఫైల్‌లను {START_SPAN_2}{NAME}{END_SPAN}కి జోడించండి.}}"
   },
   "6450508807204492448": {
      "message": "$1​ చిహ్నం"
   },
   "6457802200418354862": {
      "message": "వీక్షకులు డౌన్‌లోడ్ చేయగలరు"
   },
   "6459405233858728718": {
      "message": "Google స్లయిడ్‌లు"
   },
   "6464761738227651511": {
      "message": "$1​ నిమిషం క్రితం"
   },
   "6466736813846482957": {
      "message": "మునుపటి"
   },
   "6466858417983764649": {
      "message": "స్థలాలు మరియు సమయాలకు అనుగుణంగా గమనికలకు రిమైండర్‌లను సెట్ చేయగలరు, వాయిస్ గమనికలను పొందగలరు, అలాగే ఆన్‌లైన్ లేదా ఆఫ్‌లైన్ రెండింటిలో పని చేయగలరు."
   },
   "6472238195689960152": {
      "message": "తెలుపు"
   },
   "6473102097014191455": {
      "message": "చిత్రలేఖన గమనిక"
   },
   "6477306554098527424": {
      "message": "Google అసిస్టెంట్"
   },
   "6480376252068839019": {
      "message": "ఓపెన్ గ్రిడ్ ఎంపికలు"
   },
   "6496683100661104868": {
      "message": "$2​ఓపెన్ సోర్స్ లైసెన్స్‌లు$1​"
   },
   "6497197865876438261": {
      "message": "సంగీతం"
   },
   "6507257480072167483": {
      "message": "లేబుల్ పేరు $1​కి మార్చబడింది."
   },
   "6510131849363684615": {
      "message": "రేపు"
   },
   "6513721414466645971": {
      "message": "తీసివేయబడ్డారు"
   },
   "6522917155620379865": {
      "message": "డౌన్‌లోడ్ చేయి"
   },
   "6524849072392100692": {
      "message": "Google డిస్క్ ఫోల్డర్"
   },
   "653160061888539741": {
      "message": "పురోగతి నియంత్రణ"
   },
   "6571686604846453345": {
      "message": "ఈ అంశాన్ని డిస్క్‌కి జోడించడంలో సమస్య ఏర్పడింది."
   },
   "6578339688410021742": {
      "message": "\"$1​\" సభ్యులందరూ అంశాలను ప్రాప్యత చేయగలరు."
   },
   "6579707685908557993": {
      "message": "సాయంత్రం"
   },
   "6582286158693833652": {
      "message": "మరింత తెలుసుకోండి"
   },
   "6588176324871799870": {
      "message": "Google అనువర్తనాల స్క్రిప్ట్"
   },
   "6618562607681757575": {
      "message": "ఏ ఫోల్డర్ నుండి తరలించవద్దు, కేవలం $3​$2​$1​కి జోడించండి"
   },
   "6622304228074863427": {
      "message": "అనువర్తనం"
   },
   "6627510416186113122": {
      "message": "లేత నీలి ఆకుపచ్చ రంగు"
   },
   "6650600936729710500": {
      "message": "ప్రత్యుత్తరాలు."
   },
   "6664835828596108553": {
      "message": "Option"
   },
   "670419277288558500": {
      "message": "వీడియో/ఆడియో"
   },
   "6707173584987026005": {
      "message": "ఈ రోజు"
   },
   "6710728478489145370": {
      "message": "మూసివేయి"
   },
   "6713235295664405475": {
      "message": "లో|కి"
   },
   "6715985122107380503": {
      "message": "రికార్డింగ్‌‍లు"
   },
   "6726462693927865256": {
      "message": "వివరాలు"
   },
   "6726879257388338969": {
      "message": "ముద్రించు"
   },
   "6732800471045353930": {
      "message": "ఈ గమనిక గరిష్ట సంఖ్యలో వ్యక్తులతో భాగస్వామ్యం చేయబడింది."
   },
   "673551770550324419": {
      "message": "వెడల్పుకు సరిపోయేలా అమర్చుతుంది"
   },
   "6747379635033535953": {
      "message": "కొత్త అంశాలను దిగువ జోడించు"
   },
   "6747528043814108113": {
      "message": "$1​కి మార్చబడింది"
   },
   "6749829802551750923": {
      "message": "పైకి"
   },
   "6750600017746655174": {
      "message": "ఎంపిక"
   },
   "6750827506231593056": {
      "message": "ఖాతాలను మార్చు"
   },
   "6761622351199419182": {
      "message": "గమనిక ఆర్కైవ్‌లో ఉంది"
   },
   "6773222938695237983": {
      "message": "{NUM_ITEMS,plural, =0{Unused}=1{ఈ అంశాన్ని భాగస్వామ్యం చేయాలా?}other{ఈ అంశాలను భాగస్వామ్యం చేయాలా?}}"
   },
   "6778577079172085976": {
      "message": "పిన్ చేసినవి"
   },
   "678660085936036852": {
      "message": "చిత్రాలను ప్రాసెస్ చేస్తోంది..."
   },
   "6787580031482277539": {
      "message": "ఎప్పుడూ వద్దు"
   },
   "6797862596948579998": {
      "message": "Chrome అనువర్తనం"
   },
   "6798055902819777633": {
      "message": "టచ్‌తో ప్యాన్ చేయండి"
   },
   "6801348618370627980": {
      "message": "$1​ లేబుల్ సృష్టించబడింది."
   },
   "6815042072535422726": {
      "message": "ఆడియో తొలగించబడింది"
   },
   "681598652078493281": {
      "message": "మరింత తెలుసుకోండి"
   },
   "6822520214440117457": {
      "message": "కార్యాలయం"
   },
   "6823109315717909214": {
      "message": "దీన్ని ప్రయత్నించండి"
   },
   "6831650827360444197": {
      "message": "గమనిక భాగస్వామ్యం చేయబడలేదు."
   },
   "6833062695195555756": {
      "message": "ఎరేజర్ సాధనం ఎంపికల మెనును తెరుస్తుంది"
   },
   "6833760103261954639": {
      "message": "ఈ పేజీని లోడ్ చేస్తున్నప్పుడు సమస్య ఏర్పడింది. మళ్లీ ప్రయత్నిస్తున్నాము..."
   },
   "6861978427131390279": {
      "message": "అభిప్రాయాన్ని పంపు"
   },
   "687402923448150707": {
      "message": "ఎంపిక తీసివేయబడింది"
   },
   "689017442055275529": {
      "message": "$1​ యొక్క కుటుంబ సమూహం"
   },
   "6891563484025164308": {
      "message": "మునుపటి"
   },
   "6898823203505321799": {
      "message": "వివరాలు"
   },
   "6904351530369058983": {
      "message": "యజమాని"
   },
   "691041991673354191": {
      "message": "నన్ను తీసివేయి"
   },
   "6918505531548047245": {
      "message": "హైలైటర్ సాధనం"
   },
   "6921237745237410511": {
      "message": "వ్యాఖ్యను జోడించండి"
   },
   "6922953828399110511": {
      "message": "వ్యూయర్‌ను మూసివేయండి"
   },
   "693770783324368110": {
      "message": "గమనికలు అన్‌పిన్ చేసి, ట్రాష్‌కి తరలించబడ్డాయి"
   },
   "695253297035211081": {
      "message": "ట్రాష్‌ను ఖాళీ చేయి"
   },
   "6980199665979997122": {
      "message": "పునరుద్ధరించు"
   },
   "6982682101118067511": {
      "message": "నిర్వహించబడుతోంది…"
   },
   "701276785305022936": {
      "message": "పత్రం పాడైంది. దయచేసి ఫైల్ అధునాతన ఆకృతిలోనే ఉన్నట్లు నిర్ధారించుకోండి."
   },
   "7017485862232001373": {
      "message": "\"$1​\" అంశం $2​కి జోడించబడింది."
   },
   "7019002927048576918": {
      "message": "$1​ శోధన ఫిల్టర్‌లు"
   },
   "7030308038380934896": {
      "message": "Google డాక్స్‌కి కాపీ చేయడం విఫలమైంది"
   },
   "7050021021988648361": {
      "message": "URLను కాపీ చేయి"
   },
   "7050898523853841537": {
      "message": "తరచుదనం ఎంపికలు"
   },
   "7054631817922169541": {
      "message": "Google Keep సేవ్ చేయని మార్పులను కలిగి ఉంది. మీరు పేజీ నుండి నిష్క్రమించి, మీ మార్పులను విస్మరించాలనుకుంటున్నారా?"
   },
   "705714112650622350": {
      "message": "Google డిస్క్‌కు అంశాన్ని జోడిస్తున్నప్పుడు సమస్య ఏర్పడింది."
   },
   "7059437903473652416": {
      "message": "YouTube వీడియో $1​ని ప్లే చేయి"
   },
   "7065454163742312322": {
      "message": "మరిన్ని రంగులు"
   },
   "7066744251212631722": {
      "message": "నిమ్మ రంగు"
   },
   "7084324152376766809": {
      "message": "$1​ రోజుల క్రితం"
   },
   "7084991134824194740": {
      "message": "నాకు గుర్తు చేయి"
   },
   "7086801490719148597": {
      "message": "దీని ఎంపికను తీసివేయండి"
   },
   "7094548885298700726": {
      "message": "ముదురు గోధుమ రంగు"
   },
   "7120211249329066227": {
      "message": "మీరు అసిస్టెంట్‌ను కలిగి ఉన్నారు!"
   },
   "7121259585839664942": {
      "message": "రద్దు చేయి"
   },
   "7126326627883991568": {
      "message": "ప్రస్తుత డ్రాయింగ్‌ను తొలగించు"
   },
   "7126535013613878060": {
      "message": "మీ ముఖ్యమైన గమనికలను పైభాగానికి పిన్ చేస్తుంది."
   },
   "7135182401951359795": {
      "message": "యాజమాన్యం మీకు బదిలీ చేయబడుతుంది."
   },
   "7141983486405549971": {
      "message": "Insert"
   },
   "7145753028985071097": {
      "message": "గమనిక క్రమాన్ని మారుస్తోంది"
   },
   "7146242673022399081": {
      "message": "వచనం"
   },
   "7148992630785407972": {
      "message": "ఈ ఫైల్ పాస్‌వర్డ్ సురక్షితమైనది మరియు దీన్ని పరిదృశ్యం చేయడం సాధ్యపడదు."
   },
   "7153847618034547771": {
      "message": "ప్రారంభించండి"
   },
   "7161134329606048317": {
      "message": "మూసివేయి"
   },
   "7161718175684624843": {
      "message": "లేబుల్‌ను తీసివేయి"
   },
   "7164532930742017984": {
      "message": "లింక్‌ను కలిగి ఉన్న వారెవరైనా"
   },
   "7166989725427500881": {
      "message": "ట్రాష్‌లో ఉంచిన గమనికను ఎంచుకోండి"
   },
   "7174189954350964804": {
      "message": "మళ్లీ ప్రయత్నించు"
   },
   "7174908348310449675": {
      "message": "మీ రిమైండర్ డిఫాల్ట్‌లను అనుకూలీకరించండి"
   },
   "7181961085183734135": {
      "message": "ఈ ఫైల్‌కు ముద్రణ సదుపాయం నిలిపివేయబడింది"
   },
   "7201188472754345797": {
      "message": "{NUM_ITEMS,plural, =0{unused plural form}=1{వ్యక్తులు \"{DESTINATION_DOMAIN}\"లోని వారు కాకపోతే వారు ఈ ఫైల్‌కి యాక్సెస్‌ను కోల్పోతారు.}other{వ్యక్తులు \"{DESTINATION_DOMAIN}\"లోని వారు కాకపోతే వారు ఈ ఫైల్‌లకు యాక్సెస్‌ను కోల్పోతారు.}}"
   },
   "7218693060378095915": {
      "message": "కొత్తది"
   },
   "722264179594523168": {
      "message": "రద్దు చేయి"
   },
   "7225445911355686176": {
      "message": "ఆర్కైవ్ చేసిన గమనికను ఎంచుకోండి"
   },
   "722702934847795304": {
      "message": "Project"
   },
   "7231231875581131930": {
      "message": "{NUM_ITEMS,plural, =0{Unused}=1{ఈ అంశాన్ని తిరిగి \"{TEAM_DRIVE_NAME}\"కి తరలించడం సాధ్యపడదు, కాబట్టి మీరు ఈ చర్యను రద్దు చేయలేరు.}other{కనీసం ఒక అంశాన్ని తిరిగి \"{TEAM_DRIVE_NAME}\"కి తరలించడం సాధ్యపడదు, కాబట్టి మీరు ఈ చర్యను రద్దు చేయలేరు.}}"
   },
   "723223692006219983": {
      "message": "పా."
   },
   "7247530225058410142": {
      "message": "$2​ $1​"
   },
   "7247965266239591227": {
      "message": "\"$1​\"ని సంగ్రహించడంలో సమస్య ఏర్పడింది."
   },
   "7251490702980298031": {
      "message": "హైలైటర్ సాధనం రంగు మరియు పరిమాణ ఎంపికను తెరుస్తుంది"
   },
   "7265183966796883739": {
      "message": "పరిష్కరించిన వ్యాఖ్యలను దాచు"
   },
   "7278398674737413598": {
      "message": "పత్రాన్ని మార్పిడి చేయడం సాధ్యపడలేదు."
   },
   "7278859550373246865": {
      "message": "{count,plural, =1{గమనిక ఆర్కైవ్ చేయబడింది}other{# గమనికలు ఆర్కైవ్ చేయబడ్డాయి}}"
   },
   "7290932540630116546": {
      "message": "రిమైండర్ సెట్ చేయబడింది. $1​"
   },
   "7295254213841803546": {
      "message": "మార్పులను విస్మరించాలా?  మీ మార్పులు సేవ్ చేయబడవు."
   },
   "7299749713933143099": {
      "message": "వంగపండు రంగు"
   },
   "7304355547638486270": {
      "message": "ఆడియోను ($1​) డౌన్‌లోడ్ చేయి"
   },
   "7306962184871750459": {
      "message": "యాజమాన్యం $3​లోని \"$4​\" నుండి $1​లోని \"$2​\"కు బదిలీ చేయబడుతుంది."
   },
   "7337660181466605745": {
      "message": "డిస్క్‌లోని \"$1​\"ని నవీకరించడంలో విఫలమయ్యాము."
   },
   "7342923890755029722": {
      "message": "మూసివేయి"
   },
   "7344507440412470266": {
      "message": "విస్తరించిన ఎంపిక."
   },
   "734478884582426793": {
      "message": "కుదించిన ఆర్కైవ్"
   },
   "7353547650196788656": {
      "message": "ఎరుపు రంగు"
   },
   "7364571366369083618": {
      "message": "వీడియో"
   },
   "7376703418960184879": {
      "message": "కాపీ చేయండి"
   },
   "7377239345926788722": {
      "message": "చర్యలు"
   },
   "7382688299146249119": {
      "message": "అంశాన్ని డౌన్‌లోడ్ చేయండి"
   },
   "7388342865555961406": {
      "message": "$1​ రోజులో"
   },
   "7393771571081973549": {
      "message": "C"
   },
   "7420117636241237177": {
      "message": "$1​ నుండి సందేశాలు మీ మెయిల్ ఖాతాలోని \"దిగుమతి: $2​\" లేబుల్‌లోకి సంగ్రహించబడ్డాయి."
   },
   "7426603384368095928": {
      "message": "దయచేసి తిరిగి సైన్ ఇన్ చేసి, పనిని కొనసాగించడానికి పేజీని మళ్లీ లోడ్ చేయండి."
   },
   "7427333772418801813": {
      "message": "+ మరో $1​ బటన్ విస్తరింపజేయబడింది"
   },
   "7429084719905985261": {
      "message": "ఆబ్జెక్టివ్ C"
   },
   "7432956605646331928": {
      "message": "SQL"
   },
   "7440735091552109962": {
      "message": "$2​ (సవరించినది $1​)"
   },
   "7441891675459021164": {
      "message": "డిస్క్‌కు సేవ్ చేస్తోంది"
   },
   "744753705925710199": {
      "message": "క్షమించండి, మీరు తెరవడానికి ప్రయత్నించిన అన్ని ఫైల్‌ల కోసం మేము ఈ అనువర్తనానికి అధికారం ఇవ్వలేకపోయాము. దయచేసి మళ్లీ ప్రయత్నించండి."
   },
   "7452116603589558390": {
      "message": "పిన్ చేసిన గమనిక ఎంపికను తీసివేస్తుంది"
   },
   "7453297286571818554": {
      "message": "Google డాక్స్‌కి కాపీ చేయి"
   },
   "7453307802804717178": {
      "message": "లేత నీలం రంగు"
   },
   "7458942806393710991": {
      "message": "ఆర్కైవ్ చేసిన గమనిక ఎంపికను తీసివేయి"
   },
   "7464780237502381438": {
      "message": "మరిన్ని యాప్‌లను కనెక్ట్ చేయి"
   },
   "7468842863971844562": {
      "message": "కొత్త జాబితా"
   },
   "7469895656894091562": {
      "message": "ఈ ఇమెయిల్ చెల్లదు"
   },
   "7482924911694634213": {
      "message": "{weekNumber,plural, =1{నెలలో మొదటి {day} రోజున ప్రతి నెల పునరావృతమవుతుంది}=2{నెలలో రెండవ {day} రోజున ప్రతి నెల పునరావృతమవుతుంది}=3{నెలలో మూడవ {day} రోజున ప్రతి నెల పునరావృతమవుతుంది}=4{నెలలో నాల్గవ {day} రోజున ప్రతి నెల పునరావృతమవుతుంది}other{నెలలో చివరి {day} రోజున ప్రతి నెల పునరావృతమవుతుంది}}"
   },
   "7483088916037874359": {
      "message": "ఫైల్ చాలా పెద్దది. "
   },
   "7488945223835574498": {
      "message": "Postscript"
   },
   "7503234138288940590": {
      "message": "శోధించండి"
   },
   "7507827375601925075": {
      "message": "గమనికను తదుపరి/మునుపటి స్థానానికి తరలించండి"
   },
   "7516769578943800930": {
      "message": "ఎంచుకోబడింది"
   },
   "7528204871156404767": {
      "message": "Safari"
   },
   "7529683448345488779": {
      "message": "నమోదు చేసిన పాస్‌వర్డ్ సరైనది కాదు; దయచేసి వేరే పాస్‌వర్డ్‌ని నమోదు చేయండి."
   },
   "7530677128711603655": {
      "message": "\"$1​\" కోసం శోధన ఫలితాలు"
   },
   "754367112212424716": {
      "message": "ఈ రోజులో కొంత సమయం తర్వాత"
   },
   "7564771400033548584": {
      "message": "{selectedCount,plural, =1{# ఎంచుకోబడింది}other{# ఎంచుకోబడ్డాయి}}"
   },
   "7565383798249439151": {
      "message": "$1​ రోజుల్లో"
   },
   "7579280421767578228": {
      "message": "పేర్కొనని రోజు కోసం రిమైండర్"
   },
   "7586291841734385643": {
      "message": "పాప్-అవుట్ చేయి"
   },
   "7587936635257676112": {
      "message": "$1​ జోడించబడ్డారు"
   },
   "7598582624136632660": {
      "message": "శోధన పట్టీని తెరవండి / వచనాన్ని కనుగొనండి"
   },
   "7598850438299201663": {
      "message": "\"$1​\"ని తెరుస్తోంది..."
   },
   "7599358608613738069": {
      "message": "తొలగించు"
   },
   "7604275940271852148": {
      "message": "మీ మెయిల్ ఖాతాలోకి సంగ్రహించండి"
   },
   "7604400308311739073": {
      "message": "పిన్ చేయి"
   },
   "7610628906656867728": {
      "message": "ఆర్కైవ్"
   },
   "7610654194202731772": {
      "message": "తొలగించండి"
   },
   "7624042048123264803": {
      "message": "గమనికను తెరవండి"
   },
   "7629685876277801112": {
      "message": "ఈ మ్యాప్స్ ఫైల్‌ను ప్రదర్శించడంలో సమస్య ఏర్పడింది."
   },
   "7630723924002267143": {
      "message": "కీబోర్డ్‌ సత్వరమార్గాలు ప్రారంభించబడ్డాయి."
   },
   "7631302417932873160": {
      "message": "వైరస్‌ల కోసం ఫైల్‌ను స్కాన్ చేయడం సాధ్యపడదు"
   },
   "7648759818896108920": {
      "message": "+$1​"
   },
   "7649506133540465463": {
      "message": "చర్యను రద్దు చేయలేకపోయింది."
   },
   "7653702763016575386": {
      "message": "నీలి రంగు"
   },
   "7656983816661099886": {
      "message": "అంశాలు"
   },
   "7659047104232758352": {
      "message": "అది|ఇది"
   },
   "7669677145513127809": {
      "message": "బృంద డిస్క్‌ల మధ్య తరలించాలా?"
   },
   "7669846901402551021": {
      "message": "ఈ రోజు"
   },
   "7690349821507417537": {
      "message": "$1​వ జాబితా అంశం తీసివేయబడింది"
   },
   "7690355160889785521": {
      "message": "ఆకుపచ్చ రంగు"
   },
   "7691521283331762131": {
      "message": "మీ ఆర్కైవ్ చేసిన గమనికలు ఇక్కడ కనిపిస్తాయి"
   },
   "7709557808259730054": {
      "message": "ఆమోదాలు"
   },
   "7709889936233398701": {
      "message": "తీసివేయి"
   },
   "7715735412192018288": {
      "message": "సహాయం"
   },
   "7715892737835649602": {
      "message": "మీరు ˮ#ˮ టైప్ చేయడం ద్వారా కూడా లేబుల్‌లను జోడించవచ్చు."
   },
   "772000107335590599": {
      "message": "$1​ నిమిషాల్లో"
   },
   "7724602581120994002": {
      "message": "నారింజ రంగు"
   },
   "7728066040934031356": {
      "message": "వంగపండు రంగు"
   },
   "7734578122414851725": {
      "message": "PHP"
   },
   "7735981667219692675": {
      "message": "{resultCount,plural, =1{# శోధన ఫలితం}other{# శోధన ఫలితాలు}}"
   },
   "774390292128857049": {
      "message": "శోధించు"
   },
   "7751981235297474273": {
      "message": "చర్య రద్దు చేయి"
   },
   "7754093419850121316": {
      "message": "⌘"
   },
   "7757440777278143092": {
      "message": "ముదురు బూడిద రంగు"
   },
   "7772544658778579390": {
      "message": "పత్రంలో కనుగొనండి"
   },
   "777546328624962090": {
      "message": "ఈ ఫైల్‌ను అప్‌లోడ్ చేయలేము. మేము $2​MB కంటే తక్కువ పరిమాణం ఉన్న మరియు $3​ కంటే తక్కువ మెగాపిక్సెల్‌లు ఉన్న $1​ ఫైల్‌లను ఆమోదిస్తాము."
   },
   "778181404304502404": {
      "message": "అంశం నుండి దూరంగా జూమ్ చేయబడింది."
   },
   "7791050524692390574": {
      "message": "రంగులు"
   },
   "7800318069267901681": {
      "message": "సవరించినది"
   },
   "7814778057875152792": {
      "message": "జోడింపుని Google డిస్క్‌లో ఎంచుకున్న ఫోల్డర్‌లోకి తరలించడంలో సమస్య ఏర్పడింది."
   },
   "7821512290975371360": {
      "message": "ముదురు గులాబి రంగు"
   },
   "7828886646639771557": {
      "message": "గమనిక వ్రాయండి..."
   },
   "7830513726270865588": {
      "message": "క్యాలెండర్"
   },
   "7842164552344536314": {
      "message": "నిర్వహిస్తున్నాము..."
   },
   "7844842290699524598": {
      "message": "లేబుల్ పరిమితిని చేరుకున్నారు. కొత్తదాన్ని జోడించడానికి ఇప్పటికే ఉన్న లేబుల్‌ను తొలగించండి."
   },
   "7845751753397906805": {
      "message": "వైరుధ్య సవరణలు కనుగొనబడ్డాయి"
   },
   "785840448809859989": {
      "message": "సమయం ఎంపికలు"
   },
   "7865240075542402013": {
      "message": "నక్షత్రాన్ని జోడించు"
   },
   "7868324478160174739": {
      "message": "నీలి రంగు"
   },
   "7873060817438017568": {
      "message": "$2​ · $1​"
   },
   "7873698934773957560": {
      "message": "ఏదీ కాదు"
   },
   "787773550893657271": {
      "message": "మునుపటి డ్రాయింగ్ తెరవబడింది"
   },
   "7888520165977111723": {
      "message": "బృంద డిస్క్‌కు తరలించాలా?"
   },
   "7895643887742936844": {
      "message": "సెమీకోలన్"
   },
   "7906726367011430855": {
      "message": "కనెక్ట్ చేయి"
   },
   "7910887984113996757": {
      "message": "భాగస్వామ్యాన్ని ఆన్ చేయండి"
   },
   "7922692430438844436": {
      "message": "సంగ్రహించు"
   },
   "792315196550007047": {
      "message": "సరిపోలే ఫలితాలు లేవు."
   },
   "7943657844420237650": {
      "message": "OpenOffice ఇంప్రెస్"
   },
   "7946114032014914338": {
      "message": "{repeatSentence}. {endSentence}"
   },
   "7947001788143789176": {
      "message": "లోడ్ చేస్తున్నాము…"
   },
   "7959130747647079558": {
      "message": "{selectedCount,plural, =1{# గమనిక ఎంచుకోబడింది}other{# గమనికలు ఎంచుకోబడ్డాయి}}"
   },
   "7976461426527138085": {
      "message": "జాబితాలు"
   },
   "7988058806865329896": {
      "message": "తేదీ & సమయాన్ని ఎంచుకోండి"
   },
   "7991475666499751798": {
      "message": "రిమైండర్ పూర్తయినట్టు గుర్తుపెడుతుంది"
   },
   "7996360883730444101": {
      "message": "క్షమించండి, ఈ ఫైల్‌ని తెరుస్తున్నప్పుడు లోపం సంభవించింది. దయచేసి మళ్లీ ప్రయత్నించండి."
   },
   "7998118521140187915": {
      "message": "పరిష్కరించిన వ్యాఖ్యలు దాచబడ్డాయి"
   },
   "8003252582874834655": {
      "message": "అంశాలను బృంద డిస్క్‌కు తరలించడం వలన యాక్సెస్ మరియు యాజమాన్యం మారుతుంది."
   },
   "8010075936095394680": {
      "message": "ఫైల్ సంస్కరణ చాలా పాతది. దయచేసి ఫైల్ అధునాతన ఆకృతిలోనే ఉన్నట్లు నిర్ధారించుకోండి. "
   },
   "8011497727123874703": {
      "message": "$1​ ఫోల్డర్ బటన్"
   },
   "8013687642711017862": {
      "message": "{NUM_ITEMS_1,plural, =0{unused plural form}=1{మీరు ఒక అంశాన్ని భాగస్వామ్య ఫోల్డర్‌ల నుండి వెలుపలికి తరలిస్తున్నారు, దీని వలన వ్యక్తులు ప్రాప్యతను కోల్పోతారు.}other{మీరు {NUM_ITEMS_2} అంశాలను భాగస్వామ్య ఫోల్డర్‌ల నుండి వెలుపలికి తరలిస్తున్నారు, దీని వలన వ్యక్తులు ప్రాప్యతను కోల్పోతారు.}}"
   },
   "8019402848412685977": {
      "message": "\"$2​\" పేరు \"$1​\"గా మార్చబడింది."
   },
   "802668096552856965": {
      "message": "{checkedItemCount,plural, =1{# పూర్తయిన వస్తువు}other{# పూర్తయిన వస్తువులు}}"
   },
   "8043514121228710092": {
      "message": "చిత్రాన్ని జోడించు"
   },
   "8044700199531805239": {
      "message": "$3​$1​$2​ కనెక్ట్ చేయబడింది."
   },
   "8046884224424523922": {
      "message": "{NUM_ITEMS_1,plural, =0{unused plural form}=1{{XXX_1} నుండి {XXX_2}కి {NUM_ITEMS_2} ఫైల్ తరలించబడింది.}other{{XXX_3} నుండి {XXX_4}కి {NUM_ITEMS_2} ఫైల్‌లు తరలించబడ్డాయి.}}"
   },
   "8063817953234049242": {
      "message": "ఎంపిక సాధనం"
   },
   "8066398070826666542": {
      "message": "{count,plural, =1{+ # పూర్తయిన వస్తువు}other{+ # పూర్తయిన వస్తువులు}}"
   },
   "8069384932934428393": {
      "message": "$1​ నిమిషంలో"
   },
   "807840433749698811": {
      "message": "నీలి ఆకుపచ్చ రంగు"
   },
   "8080583426915938264": {
      "message": "మీ కంప్యూటర్‌లోని అనువర్తనాలు"
   },
   "8085493757603803516": {
      "message": "ఎంపికను సవరించు"
   },
   "8090743714060857028": {
      "message": "వీక్షకులు డౌన్‌లోడ్ చేయలేరు"
   },
   "8095838445486198080": {
      "message": "{FILE_SIZE,plural, =0{0 బైట్‌లు}=1{1 బైట్}other{# బైట్‌లు}}"
   },
   "8111632928339277375": {
      "message": "{NUM_FOLDERS,plural, =1{ఒక ఫోల్డర్ నుండి తరలించు}=2{రెండు ఫోల్డర్‌ల నుండి తరలించు}other{# ఫోల్డర్‌లన్నింటి నుండి తరలించు}}"
   },
   "8125425371755035523": {
      "message": "చర్యరద్దు చేయి"
   },
   "8133866583554546341": {
      "message": "$1​, $2​"
   },
   "8135145577663029437": {
      "message": "రెండింటినీ భద్రపరచు"
   },
   "8139785559888164453": {
      "message": "మరింత తెలుసుకోండి"
   },
   "8144512434938656483": {
      "message": "లేదా"
   },
   "8146560259680897627": {
      "message": "రద్దు చేయి"
   },
   "8149439558305434788": {
      "message": "$1​, $2​"
   },
   "8159493406018222636": {
      "message": "అభిప్రాయాన్ని పంపండి"
   },
   "8163781449224244510": {
      "message": "ఉపసంహరించిన ఎంపిక."
   },
   "8174654098152723289": {
      "message": "వివరణను సవరించు"
   },
   "818217888086545352": {
      "message": "పసుపు రంగు"
   },
   "8189126656205301402": {
      "message": "Google డాక్స్‌కి కాపీ చేయి"
   },
   "8194941811853358224": {
      "message": "\"$1​\" నక్షత్రం తీసివేయడంలో సమస్య ఏర్పడింది."
   },
   "821942580510564685": {
      "message": "దయచేసి ఈ పత్రాన్ని వీక్షించడానికి దీని పాస్‌వర్డ్‌ను నమోదు చేయండి"
   },
   "8223878224920694193": {
      "message": "ప్రతి"
   },
   "8224193807932432983": {
      "message": "చర్యలు"
   },
   "8225614702924834215": {
      "message": "మరిన్ని ఎంపికలు"
   },
   "8231449936104909428": {
      "message": "\"$1​\"ని డిస్క్‌లో ఎంచుకున్న ఫోల్డర్‌కి తరలించడంలో సమస్య ఏర్పడింది."
   },
   "8233945959714786736": {
      "message": "మునుపటి"
   },
   "8242655297101700529": {
      "message": "నా డిస్క్"
   },
   "826433162451399549": {
      "message": "రేపు"
   },
   "8273434617910595878": {
      "message": "క్రిందికి"
   },
   "8281141013543828574": {
      "message": "ముడి చిత్రం"
   },
   "8292708563843446267": {
      "message": "అంశాలు \"$1​\" ఆధీనంలోకి వెళ్తాయి."
   },
   "8304474373444239435": {
      "message": "$1​ ఇచ్చిన ప్రత్యుత్తరం."
   },
   "8305505634689906340": {
      "message": "\"$1​\"లో శోధించండి"
   },
   "8322416564157128458": {
      "message": "భాగస్వామ్యం"
   },
   "8332720954679654953": {
      "message": "అనువర్తన డౌన్‌లోడ్‌లు"
   },
   "8337582740675387693": {
      "message": "జావా"
   },
   "8342620486324515462": {
      "message": "తీసివేయి"
   },
   "837692854094319105": {
      "message": "క్రింది వినియోగదారుల యొక్క నిర్వాహకులు వారి డొమైన్‌కి భాగస్వామ్యం చేయడాన్ని నిలిపివేసినందున వారితో భాగస్వామ్యం చేయడం సాధ్యపడదు."
   },
   "8379952094517631162": {
      "message": "వద్దు"
   },
   "8409190394690387796": {
      "message": "వ్యాఖ్యను జోడించండి"
   },
   "8412098268689886334": {
      "message": "విలీనం చేయి"
   },
   "8412733496413412439": {
      "message": "ఆఫ్‌లైన్‌లో ఉంది"
   },
   "84334343973701810": {
      "message": "Home"
   },
   "8452647597930138120": {
      "message": "వ్యాఖ్య చేయాల్సిన గడిని హైలైట్ చేయండి"
   },
   "8453627484113670693": {
      "message": "లేత నారింజ రంగు"
   },
   "8467894483369467251": {
      "message": "Flash"
   },
   "8471029293590878384": {
      "message": "పాజ్ చేయి"
   },
   "8493378997610580289": {
      "message": "మరిన్ని సత్వరమార్గాలు"
   },
   "8505989225387082493": {
      "message": "లేబుల్‌ను జోడించు"
   },
   "8509270263487836281": {
      "message": "సైన్ ఇన్ చేయి"
   },
   "8517148045938431718": {
      "message": "లోపాలను పరిష్కరించండి"
   },
   "8535303351837089357": {
      "message": "మీరు {modifierKey}+Z మరియు {modifierKey}+Yతో మార్పులను రద్దు చేయవచ్చు లేదా మళ్లీ చేయవచ్చు."
   },
   "8562196940800756925": {
      "message": "మార్కర్ సాధనం"
   },
   "8589423377647285975": {
      "message": "$1​ $2​ జాబితా అంశం $3​."
   },
   "8591848339430983053": {
      "message": "గమనికలు"
   },
   "8595175575778060149": {
      "message": "మరిన్ని"
   },
   "8596279649507974639": {
      "message": "ఇక్కడికి తరలించు"
   },
   "8602525917014156029": {
      "message": "స్థలాలు"
   },
   "8616342546716995946": {
      "message": "అర్థమైంది"
   },
   "8621067185485606452": {
      "message": "ECMAస్క్రిప్ట్"
   },
   "8621178077822096827": {
      "message": "$1​వ జాబితా అంశం చొప్పించబడింది"
   },
   "8626694988569301667": {
      "message": "డ్రాయింగ్ అందుబాటులో లేదు"
   },
   "8637215430007224613": {
      "message": "తదుపరి డ్రాయింగ్ తెరవబడింది"
   },
   "8646821180780920830": {
      "message": "లేబుల్‌లు"
   },
   "8652657235429996594": {
      "message": "త్వరలో రిమైండర్‌లు గలవి"
   },
   "8660016472468563221": {
      "message": "కోలన్"
   },
   "8663507590720636709": {
      "message": "$1​ +మరో $2​"
   },
   "8663993454460982287": {
      "message": "తనిఖీ పెట్టెలు దాచబడ్డాయి"
   },
   "8674222789100049233": {
      "message": "మూసివేయి"
   },
   "86815590954366945": {
      "message": "ఆర్కైవ్ చేయబడిన కంటెంట్ జాబితా"
   },
   "8708723278154759600": {
      "message": "గమనికలు ఆర్కైవ్ చేయబడ్డాయి"
   },
   "8726038895018570620": {
      "message": "లింక్‌కు వెళ్లండి"
   },
   "8734569874711220205": {
      "message": "నావిగేషన్ మెను"
   },
   "8738345098829705526": {
      "message": "పరిమాణం 12"
   },
   "8742388056829916665": {
      "message": "రిచ్ లింక్ పరిదృశ్యాలను ప్రదర్శించు"
   },
   "8773943264600860531": {
      "message": "Internet Explorer"
   },
   "8775097441636640256": {
      "message": "$2​ - $1​"
   },
   "8781837301864053001": {
      "message": "రిచ్ టెక్స్ట్"
   },
   "8786673003584562680": {
      "message": "Pg-Up"
   },
   "8792038552136453044": {
      "message": "అయ్యో! ఏదో తప్పు జరిగింది"
   },
   "8793166064242077041": {
      "message": "ఈ చిత్రాన్ని ప్రదర్శిస్తున్నప్పుడు సమస్య ఏర్పడింది."
   },
   "8822326207328431952": {
      "message": "చిత్రం అప్‌లోడ్‌లు అందుబాటులో లేవు"
   },
   "8825353897919495748": {
      "message": "{NUM_ITEMS,plural, =0{Unused plural form}=1{మీరు ఖచ్చితంగా ఈ ఫైల్‌ని తరలించాలనుకుంటున్నారా?}other{మీరు ఖచ్చితంగా ఈ ఫైల్‌లను తరలించాలనుకుంటున్నారా?}}"
   },
   "8845176264121061589": {
      "message": "అన్ని అంశాల ఎంపికను తీసివేయి"
   },
   "8851252390780816895": {
      "message": "క్లయింట్ లాగ్"
   },
   "8852550049823214385": {
      "message": "తర్వాత"
   },
   "8860658114732392347": {
      "message": "రిమైండర్‌ను తొలగించు"
   },
   "8867634760949689122": {
      "message": "ఫైల్‌ను మార్పిడి చేయలేకపోయింది: మార్పిడి ప్రక్రియ అమలు సమయం మించిపోయింది. దయచేసి తర్వాత మళ్లీ ప్రయత్నించండి."
   },
   "8868758864963683383": {
      "message": "గమనిక ఎంపికను తీసివేయి"
   },
   "8869202143464930500": {
      "message": "యాజమాన్యాన్ని $1​కి బదిలీ చేయాలా?"
   },
   "887001400549949730": {
      "message": "కొత్త విండోలో తెరువు"
   },
   "888015650266122140": {
      "message": "పర్యాయాలు"
   },
   "8889019648958415451": {
      "message": "తెలియని ఫైల్"
   },
   "8917554093651202032": {
      "message": "$1​ని ప్లే చేయి"
   },
   "8919660666733306860": {
      "message": "చిత్రం"
   },
   "8923591894816841670": {
      "message": "ఎంపిక కిందికి తరలించబడింది."
   },
   "8925842014466254066": {
      "message": "Google డాక్స్‌కి కాపీ చేస్తోంది"
   },
   "8930959387403789939": {
      "message": "రిమైండర్"
   },
   "8931267220766224111": {
      "message": "Google Keep రిమైండర్‌లను ఆన్ చేయాలా? మీరు బ్రౌజర్ నోటిఫికేషన్‌లను అనుమతించాల్సి ఉండవచ్చు."
   },
   "8938626240031421092": {
      "message": "తనిఖీ పెట్టెలను టోగుల్ చేస్తుంది"
   },
   "8943760679396635042": {
      "message": "$1​ని ప్రదర్శిస్తోంది."
   },
   "8953555255469284376": {
      "message": "చిత్రాలను ఇక్కడ వదలండి"
   },
   "8962132866274125834": {
      "message": "మళ్లీ చేయి"
   },
   "896590342186332268": {
      "message": "పరిమాణం 16"
   },
   "8975305711699693093": {
      "message": "వ్యాఖ్యల నిలువు వరుసను దాచు"
   },
   "8978442832029227748": {
      "message": "Google Jamboard"
   },
   "8979104019474011578": {
      "message": "{every,plural, =1{ప్రతి వారం పునరావృతమవుతుంది}other{ప్రతి # వారాలకు పునరావృతమవుతుంది}}"
   },
   "8979615310931291676": {
      "message": "సవరించినది $1​"
   },
   "8988925599985431446": {
      "message": "అన్‌పిన్ చేయి"
   },
   "900086393693234779": {
      "message": "ఇల్లు"
   },
   "9003585743562048321": {
      "message": "నెట్‌వర్క్ ఎర్రర్ కారణంగా వ్యాఖ్యలను సింక్ చేయడంలో విఫలమైంది."
   },
   "9012753183662045049": {
      "message": "చిన్న లేబుల్ పేరుని నమోదు చేయండి"
   },
   "9021945828354340363": {
      "message": "{count,plural, =1{ఈ గమనిక ఇకపై మీతో భాగస్వామ్యం చేయబడదు.}other{ఈ గమనికలు ఇకపై మీతో భాగస్వామ్యం చేయబడవు.}}"
   },
   "9024023699330078373": {
      "message": "ఈ అంశాన్ని తెరవడం వలన ఇది మీ డిస్క్‌కు జోడించబడుతుంది"
   },
   "9058308423774656474": {
      "message": "హాంగుల్ వర్డ్ ప్రాసెసర్"
   },
   "9063863448028905602": {
      "message": "ఫలితాల నుండి తీసివేయి"
   },
   "9072994494820207560": {
      "message": "ఎంచుకున్న వస్తువు"
   },
   "9083935734710258396": {
      "message": "తిరస్కరిస్తున్నాను"
   },
   "9094248058931620597": {
      "message": "వివరాల ప్యానెల్ కుదించబడింది."
   },
   "911586799466052745": {
      "message": "OpenOffice డ్రా"
   },
   "911698676339750373": {
      "message": "కుటుంబ సభ్యుల సమూహం"
   },
   "9121915169985572840": {
      "message": "రంగు మార్చు"
   },
   "9124422680181020503": {
      "message": "డ్రాయింగ్ తొలగించబడింది"
   },
   "9131268871618792263": {
      "message": "{NUM_ITEMS,plural, =0{unused plural form}=1{unused plural form}other{బృంద డిస్క్‌ల సభ్యులు ఈ అంశాలను వారితో భాగస్వామ్యం చేస్తే మినహా వాటికి ప్రాప్యతను కోల్పోతారు.}}"
   },
   "9149141099919589043": {
      "message": "కామాతో వేరు చేసిన విలువలు"
   },
   "9155213204821633067": {
      "message": "$1​ ఎంపిక తీసివేయబడింది."
   },
   "9180910903828232576": {
      "message": "{NUM_ITEMS_1,plural, =0{unused plural form}=1{{NUM_ITEMS_2} ఫోల్డర్ {XXX_1}కి జోడించబడింది.}other{{NUM_ITEMS_2} ఫోల్డర్‌లు {XXX_2}కి జోడించబడ్డాయి.}}"
   },
   "9197837492705576727": {
      "message": "తదుపరి అంశానికి వెళ్లండి"
   },
   "919969969251998566": {
      "message": "ఈ ఆర్కైవ్‌ని మీ మెయిల్ ఖాతాలోకి సంగ్రహించండి."
   },
   "9203454763088526300": {
      "message": "వచనాన్ని గుర్తించడం సాధ్యపడదు."
   },
   "9208632284144316801": {
      "message": "పునరావృతం చేయండి"
   },
   "9213031420087755232": {
      "message": "పేజీని తీసివేయి"
   },
   "9220412150349575379": {
      "message": "అంగుళాలు"
   },
   "938074023403688885": {
      "message": "తీసివేయి"
   },
   "951963820437151566": {
      "message": "Google సైట్‌లు"
   },
   "960732173870658714": {
      "message": "Google Keep పత్రం"
   },
   "969509857504028202": {
      "message": "ఫైల్‌లను బృంద డిస్క్ నుండి తరలించడం వలన యాక్సెస్ మరియు యాజమాన్యం మారుతాయి."
   },
   "976103457024703736": {
      "message": "\"$1​\"ని తెరవడం సాధ్యపడలేదు."
   },
   "985197728509875956": {
      "message": "కెమికల్ మోడల్"
   },
   "991852286447868510": {
      "message": "$1​ కోసం శోధిస్తోంది"
   },
   "99635082918315028": {
      "message": "చిత్ర వచనం సంగ్రహించబడింది"
   },
   "996381410993745580": {
      "message": "Photoshop"
   },
   "996406443443155276": {
      "message": "\"$1​\"ని తెరవడం సాధ్యపడలేదు."
   },
   "appDesc": {
      "description": "App description",
      "message": "మీ ఆలోచనలను వేగంగా వ్రాసుకుని, వాటిని స్నేహితులు మరియు కుటుంబ సభ్యులతో షేర్ చేసుకోండి."
   },
   "appName": {
      "description": "App name",
      "message": "Google Keep - గమనికలు మరియు జాబితాలు"
   },
   "shortName": {
      "description": "App short name",
      "message": "Google Keep"
   }
}
