{
   "1001407065815272462": {
      "message": "Добавянето в $2​Моят диск$1​ не е възможно"
   },
   "1013939682284715002": {
      "message": "Организиране"
   },
   "1029576232144989689": {
      "message": "Можете също да запазвате връзки за после с&nbsp;$2​разширението Google Keep за Chrome$1​."
   },
   "1039394921418415681": {
      "message": "Вход"
   },
   "1040405721361467195": {
      "message": "Използвайте клавишите със стрелки, за да изберете думи, които да коментирате. Задръжте Shift, докато натискате клавишите със стрелки, за да разгънете избраното. Натиснете Enter, за да създадете коментар, или Escape за отказ."
   },
   "1061011362310586469": {
      "message": "Споделяне"
   },
   "1083918249169198626": {
      "message": "Клавишните комбинации са деактивирани."
   },
   "1101371910696766077": {
      "message": "Създаване на копие"
   },
   "1105774658609209931": {
      "message": "Разширение за Chrome"
   },
   "1122146167985532789": {
      "message": "вчера"
   },
   "1127320433256851404": {
      "message": "Видеоплейър"
   },
   "1131044617724567645": {
      "message": "Коментарите в PDF файлове се запазват във файла и са видими в други приложения"
   },
   "1137446830169628669": {
      "message": "На елемента бе зададен отстъп."
   },
   "1158660505977623040": {
      "message": "Изтриване завинаги"
   },
   "1162642135048988280": {
      "message": "Преименуване на документа"
   },
   "1163324543881570799": {
      "message": "Google Документи"
   },
   "1166244120191806795": {
      "message": "Изпращане на отзиви"
   },
   "1177768120450365955": {
      "message": "Преместване на означените елементи в края"
   },
   "1179891706526242218": {
      "message": "Напред"
   },
   "1185164838496022543": {
      "message": "Моля, кликнете тук, за да презаредите страницата."
   },
   "1213005208968286932": {
      "message": "Означено като решено"
   },
   "124010372300613445": {
      "message": "{numNotes,plural, =1{Създадена бе разархивирана бележка}other{Създадени бяха # разархивирани бележки}}"
   },
   "124900027451629830": {
      "message": "Пускане"
   },
   "125608713654167241": {
      "message": "Синьо-зелено"
   },
   "1256362146573583104": {
      "message": "Извличане"
   },
   "1259492729704800881": {
      "message": "Архивиране на бележка"
   },
   "1263685395252160366": {
      "message": "LaTeX"
   },
   "1271038294394884640": {
      "message": "Отказ"
   },
   "12768758038718216": {
      "message": "Фиксиране на архивираната бележка"
   },
   "1280430284217153733": {
      "message": "Добавяне на час"
   },
   "1330083198022464084": {
      "message": "Създаване на нова бележка"
   },
   "1333255388111908292": {
      "message": "Хранителни стоки"
   },
   "1335763707789999819": {
      "message": "{NUM_ITEMS,plural, =1{Нямате разрешение да преместите този елемент от текущата му папка. Вместо това го добавете към {START_SPAN_1}{NAME}{END_SPAN}.}other{Нямате разрешение да преместите тези елементи от текущите им папки. Вместо това ги добавете към {START_SPAN_2}{NAME}{END_SPAN}.}}"
   },
   "1338300799355131761": {
      "message": "Неозаглавена бележка"
   },
   "1349697396109290623": {
      "message": "Показване на „$1​“ с по-висока разделителна способност"
   },
   "1359937199332190522": {
      "message": "{NUM_ITEMS_1,plural, =0{unused plural form}=1{{NUM_ITEMS_2} файл бе добавен в/ъв „{XXX_1}“.}other{{NUM_ITEMS_2} файла бяха добавени в/ъв „{XXX_2}“.}}"
   },
   "136335357683289450": {
      "message": "Затваряне"
   },
   "1368808491835583439": {
      "message": "Наситено лилаво"
   },
   "1379850360723600538": {
      "message": "Не се поддържат файлове, защитени с парола."
   },
   "1397887822627488928": {
      "message": "Човек или имейл, с които да споделите"
   },
   "139942704574044780": {
      "message": "Приемам"
   },
   "1419896259743862406": {
      "message": "Отваряне с/ъс"
   },
   "1432850707344442376": {
      "message": "Създаване на етикет „$1​“"
   },
   "1434081385486479995": {
      "message": "Споделянето не е възможно в момента"
   },
   "1439211265324766071": {
      "message": "Бележката е в кошчето"
   },
   "1441487391064925653": {
      "message": "Преглед на всички клавишни комбинации в Помощния център"
   },
   "1441712877952841568": {
      "message": "Редактирано: $1​"
   },
   "1442722292947881614": {
      "message": "Типове"
   },
   "1446829548948002072": {
      "message": "запетая"
   },
   "1453330983536591773": {
      "message": "Светлосиво"
   },
   "1463389029497634261": {
      "message": "Намаляване на силата на звука"
   },
   "1465828580966685215": {
      "message": "Прочистване на профила"
   },
   "1466663154000252842": {
      "message": "Някои хора може да загубят достъп"
   },
   "1467797923781828000": {
      "message": "Добавихте $1​ елемента в/ъв „$2​“."
   },
   "1473312930157933007": {
      "message": "Със следните потребители не може да се сподели, защото администраторът ви е деактивирал споделянето извън домейна ви."
   },
   "1475258635371833968": {
      "message": "$2​, $1​"
   },
   "1475261522522402536": {
      "message": "Избор на място"
   },
   "1478393252643397554": {
      "message": "Оранжево"
   },
   "1482452362096735080": {
      "message": "Повтаря се {numOccurrences} пъти"
   },
   "1499433769420882987": {
      "message": "Показва се „$1​“"
   },
   "1505876360160857231": {
      "message": "$1​ ТБ"
   },
   "1507063529674142853": {
      "message": "В последния ден от месеца"
   },
   "1507445189431379166": {
      "message": "Изтриване"
   },
   "1512114410402431831": {
      "message": "Опресняване"
   },
   "1512454807955173272": {
      "message": "Keep ще се актуализира, когато има връзка с интернет"
   },
   "1513178578981188988": {
      "message": "Edge"
   },
   "1532717559893630620": {
      "message": "Етикетът „$1​“ бе обединен с/ъс „$2​“."
   },
   "1536051766421561160": {
      "message": "равно"
   },
   "153659275234722804": {
      "message": "Отхвърляне"
   },
   "1543499632005215694": {
      "message": "{NUM_ITEMS,plural, =0{unused plural form}=1{Файлът, който се премества в/ъв „{ADDED_PARENT_NAME}“, задейства защитата от загуба на данни (ЗЗД). Той може да съдържа поверителна информация.}other{Някои от файловете, които се преместват в/ъв „{ADDED_PARENT_NAME}“, задействаха защитата от загуба на данни (ЗЗД). Те може да съдържат поверителна информация.}}"
   },
   "1568379678795589771": {
      "message": "Квадрати"
   },
   "1586968957182554447": {
      "message": "Деактивиране"
   },
   "1588268697057804046": {
      "message": "преди $1​ часа"
   },
   "1606998668553414638": {
      "message": "Заявка за достъп"
   },
   "1612117309990202511": {
      "message": "Точки"
   },
   "1623657263486883050": {
      "message": "см"
   },
   "1633798963327779260": {
      "message": "Утре"
   },
   "1655692513689044870": {
      "message": "Вече не сте в профила си."
   },
   "1656911987308166143": {
      "message": "Изтриване"
   },
   "1661251023749398110": {
      "message": "Изтегляне на аудиофайл"
   },
   "1665821947855814052": {
      "message": "Размер"
   },
   "1675900304699098572": {
      "message": "{count,plural, =1{Бележката бе освободена}other{# бележки бяха освободени}}"
   },
   "1680617124502957636": {
      "message": "В момента не може да се установи връзка. Опитайте отново по-късно."
   },
   "1680818623013843452": {
      "message": "Lucidchart"
   },
   "1683762293389974494": {
      "message": "Изтриване"
   },
   "1694896269813520248": {
      "message": "Добавяне на рисунка"
   },
   "1697160643589236962": {
      "message": "$1​ ПБ"
   },
   "1703175513040690135": {
      "message": "Всеки от $1​"
   },
   "1704004075228783011": {
      "message": "{every,plural, =1{Повтаря се ежемесечно в последния ден от месеца}other{Повтаря се на всеки # месеца в последния ден от месеца}}"
   },
   "1711424025297585662": {
      "message": "|"
   },
   "171683163267149669": {
      "message": "$1​ ГБ"
   },
   "1730171019350750807": {
      "message": "Черно"
   },
   "1737240194537729525": {
      "message": "Ежеседмично"
   },
   "1738407623218213194": {
      "message": "анонимен"
   },
   "1739900012825270238": {
      "message": "Към предишния елемент"
   },
   "1740371341228065086": {
      "message": "Презареждане"
   },
   "1745782414562966515": {
      "message": "Да се обедини ли етикетът „$1​“ с/ъс „$2​“? Всички бележки под „$1​“ ще бъдат означени като „$2​“, а етикетът „$1​“ ще бъде изтрит."
   },
   "1746512984326924716": {
      "message": "Това действие не може да се отмени."
   },
   "1783719421893050637": {
      "message": "Размери"
   },
   "178927681797742562": {
      "message": "Вход"
   },
   "1791115075948268631": {
      "message": "Отваряне на помощта за клавишните комбинации"
   },
   "179545118447015250": {
      "message": "Табличен изглед"
   },
   "1803966010993357655": {
      "message": "Други"
   },
   "1808245543551507519": {
      "message": "Аудио"
   },
   "1808500458645743749": {
      "message": "Бележките на заключения екран автоматично се запазват в Google Keep. Най-скорошната ви бележка ще остане върху заключения екран."
   },
   "1810354345035313773": {
      "message": "Отваряне на инструмента за избор на размера и цвета на инструмента за отбелязване"
   },
   "1819225489062185613": {
      "message": "Други"
   },
   "1823222042913714987": {
      "message": "Изпращане на паролата"
   },
   "1829174126565818591": {
      "message": "Firefox"
   },
   "1830157062072535681": {
      "message": "Показва се „$1​“"
   },
   "1852745815330163711": {
      "message": "Google Чертежи"
   },
   "1857224091554117760": {
      "message": "Червено"
   },
   "1870691479127746185": {
      "message": "стрелка за надясно"
   },
   "187077078156858455": {
      "message": "Аудиобележка"
   },
   "189303170370862360": {
      "message": "$1​ от $2​ елемента"
   },
   "1900571668686750716": {
      "message": "vCard"
   },
   "1901215424950227523": {
      "message": "Етикетът „$1​“ не съществува"
   },
   "1918176455405610789": {
      "message": "Готово"
   },
   "1936219394601788126": {
      "message": "родител"
   },
   "1938115711058331119": {
      "message": "Показване на колоната с коментари"
   },
   "195154114623528341": {
      "message": "Добавяне на местоположението"
   },
   "1956794332842050061": {
      "message": "Следваща страница"
   },
   "1965626377712226216": {
      "message": "Keynote"
   },
   "1967536906522187719": {
      "message": "При визуализирането на тази таблица възникна проблем."
   },
   "1968405748623909021": {
      "message": "Изпробвайте някое от приложенията по-долу, за да отворите или редактирате този елемент"
   },
   "1969531182936822963": {
      "message": "Действието бе отменено"
   },
   "1973454937875679500": {
      "message": "Въведете име на етикета"
   },
   "1975630610063119352": {
      "message": "{charsRemaining,plural, =1{Остава # знак}other{Остават # знака}}"
   },
   "1980209166254310911": {
      "message": "Ден"
   },
   "1988244842147989817": {
      "message": "Бележките в кошчето се изтриват след 7 дни."
   },
   "200005227964332868": {
      "message": "ОЩЕ"
   },
   "2003845117979929469": {
      "message": "Подробности"
   },
   "200488920523496447": {
      "message": "Увеличихте елемента."
   },
   "2039757863628752523": {
      "message": "Опции за честотата"
   },
   "205876860571942679": {
      "message": "Google My Maps"
   },
   "2059084517358086391": {
      "message": "Затваряне на лентата за търсене"
   },
   "2061440050632248160": {
      "message": "Архив"
   },
   "2068023589621557589": {
      "message": "Шрифт TrueType"
   },
   "2073322475696388995": {
      "message": "Пропускане напред"
   },
   "2074454463201225704": {
      "message": "Повторно задаване на увеличението"
   },
   "207810168108507460": {
      "message": "преди $1​ час"
   },
   "2085048987351765091": {
      "message": "РАЗБРАХ"
   },
   "2091811447965921066": {
      "message": "Премахване на потребителите"
   },
   "2107379241532042955": {
      "message": "Местоположение"
   },
   "2107589831642088814": {
      "message": "Създайте „$3​$2​$1​“"
   },
   "2109979457438465538": {
      "message": "Менюто на инструмента за избор на етикети бе отворено"
   },
   "2113092209746357267": {
      "message": "Chrome"
   },
   "2118635459760443566": {
      "message": "Напред"
   },
   "2119255452378336327": {
      "message": "Водещият символ бе върнат към $1​"
   },
   "212796670323571824": {
      "message": "OK"
   },
   "213665695896111861": {
      "message": "Бележки"
   },
   "2138593281154109183": {
      "message": "Архив"
   },
   "214517458278879973": {
      "message": "Вход като $1​"
   },
   "2147952938331523160": {
      "message": "Преименуване…"
   },
   "2154372123324862271": {
      "message": "наклонена черта"
   },
   "2166966123760559393": {
      "message": "Създаване на нов етикет"
   },
   "2168461275182666804": {
      "message": "Редактиране"
   },
   "2181197458532159304": {
      "message": "{numberOfNotes,plural, =1{Бележката бе преместена в кошчето}other{# бележки бяха преместени в кошчето}}"
   },
   "2184278444368405837": {
      "message": "$1​ елемента"
   },
   "2187239650627580457": {
      "message": "Изпращане"
   },
   "2189621188983913867": {
      "message": "Свързване на още приложения"
   },
   "2190049738646901760": {
      "message": "{count,plural, =1{Да се изтрие ли бележката?}other{Да се изтрият ли бележките?}}"
   },
   "2195440644060728966": {
      "message": "{NUM_ITEMS,plural, =1{Премествате папка, намираща се в една папка}other{Премествате папки, намиращи се в една папка}}"
   },
   "2198096971937872560": {
      "message": "Напомняне:"
   },
   "220168959069469607": {
      "message": "Още действия"
   },
   "2202265279234683999": {
      "message": "Клавишни комбинации"
   },
   "2203926649090909861": {
      "message": "Списъчният елемент бе преместен до индекс $1​"
   },
   "2215890921415017560": {
      "message": "Режим на цял екран"
   },
   "2216904725760458480": {
      "message": "Ежедневно"
   },
   "221715292685577880": {
      "message": "Да"
   },
   "2226562046914098941": {
      "message": "Файлът е твърде голям за визуализиране"
   },
   "2226937423434054727": {
      "message": "Избрахте $1​, $2​ до $3​, $4​"
   },
   "223198388381606871": {
      "message": "Лавандула"
   },
   "2264311811697505466": {
      "message": "Опресняване"
   },
   "2270469222412517777": {
      "message": "Текстът не може да бъде разпознат"
   },
   "2270633624888102832": {
      "message": "Освобождаване на бележката"
   },
   "2280650195464600721": {
      "message": "Придвижване"
   },
   "2282423663539387332": {
      "message": "Предстоящи"
   },
   "2285069188138705005": {
      "message": "Свързани приложения"
   },
   "2286685488296851497": {
      "message": "{NUM_ITEMS_1,plural, =0{unused plural form}=1{Премествате елемент извън споделената папка „{SHARED_FOLDER_NAME}“, така че хората ще загубят достъп.}other{Премествате {NUM_ITEMS_2} елемента извън споделената папка „{SHARED_FOLDER_NAME}“, така че хората ще загубят достъп.}}"
   },
   "228741435562395266": {
      "message": "Отпечатването още не е налице"
   },
   "2289534534793293486": {
      "message": "Деархивиране"
   },
   "2289812403593835836": {
      "message": "Pages"
   },
   "229177484946387188": {
      "message": "Google Earth"
   },
   "2292696732672795285": {
      "message": "Увеличаване на силата на звука"
   },
   "2299671629154778581": {
      "message": "Бележките бяха освободени и архивирани"
   },
   "2308018963132768704": {
      "message": "Размер 4"
   },
   "2310145944356900158": {
      "message": "С отметка"
   },
   "2311880726221661199": {
      "message": "Зареждат се по-високи разделителни способности"
   },
   "2324955914430674498": {
      "message": "Няма резултати от търсенето на „$1​“"
   },
   "2329167963662998826": {
      "message": "Google Keep иска да използва местоположението ви с цел подобряване на предложенията за места при напомнянията за местоположения."
   },
   "2346361265476305332": {
      "message": "Собственикът не разрешава изтеглянето на този аудиофайл."
   },
   "2357623745116912085": {
      "message": "{NUM_ITEMS,plural, =0{unused plural form}=1{Членовете на „{TEAM_DRIVE_NAME}“ ще загубят достъп, освен ако този елемент не е споделен с тях.}other{Членовете на „{TEAM_DRIVE_NAME}“ ще загубят достъп, освен ако тези елементи не са споделени с тях.}}"
   },
   "2357761837816388330": {
      "message": "Офлайн"
   },
   "2359614137862708172": {
      "message": "Shift"
   },
   "2364374826543847335": {
      "message": "Премахване на източника"
   },
   "236689092839978781": {
      "message": "Не се повтаря"
   },
   "2370656573843123707": {
      "message": "дясна скоба"
   },
   "2373760032138505521": {
      "message": "Етикетът вече съществува"
   },
   "2386536768112358461": {
      "message": "Page Down"
   },
   "2396804279177914769": {
      "message": "Собствеността да се прехвърли ли към екипния диск?"
   },
   "2405795704816921421": {
      "message": "Файл „$1​“"
   },
   "2408383448126741628": {
      "message": "Продължителност"
   },
   "2408933271548524782": {
      "message": "Заключено"
   },
   "2423877407428530040": {
      "message": "Файлът съдържа твърде много диаграми."
   },
   "2433429041384246549": {
      "message": "Спиране"
   },
   "2444198666025646119": {
      "message": "Виолетово"
   },
   "2449254824382583885": {
      "message": "Отделяне"
   },
   "2452145367257933677": {
      "message": "Отмяна"
   },
   "2452522051596946166": {
      "message": "Ами сега! При визуализирането на „$1​“ възникна проблем. Извършва се нов опит."
   },
   "2454642351139428112": {
      "message": "Отмяна"
   },
   "2466251465475184755": {
      "message": "Искате ли да изпразните кошчето?  Всички бележки в него ще бъдат изтрити за постоянно."
   },
   "2475181823688399272": {
      "message": "Напред"
   },
   "2478862372619762755": {
      "message": "Откройте област, която да коментирате"
   },
   "2483363439634684283": {
      "message": "Размер 20"
   },
   "2504232652631703202": {
      "message": "Установена е връзка"
   },
   "251025074207413762": {
      "message": "Добавяне на описание"
   },
   "2525633490863427854": {
      "message": "Възстановяване"
   },
   "2527534830196374788": {
      "message": "Ctrl"
   },
   "2532280782491328445": {
      "message": "Търсене на предишното"
   },
   "2555961950726197809": {
      "message": "Визуализаторът е показан."
   },
   "2562881166530755046": {
      "message": "Рисунки"
   },
   "257317112834806705": {
      "message": "Превключване между списъчен и табличен изглед"
   },
   "2579261044590673579": {
      "message": "Моят диск"
   },
   "2579679351920691492": {
      "message": "Пропускане назад"
   },
   "2581526424350930407": {
      "message": "Редактиране"
   },
   "2584557103820423944": {
      "message": "Добавяне/премахване на отстъп на списъчен елемент"
   },
   "2600731575260427177": {
      "message": "Файлът не съществува и може да е бил изтрит. Моля, опитайте да го качите отново."
   },
   "2601304136110057215": {
      "message": "Нова рисунка"
   },
   "2604527707881848686": {
      "message": "Отстъпът на елемента не може да се намали повече."
   },
   "2609409316752026806": {
      "message": "PDF"
   },
   "2609767652209789035": {
      "message": "Етикети"
   },
   "2623861453769098676": {
      "message": "При визуализирането на този документ възникна проблем."
   },
   "2626653026098396543": {
      "message": "{NUM_ITEMS,plural, =0{Unused}=1{След преместването този елемент ще бъде споделен с всички, които могат да виждат споделената папка „{SHARED_FOLDER_NAME}“.}other{След преместването тези елементи ще бъдат споделени с всички, които могат да виждат споделената папка „{SHARED_FOLDER_NAME}“.}}"
   },
   "2630254198275172065": {
      "message": "Преместване във…"
   },
   "2632263751512428257": {
      "message": "Ежегодно"
   },
   "2645469029410848421": {
      "message": "{noteCount,plural, =1{Означаване на бележката с етикет}other{Означаване на бележките с етикет}}"
   },
   "2661850177130037208": {
      "message": "Отваряне на елемента"
   },
   "2680303811435018716": {
      "message": "Не могат да се добавят още елементи"
   },
   "2681830832355823748": {
      "message": "Търсене във всички клавишни комбинации"
   },
   "268402507078609011": {
      "message": "{imagesAdded,plural, =1{Изображението е добавено}other{# изображения са добавени}}"
   },
   "2702485557996900362": {
      "message": "Коригиране на несъвместимите редакции"
   },
   "2704959686524436777": {
      "message": "Зарежда се"
   },
   "2715199780155065699": {
      "message": "Файлът съдържа твърде много фигури, текстови полета или чертежи."
   },
   "2716433087531258659": {
      "message": "page up"
   },
   "2719125961689709460": {
      "message": "Бележка"
   },
   "2742719907061406418": {
      "message": "XML"
   },
   "2758125083752925237": {
      "message": "(собственик)"
   },
   "2760106082595028595": {
      "message": "Бележката е твърде голяма."
   },
   "277430914014962533": {
      "message": "Ами сега! При визуализирането на „$1​“ възникна проблем."
   },
   "2777453609143551768": {
      "message": "Контрол на силата на звука"
   },
   "2793841261389879255": {
      "message": "Предишна страница"
   },
   "2794676336056877832": {
      "message": "{every,plural, =1{Повтаря се ежемесечно в един и същ ден всеки месец}other{Повтаря се на всеки # месеца в един и същ ден всеки месец}}"
   },
   "2798322202738486782": {
      "message": "{HOURS,plural, =0{0 часа }=1{1 час }other{# часа }}{MINUTES,plural, =0{0 минути }=1{1 минута }other{# минути }}{SECONDS,plural, =0{0 секунди.}=1{1 секунда.}other{# секунди.}}"
   },
   "2803553109654833664": {
      "message": "Розово"
   },
   "2818020101821669029": {
      "message": "Създадено"
   },
   "2820045170951016567": {
      "message": "Напомняния"
   },
   "2823533464825550362": {
      "message": "Контроли за документи"
   },
   "2827039933590757722": {
      "message": "Пряк път в Windows"
   },
   "2828060233316503200": {
      "message": "{NUM_ITEMS_1,plural, =0{unused plural form}=1{{NUM_ITEMS_2} елемент бе преместен от „{XXX_1}“ в/ъв „{XXX_2}“.}other{{NUM_ITEMS_2} елемента бяха преместени от „{XXX_3}“ в/ъв „{XXX_4}“.}}"
   },
   "2829226075651806940": {
      "message": "Увеличаване на мащаба"
   },
   "2842462703735289745": {
      "message": "Всички, които могат да виждат споделената папка „$1​“, ще получат достъп."
   },
   "2853036885874864031": {
      "message": "Собствеността ще бъде прехвърлена към $1​."
   },
   "2854717396594966319": {
      "message": "OpenOffice Writer"
   },
   "2858566870229558873": {
      "message": "$2​Условия$1​"
   },
   "2862675909830094845": {
      "message": "Създаване на нов етикет"
   },
   "2873089307546162154": {
      "message": "ОK"
   },
   "2877285560485318801": {
      "message": "Поставяне на пауза"
   },
   "2879276552944958066": {
      "message": "Назад към папката „$1​“."
   },
   "2886313667612471214": {
      "message": "Нужно е опресняване. Може да отнеме няколко минути."
   },
   "2893055432094515558": {
      "message": "Квадратчетата за отметка са показани"
   },
   "289798573180023043": {
      "message": "OK"
   },
   "2901360496423912565": {
      "message": "Подаване на сигнал"
   },
   "2902570047322934912": {
      "message": "Активиране на функцията за споделяне"
   },
   "2908917161758545146": {
      "message": "{count,plural, =1{Бележката бе освободена и архивирана}other{# бележки бяха освободени и архивирани}}"
   },
   "292972929665636688": {
      "message": "Вече можете да използвате Google Асистент за създаване на нови бележки и списъци в Keep."
   },
   "2935193106137642160": {
      "message": "Увеличението не е налице"
   },
   "2942094715879803305": {
      "message": "Изтриване на елементите с отметка"
   },
   "295331174171409695": {
      "message": "При актуализирането на разрешението за изтегляне на „$1​“ възникна проблем."
   },
   "2960516445247616550": {
      "message": "Отпечатването не е налице"
   },
   "296391753033307868": {
      "message": "Етикетът „$1​“ бе създаден и бе добавен към бележката."
   },
   "2964778642459027786": {
      "message": "Няма бележки в кошчето"
   },
   "2971623719720688041": {
      "message": "Действието бе отменено"
   },
   "2971780287153684447": {
      "message": "Устройства с Android"
   },
   "2973306402585941108": {
      "message": "Сутрин"
   },
   "298817883481775869": {
      "message": "Зарежда се..."
   },
   "2990497076082409431": {
      "message": "Преместихте „$1​“ в/ъв „$2​“."
   },
   "2993901764282547916": {
      "message": "App Maker"
   },
   "3005058076425755361": {
      "message": "Backspace"
   },
   "3018905429279095639": {
      "message": "{NUM_ITEMS,plural, =1{Нямате разрешение да преместите тази папка от текущата й папка. Вместо това я добавете в/ъв {START_SPAN_1}{NAME}{END_SPAN}.}other{Нямате разрешение да преместите тези папки от текущите им папки. Вместо това ги добавете в/ъв {START_SPAN_2}{NAME}{END_SPAN}.}}"
   },
   "3043961722025425136": {
      "message": "Описание"
   },
   "3045997283325725532": {
      "message": "Новите неща в Google Keep"
   },
   "306516303501625305": {
      "message": "Удостоверяването не бе успешно."
   },
   "3108098439469164127": {
      "message": "Отворена е нова рисунка"
   },
   "3109321241584918345": {
      "message": "Свързване на още приложения..."
   },
   "3121560585545725724": {
      "message": "$1​, $2​"
   },
   "3140236589681731084": {
      "message": "след $1​ часа"
   },
   "3147722095652727387": {
      "message": "Със следните потребители не може да се сподели, защото или техният администратор е деактивирал споделянето в домейна им, или вашият е деактивирал споделянето извън домейна ви."
   },
   "3149135495425830054": {
      "message": "Предложенията и автоматичното довършване са налице, когато сте в профила си"
   },
   "3150651996344750990": {
      "message": "{count,plural, =1{Бележката е деархивирана}other{# бележки са деархивирани}}"
   },
   "3167198321908629554": {
      "message": "Опресняване и презареждане на бележките ви…"
   },
   "3176246635438298155": {
      "message": "Delete"
   },
   "3187117482772485385": {
      "message": "Миниизображението се създава..."
   },
   "3189854932778515441": {
      "message": "Бележката е в архива"
   },
   "3190546672187601036": {
      "message": "През нощта"
   },
   "3195812604657128345": {
      "message": "Изберете папка в Диск, в която да се извърши извличането"
   },
   "32059145043728507": {
      "message": "{numberOfNotes,plural, =1{Бележката бе възстановена}other{# бележки бяха възстановени}}"
   },
   "3207650089232728475": {
      "message": "Промяна на етикетите"
   },
   "3211163842850942567": {
      "message": "Увеличаване на мащаба"
   },
   "3217354672216773127": {
      "message": "Задействано на $1​"
   },
   "3220641589840600333": {
      "message": "Превключихте към изгледа „$1​“"
   },
   "3241696131593027453": {
      "message": "Избиране на бележка"
   },
   "3243916603465112517": {
      "message": "ПО-МАЛКО"
   },
   "3249966726137025950": {
      "message": "Семейна група на сътрудника"
   },
   "3250489229749307913": {
      "message": "ePub файл"
   },
   "3258100527833044153": {
      "message": "Празната рисунка бе отхвърлена"
   },
   "3261131345401321392": {
      "message": "Може да коментира"
   },
   "3266448715145955862": {
      "message": "Бележките бяха деархивирани и фиксирани"
   },
   "3268028083415317236": {
      "message": "Не, благодаря"
   },
   "3272496516667407797": {
      "message": "При зареждането на подробностите възникна проблем."
   },
   "3278046126264096288": {
      "message": "Седмица"
   },
   "3281684668260174833": {
      "message": "{numberOfNotes,plural, =1{Бележката бе освободена и преместена в кошчето}other{# бележки бяха освободени и преместени в кошчето}}"
   },
   "3288498486633948368": {
      "message": "Добавихте „$1​“ в Google Диск."
   },
   "330603631583186798": {
      "message": "Word"
   },
   "3308935528045767909": {
      "message": "Нова бележка с рисунка"
   },
   "3312545971976531405": {
      "message": "Message"
   },
   "3326410145104517459": {
      "message": "Записвайте мислите си $1​ на всяко устройство"
   },
   "3345567742278474807": {
      "message": "Сигнализирано е, че тази бележка е с неподходящо съдържание, и тя не може да бъде споделена."
   },
   "3348057264663626000": {
      "message": "Преместване на избраната област нагоре."
   },
   "3354260708176476985": {
      "message": "Зарежда се&hellip;"
   },
   "3362903141674317449": {
      "message": "Сътрудник"
   },
   "336772567640975291": {
      "message": "Следващата седмица"
   },
   "3371033609268806242": {
      "message": "Етикетът „$1​“ бе изтрит."
   },
   "3381619429606029445": {
      "message": "Visio"
   },
   "3382236845597426718": {
      "message": "Отваряне"
   },
   "3385831848537487538": {
      "message": "Пътувания"
   },
   "3409257542937182842": {
      "message": "Извършва се нов опит..."
   },
   "3409483962000136213": {
      "message": "Пускане/пауза"
   },
   "3418767079436101103": {
      "message": "При зареждането на тази страница възникна проблем."
   },
   "3419821606494999471": {
      "message": "Управление на известията за коментари"
   },
   "3435089737264042207": {
      "message": "Включване"
   },
   "3447704623213039325": {
      "message": "Хранителна стока"
   },
   "3448234415275521882": {
      "message": "Обща информация"
   },
   "3451851833460018584": {
      "message": "{NUM_COMMENTS,plural, =0{Няма коментари}=1{Един коментар}other{# коментара}}"
   },
   "3455405209271884570": {
      "message": "Извличане"
   },
   "345585899501260401": {
      "message": "пиксела"
   },
   "345718983715470367": {
      "message": "Източник"
   },
   "3468441711253011521": {
      "message": "Google Таблици"
   },
   "3473620774713000513": {
      "message": "Решено"
   },
   "3485469306694683931": {
      "message": "Извличане в профила ви в Диск"
   },
   "3487924397596265480": {
      "message": "Избрахте $1​."
   },
   "3488766808236147068": {
      "message": "Цветът е $1​. Изберете друг цвят, за да оцветите бележката в него."
   },
   "3496410038494993160": {
      "message": "Популярни клавишни комбинации"
   },
   "3518073392823563581": {
      "message": "Клавишни комбинации"
   },
   "3528739824697875943": {
      "message": "списъчен елемент"
   },
   "3549581437554274388": {
      "message": "Преместване на избраната област надясно."
   },
   "3551522853788442530": {
      "message": "Назад"
   },
   "3551608745198442336": {
      "message": "Рисунка $1​/$2​"
   },
   "3553997866738769437": {
      "message": "Редактиране на рисунката"
   },
   "3555017093330694286": {
      "message": "Споделено от"
   },
   "3555297636767750285": {
      "message": "Зелено"
   },
   "3561658662634401836": {
      "message": "Заглавие"
   },
   "3569884090205828853": {
      "message": "OpenOffice Calc"
   },
   "3570074492517305433": {
      "message": "Регистрация"
   },
   "3571704286086017611": {
      "message": "Напомнянето е изтрито"
   },
   "3574963906259719128": {
      "message": "Браузърът ви не може да възпроизведе този аудио файл."
   },
   "3580293729117872545": {
      "message": "Приключва на"
   },
   "3595000514985906359": {
      "message": "Excel"
   },
   "3595562664731337243": {
      "message": "Преименуване на етикета"
   },
   "3603931013946597836": {
      "message": "{NUM_ITEMS,plural, =1{Премествате файл, намиращ се в {NUM_PARENTS} папки}other{Премествате файлове, намиращи се в {NUM_PARENTS} папки}}"
   },
   "3608606849109645545": {
      "message": "Въведете ново име на документа:"
   },
   "3609912631958780352": {
      "message": "Инструмент за калиграфия"
   },
   "3611573349633408445": {
      "message": "Изтегляне"
   },
   "3612936866865912552": {
      "message": "Зарежда се..."
   },
   "3617727970098875990": {
      "message": "Търсене на всички клавишни комбинации"
   },
   "362521762755836201": {
      "message": "Създадено: $1​"
   },
   "3634885664399305142": {
      "message": "Рисуването не е възможно"
   },
   "3651893685901703652": {
      "message": "..."
   },
   "3657386785336906042": {
      "message": "обратно наклонена черта"
   },
   "3659554681396757189": {
      "message": "Отворено от мен"
   },
   "366289214151975122": {
      "message": "Всеки от $1​ с връзката"
   },
   "3663571259791438207": {
      "message": "Подаване на сигнал за злоупотреба"
   },
   "3664842788764635265": {
      "message": "Няма"
   },
   "3666123569747918021": {
      "message": "В този документ има незапазени промени. Искате ли да излезете от страницата, при което те ще бъдат отхвърлени?"
   },
   "3678477908297567934": {
      "message": "долна черта"
   },
   "3690515530505404607": {
      "message": "При възпроизвеждането на този видеоклип възникна проблем."
   },
   "369764661829607970": {
      "message": "{NUM_ITEMS,plural, =0{Няма елементи}=1{1 елемент}other{# елемента}}"
   },
   "3707311099386068778": {
      "message": "Премахване на всички"
   },
   "3712215972250917265": {
      "message": "Коментари"
   },
   "3721649886572275931": {
      "message": "Размер 8"
   },
   "372633345629975481": {
      "message": "Бележките бяха фиксирани"
   },
   "372823375470132483": {
      "message": "Премахване на избора от бележката в кошчето"
   },
   "3734444903221631913": {
      "message": "{NUM_ITEMS_1,plural, =0{unused plural form}=1{unused plural form}other{Премествате {NUM_ITEMS_2} елемента извън екипните дискове и споделените папки, така че хората ще загубят достъп.}}"
   },
   "3751183760611784323": {
      "message": "Мащабът на елемента бе променен, за да се побере в ширината на екрана."
   },
   "3793086499925031123": {
      "message": "Отваряне на лентата за търсене/намиране на предишното"
   },
   "3796511349428373407": {
      "message": "Опции за датата"
   },
   "37992665410817181": {
      "message": "Повторно отворено"
   },
   "3801617971018550169": {
      "message": "Вчера"
   },
   "381100310424863459": {
      "message": "Illustrator"
   },
   "3827179818223863356": {
      "message": "Светлозелено"
   },
   "3845302429676793049": {
      "message": "При актуализирането на описанието на „$1​“ възникна проблем."
   },
   "3856960241878617076": {
      "message": "Коментарите се зареждат. Моля, изчакайте"
   },
   "3858324058837632381": {
      "message": "При възпроизвеждането на този аудиофайл възникна проблем."
   },
   "3869166581651870488": {
      "message": "Завършване на редактирането"
   },
   "3874597373619381607": {
      "message": "Приключените коментари се показват"
   },
   "3877974536163446728": {
      "message": "Избрахте $1​, $2​"
   },
   "3888733084985311515": {
      "message": "Налице е семейна група."
   },
   "3897281533382850749": {
      "message": "Пускане"
   },
   "3907816292084809686": {
      "message": "Действието е възстановено"
   },
   "3909380459614154542": {
      "message": "Към връзката"
   },
   "3930910469078167425": {
      "message": "Архив"
   },
   "3952341864324097024": {
      "message": "Изчистване на търсенето"
   },
   "3955575370175991097": {
      "message": "Превключихте към изгледа с етикети „$1​“"
   },
   "3974822583047850066": {
      "message": "Отказ"
   },
   "3977699855735576796": {
      "message": "При зареждането на още страници възникна проблем."
   },
   "3981269900634596036": {
      "message": "{numberOfNotes,plural, =1{Изтриване на бележката}other{Изтриване на бележките}}"
   },
   "3988418762222300024": {
      "message": "точка"
   },
   "4005725939358875643": {
      "message": "Действието е отменено."
   },
   "4020393055976236243": {
      "message": "Собствеността ще бъде прехвърлена от „$3​“ в/ъв $2​ към $1​."
   },
   "4023299615382814997": {
      "message": "Не можете да редактирате в кошчето"
   },
   "4030906186910275934": {
      "message": "Преглед"
   },
   "4036523543547629779": {
      "message": "Изображения"
   },
   "4044915502415235332": {
      "message": "Избиране на фиксирана бележка"
   },
   "4052960606031736645": {
      "message": "{NUM_ITEMS,plural, =1{Премествате папка, намираща се в {NUM_PARENTS} папки}other{Премествате папки, намиращи се в {NUM_PARENTS} папки}}"
   },
   "4061102590585232601": {
      "message": "Премахнахте $1​"
   },
   "4064820890482961434": {
      "message": "Показване на квадратчетата за отметка"
   },
   "4072353527895477784": {
      "message": "Хора"
   },
   "407982090576503781": {
      "message": "Да се извърши ли преместване в Моят диск?"
   },
   "4081524305222967804": {
      "message": "Синьо-зелено"
   },
   "4085493778209859942": {
      "message": "Пускане въпреки това"
   },
   "4086409218932829944": {
      "message": "Редактиране на етикетите"
   },
   "4087289538934418537": {
      "message": "След като бъдат изтрити, никой няма да вижда създадените от вас бележки. Споделените с вас ще останат видими за хората с достъп."
   },
   "4095714830819118951": {
      "message": "Помощ"
   },
   "4097921967754832323": {
      "message": "късо тире"
   },
   "411137507354526852": {
      "message": "Месец"
   },
   "4111452225725405610": {
      "message": "Премахнахте звезда от „$1​“."
   },
   "4117632433281998979": {
      "message": "Ежемесечно"
   },
   "4122858386674768321": {
      "message": "Преместване от $3​$2​$1​"
   },
   "4155905925766040098": {
      "message": "Няма налична визуализация"
   },
   "4157091150222353401": {
      "message": "Коментарите се запазват във файловете във формат DOCX, PPTX и XLSX и се виждат в Microsoft Office"
   },
   "4174786386751618325": {
      "message": "Фотобележка"
   },
   "4182427157920112948": {
      "message": "тилда"
   },
   "4186465168527990324": {
      "message": "Успешно извличане на „$1​“ в/ъв „$2​“"
   },
   "4204345954541079744": {
      "message": "Още няма бележки с този етикет"
   },
   "4206529410529166231": {
      "message": "{NUM_ITEMS,plural, =1{Премествате елемент, намиращ се в {NUM_PARENTS} папки}other{Премествате елементи, намиращи се в {NUM_PARENTS} папки}}"
   },
   "4209658291185545281": {
      "message": "Действието не можа да бъде отменено"
   },
   "4211182812451835307": {
      "message": "Може да редактира"
   },
   "4214190403999219403": {
      "message": "Промяна на мащаба"
   },
   "4214427276033711472": {
      "message": "Настройки"
   },
   "4216242742234357612": {
      "message": "Избиране на всички бележки"
   },
   "4216628828665009319": {
      "message": "Авокадо"
   },
   "4227767243455123953": {
      "message": "Поведение на списъците"
   },
   "4228870062013120023": {
      "message": "Преминаване към следващата/предишната бележка"
   },
   "4230101516585408149": {
      "message": "Написване на нова бележка"
   },
   "4239183034054216803": {
      "message": "Кафяво"
   },
   "4243437721135025638": {
      "message": "Нямате разрешение да премествате файлове в този екипен диск."
   },
   "4248787844477062707": {
      "message": "Създаване на нов етикет"
   },
   "4267845092591696061": {
      "message": "Означаване със звезда/премахване на звездата от избраните елементи"
   },
   "4269096876505546324": {
      "message": "Изпращане на отзиви"
   },
   "426927371216979233": {
      "message": "Линии"
   },
   "4280747719095153198": {
      "message": "Решен коментар"
   },
   "4286663890332754386": {
      "message": "Качването не бе успешно."
   },
   "4293996570221590891": {
      "message": "Бяло"
   },
   "4296310694082659873": {
      "message": "Инструмент за изтриване"
   },
   "4299690446455033653": {
      "message": "Works"
   },
   "4310202846681054741": {
      "message": "{numberOfPreviews,plural, =1{Визуализацията на връзката бе премахната}other{# визуализации на връзки бяха премахнати}}"
   },
   "4318861667254318892": {
      "message": "Google Video"
   },
   "4320831042030778": {
      "message": "Отказ"
   },
   "4320942249997687388": {
      "message": "End"
   },
   "4321382260116636620": {
      "message": "Избиране на бележка"
   },
   "4332252081504252077": {
      "message": "Ами сега!"
   },
   "4343825450663233452": {
      "message": "Може да преглежда"
   },
   "4343836986248234462": {
      "message": "Списъчен елемент"
   },
   "4343848624651344174": {
      "message": "Следобед"
   },
   "435214284915110062": {
      "message": "Отваряне на лентата за търсене"
   },
   "435444400175963053": {
      "message": "$1​ елемента бяха преместени в/ъв „$2​“."
   },
   "4356312843186491987": {
      "message": "Преместване"
   },
   "4391715930031906467": {
      "message": "Търсене на следващото"
   },
   "4397482594800054550": {
      "message": "При преименуването на „$1​“ възникна проблем."
   },
   "4412626362660239325": {
      "message": "Организиране в Диск"
   },
   "4421168692772991468": {
      "message": "Кошче"
   },
   "4422985761498356257": {
      "message": "Отваряне със:"
   },
   "4429542915339609008": {
      "message": "За съжаление, отварянето на няколко файла с това приложение не се поддържа."
   },
   "4439831283519683004": {
      "message": "Сиво"
   },
   "4444571967705751871": {
      "message": "Кошче"
   },
   "4448871104213529122": {
      "message": "Скриване на подробностите"
   },
   "4457424709416639982": {
      "message": "Добавяне в „Моят диск“"
   },
   "4462389610494427551": {
      "message": "сантиметра"
   },
   "4466605492523079635": {
      "message": "Запазване"
   },
   "4486429060311743289": {
      "message": "Изчистване на избора"
   },
   "4494250072784000771": {
      "message": "Открита е писалка. Активирано е панорамно придвижване чрез докосване."
   },
   "45228242181482134": {
      "message": "Пускане"
   },
   "4524999513489942668": {
      "message": "$2​Инсталирайте разширението Google Keep за Chrome$1​, за да запазвате в Keep важните за вас неща само с едно кликване."
   },
   "4533605085334699862": {
      "message": "Цитати"
   },
   "4543077011795639870": {
      "message": "Отстъпът на елемента бе премахнат."
   },
   "4550209323331625907": {
      "message": "$2​Научете повече$1​"
   },
   "4557086341175267918": {
      "message": "Не можете да споделяте офлайн"
   },
   "4558568516353053251": {
      "message": "Обикновените потребители на този файл могат да виждат коментарите и предложенията."
   },
   "4561316395348814504": {
      "message": "Изтегляния на приложението"
   },
   "4564682305303579317": {
      "message": "Напред"
   },
   "456512308416555173": {
      "message": "Книги"
   },
   "4566838580250578446": {
      "message": "{every,plural, =1{Повтаря се ежегодно}other{Повтаря се на всеки # години}}"
   },
   "4583714435275461910": {
      "message": "родителски списъчен елемент"
   },
   "4586373282767984140": {
      "message": "Жълто"
   },
   "4595551195988564947": {
      "message": "Списъкът за пазаруване в Google Асистент се променя."
   },
   "4607656353105320648": {
      "message": "{count,plural, =1{Да се изтрие ли завинаги бележката?}other{Да се изтрият ли завинаги бележките?}}"
   },
   "4607802784047113873": {
      "message": "Добавяне на сътрудник"
   },
   "4608848277887462246": {
      "message": "Още таблици"
   },
   "461126197624379601": {
      "message": "Докоснете тук, за да обсъдите този файл с други хора"
   },
   "4620034373159179678": {
      "message": "Страница $1​ от $2​"
   },
   "4632830890362652221": {
      "message": "{NUM_ITEMS,plural, =1{Премествате елемент, намиращ се в една папка}other{Премествате елементи, намиращи се в една папка}}"
   },
   "4634925432725098930": {
      "message": "пкс"
   },
   "4643940860676429496": {
      "message": "Запазва се..."
   },
   "4675792829115971960": {
      "message": "Ще подадем сигнал за тази бележка и ще я премахнем от профила ви."
   },
   "4685321580747790677": {
      "message": "{every,plural, =1{Повтаря се ежеседмично в/ъв {days}}other{Повтаря се на всеки # седмици в/ъв {days}}}"
   },
   "4690120479780049536": {
      "message": "пункта"
   },
   "4691283408020124345": {
      "message": "Списъчен изглед"
   },
   "4697169479015785830": {
      "message": "Отваряне на инструмента за избор на размера и цвета на инструмента за калиграфия"
   },
   "4697673185436885400": {
      "message": "Клавишната комбинация $2​ на браузъра $1​ бе заменена от Таблици"
   },
   "4698144269846224816": {
      "message": "Размер 1"
   },
   "4722167255291887189": {
      "message": "Размер 2"
   },
   "4727507448375670209": {
      "message": "Сътрудници"
   },
   "4738612839683751348": {
      "message": "Отстъпът на елемента не може да се увеличи повече."
   },
   "4740100782728373253": {
      "message": "Запазване в Диск"
   },
   "4748046231232264180": {
      "message": "Google Формуляри"
   },
   "4751202914935960324": {
      "message": "Този имейл адрес вече съществува"
   },
   "4752655540567953719": {
      "message": "Позиция $1​"
   },
   "4762625944764691132": {
      "message": "Главно меню"
   },
   "47670360985205683": {
      "message": "„$1​“ ($2​) надвишава максималния размер на файл, който Google може да сканира. Този файл може да навреди на компютъра ви, затова го пуснете само ако разбирате рисковете."
   },
   "4767722428137216885": {
      "message": "Отказ"
   },
   "477328789314249432": {
      "message": "Търсене в бележките"
   },
   "4773737319879079980": {
      "message": "По-бързо създавайте бележки с приложението"
   },
   "4775368111547931093": {
      "message": "Няма описание"
   },
   "4805047680716507619": {
      "message": " – Преместване във:"
   },
   "4806763987633034948": {
      "message": "PKCS7 подпис"
   },
   "4807444103404336088": {
      "message": "При добавянето на звезда към „$1​“ възникна проблем."
   },
   "4821130290026382049": {
      "message": "Популярни клавишни комбинации"
   },
   "4833214200453019325": {
      "message": "$1​ от $2​"
   },
   "4840513623749850224": {
      "message": "Филми"
   },
   "4847795993918486929": {
      "message": "Текстът от изображенията не може да се извлече. Опитайте отново по-късно."
   },
   "4853788427396558692": {
      "message": "$1​ МБ"
   },
   "4858389278403807208": {
      "message": "Бележката е в кошчето"
   },
   "4863652737159067460": {
      "message": "ВХОД"
   },
   "4864051612562026766": {
      "message": "{count,plural, =1{Избрахте 1}other{Избрахте #}}"
   },
   "4878012031550736317": {
      "message": "{NUM_ITEMS,plural, =0{unused plural form}=1{Хората ще загубят достъп до този файл, ако не са членове на „{TEAM_DRIVE_NAME}“.}other{Хората ще загубят достъп до тези файлове, ако не са членове на „{TEAM_DRIVE_NAME}“.}}"
   },
   "4888104357342241891": {
      "message": "Напомняния"
   },
   "490045476479394048": {
      "message": "Откройте текст, който да коментирате"
   },
   "4901386320110714275": {
      "message": "Паролата не е правилна. Моля, опитайте отново."
   },
   "4906669330059413958": {
      "message": "Изпращане на паролата"
   },
   "4907349694646937491": {
      "message": "Бележката бе преместена до индекс $1​"
   },
   "4915450884407029247": {
      "message": "Етикетът „$1​“ бе добавен."
   },
   "4918998818369420588": {
      "message": "Подаване на сигнал за злоупотреба"
   },
   "4930422592340561418": {
      "message": "Моят диск"
   },
   "4948512233726694061": {
      "message": "$4​Страница$1​$5​$3​$1​$7​/$2​$6​$8​$1​"
   },
   "4955094356920130803": {
      "message": "Кехлибарено"
   },
   "4957674814179289955": {
      "message": "Преминаване към следващия/предишния списъчен елемент"
   },
   "4963784280521435720": {
      "message": "Запазва се..."
   },
   "4974059227183970715": {
      "message": "Можете да добавите етикети и като въведете „#“."
   },
   "4982284738093713321": {
      "message": "Организатор"
   },
   "4988132901627446385": {
      "message": "Панелът за подробности е разгънат."
   },
   "5006765610090288212": {
      "message": "Оцветено бе във $1​"
   },
   "5008901799534614532": {
      "message": "Изтриване"
   },
   "5009448218905630614": {
      "message": "Премахване"
   },
   "5011858093760184160": {
      "message": "Премахване на звезда"
   },
   "5013331898336483156": {
      "message": "Да се извърши ли преместване към Моят диск в нов домейн?"
   },
   "501475221876543407": {
      "message": "Тук се показват добавяните от вас бележки"
   },
   "5023623739220371850": {
      "message": "Удостоверяването не бе успешно. Промените ще се синхронизират, когато влезете в профила си."
   },
   "5041572047197549869": {
      "message": "В един и същ ден всеки месец"
   },
   "5045725997997672553": {
      "message": "{weekNumber,plural, =1{В първия/първата {day} от месеца}=2{Във втория/втората {day} от месеца}=3{В третия/третата {day} от месеца}=4{В четвъртия/четвъртата {day} от месеца}other{В последния/последната {day} от месеца}}"
   },
   "5046219519278664288": {
      "message": "iPhone и iPad"
   },
   "5046371569383796818": {
      "message": "Запазване"
   },
   "5052461293250181960": {
      "message": "page down"
   },
   "5054818452036081005": {
      "message": "$2​Поверителност$1​"
   },
   "5060107422621709815": {
      "message": "Опресняването не бе успешно"
   },
   "5078184843381528205": {
      "message": "Фиксиране на бележката"
   },
   "5085332075590890665": {
      "message": "Отмяна"
   },
   "5086862627563516607": {
      "message": "{NUM_ITEMS,plural, =0{unused plural form}=1{Членовете на „{TEAM_DRIVE_NAME}“ ще получат достъп до елемента.}other{Членовете на „{TEAM_DRIVE_NAME}“ ще получат достъп до тези елементи.}}"
   },
   "5094400861508407603": {
      "message": "Водещият символ бе премахнат"
   },
   "5095987896933771566": {
      "message": "Печат на документа"
   },
   "509815948423424872": {
      "message": "Придвижване"
   },
   "5098941979861776792": {
      "message": "Enter"
   },
   "5121976648047240846": {
      "message": "Премахване на етикет"
   },
   "5130903421326358933": {
      "message": "При запазването на прикачения файл в Google Диск възникна проблем."
   },
   "5134649253619244584": {
      "message": "Изтриване на етикета"
   },
   "5140285776541296873": {
      "message": "Персонализирано"
   },
   "5140450179685369890": {
      "message": "{NUM_ITEMS_1,plural, =0{unused plural form}=1{{NUM_ITEMS_2} папка бе преместена в/ъв „{XXX_1}“.}other{{NUM_ITEMS_2} папки бяха преместени в/ъв „{XXX_2}“.}}"
   },
   "5151247077945318396": {
      "message": "При избирането на папка, в която да се извърши извличането, възникна грешка."
   },
   "5159511879001144721": {
      "message": "Кобалтовосиньо"
   },
   "5167365673547406876": {
      "message": "{NUM_ITEMS,plural, =0{unused plural form}=1{Членовете на „{TEAM_DRIVE_NAME}“ ще получат достъп.}other{Членовете на „{TEAM_DRIVE_NAME}“ ще получат достъп.}}"
   },
   "5178674191443894176": {
      "message": "Етикети"
   },
   "5180454621500142444": {
      "message": "Възстановяване"
   },
   "5180989337128758117": {
      "message": "лява скоба"
   },
   "5182569285908080938": {
      "message": "Опции за крайната дата"
   },
   "5184692850089055965": {
      "message": "Извличане на текста от изображенията"
   },
   "5184785218378634051": {
      "message": "Елементът вече не е с променен мащаб."
   },
   "5197718200713913936": {
      "message": "C++"
   },
   "5201670213497642487": {
      "message": "Лента с раздели в панела за подробности. Превключвайте между разделите с натискане на клавишите със стрелки за наляво и надясно."
   },
   "5202835861850747976": {
      "message": "$2​Научете повече$1​"
   },
   "5204391636475413312": {
      "message": "Запазване"
   },
   "5238284741118437734": {
      "message": "Отмяна"
   },
   "5238307666527496111": {
      "message": "ОK"
   },
   "5238371081785912565": {
      "message": "Отваряне със: $1​"
   },
   "5253765183290980485": {
      "message": "Имате разрешение само да добавяте и редактирате елементи в/ъв „$1​“, така че няма да можете да отмените това действие."
   },
   "5255388116256536182": {
      "message": "Използвайте клавишите със стрелки, за да изберете клетки, които да коментирате. Задръжте Shift, докато натискате клавишите със стрелки, за да разгънете избраното. Натиснете Enter, за да създадете коментар, или Escape за отказ."
   },
   "5259541708332520733": {
      "message": "Източникът бе премахнат"
   },
   "5271615049826004958": {
      "message": "Опции за визуализацията на връзката"
   },
   "5281121179861637423": {
      "message": "За достъп до $1​ е необходима парола. Моля, въведете я."
   },
   "5288037028604092288": {
      "message": "XPS"
   },
   "5299648222246616124": {
      "message": "обратен апостроф"
   },
   "5300527252159851865": {
      "message": "Съдържанието на файла не отговаря на очаквания файлов формат."
   },
   "5320475549855398784": {
      "message": "Тази рисунка ще бъде налице, когато сте онлайн."
   },
   "5321772883765574323": {
      "message": "Преместихте „$1​“ от „$2​“ в/ъв „$3​“."
   },
   "5334959887390704534": {
      "message": "Ще изтрием този етикет и ще го премахнем от всичките ви бележки в Keep. Те няма да бъдат изтрити."
   },
   "5336801339221383042": {
      "message": "Javascript"
   },
   "5336924963122494935": {
      "message": "Избиране на този елемент"
   },
   "534191528712675978": {
      "message": "Pause"
   },
   "534228323125524312": {
      "message": "Намаляване на мащаба"
   },
   "5353129315502554762": {
      "message": "Стилов лист"
   },
   "5353173068672429342": {
      "message": "Инструменти за отстраняване на грешки"
   },
   "5362962746518601227": {
      "message": "{NUM_ITEMS,plural, =1{Премествате файл, намиращ се в една папка}other{Премествате файлове, намиращи се в една папка}}"
   },
   "5363853533596749934": {
      "message": "Въведете име на етикета"
   },
   "5372143986724491245": {
      "message": "преди $1​ ден"
   },
   "5372160981898991853": {
      "message": "Publisher"
   },
   "5385273191513151655": {
      "message": "Миниизображението се създава..."
   },
   "5392844646168201484": {
      "message": "Размер 3"
   },
   "5394695048211047984": {
      "message": "Добавяне на дата"
   },
   "5398036630337418486": {
      "message": "Отваряне на документа"
   },
   "5399553230649155346": {
      "message": "след $1​ час"
   },
   "5403636185480096151": {
      "message": "Телевизия"
   },
   "540596856674438371": {
      "message": "Не може да се сподели, защото съответната функция е изключена."
   },
   "5408091115193390231": {
      "message": "AutoCAD"
   },
   "5413225497191133249": {
      "message": "Фиксиране или освобождаване на бележки"
   },
   "5423742603774911808": {
      "message": "Списъкът е твърде голям."
   },
   "5435749276779042277": {
      "message": "+ ОЩЕ $1​"
   },
   "5447119197363232006": {
      "message": "Показване в Диск"
   },
   "5455566801812656827": {
      "message": "ПО-МАЛКО"
   },
   "5465081454525683943": {
      "message": "Тази бележка вече няма да бъде споделена с профила ви.  Помолете собственика за достъп или превключете към профил с разрешение."
   },
   "5467649767578147801": {
      "message": "{NUM_ITEMS,plural, =0{unused plural form}=1{Хората ще загубят достъп до този файл, ако не са членове на „{TEAM_DRIVE_NAME}“ или ако са извън {DOMAIN_NAME}.}other{Хората ще загубят достъп до тези файлове, ако не са членове на „{TEAM_DRIVE_NAME}“ или ако са извън {DOMAIN_NAME}.}}"
   },
   "5472312735475866917": {
      "message": "Коментар от $1​."
   },
   "547865385964196102": {
      "message": "преди $1​ минути"
   },
   "5478662967017843220": {
      "message": "Тъмносиньо"
   },
   "5480497191725157666": {
      "message": "Esc"
   },
   "5482604275203517054": {
      "message": "стрелка за наляво"
   },
   "5503885447744017882": {
      "message": "Да се извърши ли преместване в/ъв $1​ извън $2​?"
   },
   "5506390497558702263": {
      "message": "{count,plural, =1{Бележката бе деархивирана и фиксирана}other{# бележки бяха деархивирани и фиксирани}}"
   },
   "5520112019886360037": {
      "message": "Затваряне"
   },
   "5539958940810433464": {
      "message": "Преместване в кошчето на бележка"
   },
   "5542817571710587822": {
      "message": "Файлът съдържа твърде много изображения."
   },
   "5545146751578623220": {
      "message": "Caps-Lock"
   },
   "5555182241047709329": {
      "message": "Изберете местоположение"
   },
   "5555599189512365009": {
      "message": "РАЗБРАХ"
   },
   "556742419793425318": {
      "message": "Отхвърляне"
   },
   "5581834527128285229": {
      "message": "При добавянето на „$1​“ в „Моят Диск“ възникна проблем."
   },
   "5598649706113950710": {
      "message": "Редактор"
   },
   "5627470193961862490": {
      "message": "Тук се показват бележките с предстоящи напомняния"
   },
   "564165666160590723": {
      "message": "Windows Media Player"
   },
   "5657974964218523724": {
      "message": "Изпразване на кошчето"
   },
   "566719933273904590": {
      "message": "Към етикета"
   },
   "5670235154099791694": {
      "message": "инча"
   },
   "5672326933907786881": {
      "message": "Бележките на заключения екран автоматично се запазват в Google Keep."
   },
   "5678095606167600931": {
      "message": "Водещият символ бе вмъкнат"
   },
   "568072913338360182": {
      "message": "HTML"
   },
   "5707549724380589079": {
      "message": "Да се изтрият ли елементите с отметка?"
   },
   "5713014647314396479": {
      "message": "След"
   },
   "5714240424645614611": {
      "message": "Пакет за Android"
   },
   "5714760273477184428": {
      "message": "Използвайте стрелките, за да откроите област, която да коментирате, след което натиснете enter"
   },
   "5738003914096572768": {
      "message": "Задействани"
   },
   "5755541943799933389": {
      "message": "Добавихте звезда към „$1​“."
   },
   "577619047319778196": {
      "message": "Изчистване на избора"
   },
   "5801257863595278616": {
      "message": "Преместване на избраната област наляво."
   },
   "5820033033803019104": {
      "message": "Организиране"
   },
   "5826302153453971149": {
      "message": "Светлорозово"
   },
   "5840202488368071194": {
      "message": "Нова бележка с изображение"
   },
   "5840330517914556080": {
      "message": "Намаляване на мащаба"
   },
   "5854158607727111728": {
      "message": "Табулатор"
   },
   "585503297543253590": {
      "message": "На"
   },
   "5870134033985574990": {
      "message": "Извлича се..."
   },
   "5871966496153339793": {
      "message": "Показва се миниизображението за видеоклипа „$1​“"
   },
   "5895666393386604578": {
      "message": "За да добавите отстъп, преместете с плъзгане елементите от списъка или използвайте клавишната комбинация $1​."
   },
   "5909490544352162901": {
      "message": "Помолете собственика за достъп до тази бележка или превключете към профил с разрешение. Влезли сте като $1​."
   },
   "5911012384539794869": {
      "message": "Стартирането на заданието за извличане не бе успешно."
   },
   "591481266986424156": {
      "message": "Тази клавишна комбинация понастоящем се използва от браузъра $1​ за $2​"
   },
   "5916010927050975496": {
      "message": "$1​ КБ"
   },
   "5917528552332886959": {
      "message": "Показване на приключените коментари"
   },
   "5947790263929501779": {
      "message": "Преобразувано бе към водещ символ"
   },
   "5949528478488617689": {
      "message": "Разрешение за изтегляне"
   },
   "5950887255133612666": {
      "message": "Не е започнало."
   },
   "5954965790623966933": {
      "message": "Пурпурно"
   },
   "5961981688037913870": {
      "message": "Добавихте „$1​“"
   },
   "5965683144165568126": {
      "message": "Пренареждане на списъчен елемент"
   },
   "5969696744752069015": {
      "message": "Няма налична визуализация."
   },
   "597927944425927829": {
      "message": "Собствеността ще бъде прехвърлена от „$1​“ към вас."
   },
   "5984398071085567332": {
      "message": "Google Fusion Tables"
   },
   "5987609488177213747": {
      "message": "Създаване на етикет"
   },
   "5989809255170931770": {
      "message": "{time,plural, =1{Keep ще се актуализира след # секунда}other{Keep ще се актуализира след # секунди}}"
   },
   "6005084567691342649": {
      "message": "Напомняния"
   },
   "6009962986062136164": {
      "message": "„$1​“ се зарежда."
   },
   "6011637630664474614": {
      "message": "Интервал"
   },
   "6030537159236285525": {
      "message": "Преместване на списъчния елемент на следващата/предишната позиция"
   },
   "60305871484579258": {
      "message": "Alt"
   },
   "6033916931543811803": {
      "message": "{NUM_ITEMS_1,plural, =0{unused plural form}=1{{NUM_ITEMS_2} папка бе преместена от „{XXX_1}“ в/ъв „{XXX_2}“.}other{{NUM_ITEMS_2} папки бяха преместени от „{XXX_3}“ в/ъв „{XXX_4}“.}}"
   },
   "6043578784980337112": {
      "message": "$1​ файла бяха преместени в/ъв „$2​“."
   },
   "6062216008944363143": {
      "message": "{weekNumber,plural, =1{Повтаря се на всеки {every} месеца в първия/първата {day} от месеца}=2{Повтаря се на всеки {every} месеца във втория/втората {day} от месеца}=3{Повтаря се на всеки {every} месеца в третия/третата {day} от месеца}=4{Повтаря се на всеки {every} месеца в четвъртия/четвъртата {day} от месеца}other{Повтаря се на всеки {every} месеца в последния/последната {day} от месеца}}"
   },
   "6069780031254134657": {
      "message": "Означаване като готово"
   },
   "6087078248621415351": {
      "message": "Промяна: $1​"
   },
   "6100883940579706314": {
      "message": "Визуализация на връзката"
   },
   "6105571474005679446": {
      "message": "Възникна проблем с визуализацията."
   },
   "6113237889871930608": {
      "message": "Празна бележка"
   },
   "6118623991445349480": {
      "message": "Страница $1​"
   },
   "6122643025527543706": {
      "message": "Ctrl"
   },
   "6127325177382263770": {
      "message": "URL адреси"
   },
   "6128550071219729739": {
      "message": "Изображението бе изтрито"
   },
   "6131822680770571276": {
      "message": "PowerPoint"
   },
   "6140634664402328750": {
      "message": "Списък с приложения"
   },
   "6149175749937815029": {
      "message": "Преглед на всички елементи"
   },
   "616807262818311711": {
      "message": "Тип"
   },
   "6185886893933834031": {
      "message": "Запазване на избраната"
   },
   "6186753450686672643": {
      "message": "{every,plural, =1{Повтаря се ежедневно}other{Повтаря се на всеки # дни}}"
   },
   "6201176165479907499": {
      "message": "{count,plural, =1{Бележката бе фиксирана}other{# бележки бяха фиксирани}}"
   },
   "6203260615455347677": {
      "message": "Numbers"
   },
   "6209117354086898503": {
      "message": "Назад"
   },
   "6211895332551673425": {
      "message": "Добавено към $2​Моят диск$1​"
   },
   "6212070333807533570": {
      "message": "Добавя се към $2​Моят диск$1​..."
   },
   "6223207695466118454": {
      "message": "YouTube"
   },
   "6224687211096863620": {
      "message": "Всеки"
   },
   "6252259197986158120": {
      "message": "Вчера"
   },
   "6263940822259442857": {
      "message": "Скриване на квадратчетата за отметка"
   },
   "628140343505892786": {
      "message": "Настройки"
   },
   "6286379137937560558": {
      "message": "Статия"
   },
   "6286806453721792102": {
      "message": "Организиране в Диск"
   },
   "6305748545202493254": {
      "message": "Показване/скриване на панела с подробности"
   },
   "6306268376900894985": {
      "message": "Повтаря се до {endDate}"
   },
   "6324768448533022780": {
      "message": "$1​ $2​ г."
   },
   "6336194821483049583": {
      "message": "Стандартното собствено приложение"
   },
   "6347484050944915390": {
      "message": "Заявката е изпратена. Ще получите имейл, когато бъде одобрена."
   },
   "6352952829934775705": {
      "message": "ОЩЕ"
   },
   "6366376928558090914": {
      "message": "Храна"
   },
   "6375244206466599493": {
      "message": "Година"
   },
   "6375395544374251820": {
      "message": "При зареждането на още страници възникна проблем. Извършва се нов опит..."
   },
   "6377664889539934": {
      "message": "Рисуване с докосване"
   },
   "6381941041429900831": {
      "message": "Добавяне на сътрудник"
   },
   "6386587519843563719": {
      "message": "Двоичен файл"
   },
   "639451288140270562": {
      "message": "Копирано в Google Документи"
   },
   "6394816510866826521": {
      "message": "За собствена употреба"
   },
   "6413404795391222793": {
      "message": "Създаване на нов списък"
   },
   "6416495701611778255": {
      "message": "Предложения за приложения на трети страни"
   },
   "6419411265907669340": {
      "message": "Днес"
   },
   "6424277546995954045": {
      "message": "Замяната на клавишни комбинации не е налице в текущия браузър.\nЗа да активирате тази функция, преминете към Chrome, Firefox, IE/Edge или Safari"
   },
   "6428000916830484004": {
      "message": "Кафяво"
   },
   "6432019580434957057": {
      "message": "Аудиофайл"
   },
   "6443615802319581315": {
      "message": "{NUM_ITEMS,plural, =1{Нямате разрешение да преместите този формуляр от текущата му папка. Вместо това го добавете в/ъв {START_SPAN_1}{NAME}{END_SPAN}.}other{Нямате разрешение да преместите тези формуляри от текущите им папки. Вместо това ги добавете в/ъв {START_SPAN_2}{NAME}{END_SPAN}.}}"
   },
   "6450508807204492448": {
      "message": "Икона на $1​"
   },
   "6457802200418354862": {
      "message": "Обикновените потребители могат да изтеглят"
   },
   "6459405233858728718": {
      "message": "Google Презентации"
   },
   "6464761738227651511": {
      "message": "преди $1​ минута"
   },
   "6466736813846482957": {
      "message": "Назад"
   },
   "6466858417983764649": {
      "message": "Задавайте напомняния в бележките за места и часове, записвайте гласови бележки и работете онлайн или офлайн."
   },
   "6472238195689960152": {
      "message": "Бяло"
   },
   "6473102097014191455": {
      "message": "Бележка с рисунка"
   },
   "6477306554098527424": {
      "message": "Google Асистент"
   },
   "6480376252068839019": {
      "message": "Отваряне на опциите за решетката"
   },
   "6496683100661104868": {
      "message": "$2​Лицензи за отворен код$1​"
   },
   "6497197865876438261": {
      "message": "Музика"
   },
   "6507257480072167483": {
      "message": "Името на етикета бе променено на „$1​“."
   },
   "6510131849363684615": {
      "message": "Утре"
   },
   "6513721414466645971": {
      "message": "Премахнато"
   },
   "6522917155620379865": {
      "message": "Изтегляне"
   },
   "6524849072392100692": {
      "message": "Папка на Google Диск"
   },
   "653160061888539741": {
      "message": "Контрол на напредъка"
   },
   "6571686604846453345": {
      "message": "При добавянето на този елемент към Диск възникна проблем."
   },
   "6578339688410021742": {
      "message": "Всички членове на „$1​“ ще имат достъп до елементите."
   },
   "6579707685908557993": {
      "message": "Вечер"
   },
   "6582286158693833652": {
      "message": "Научете повече"
   },
   "6588176324871799870": {
      "message": "Приложен скрипт на Google"
   },
   "6618562607681757575": {
      "message": "Без преместване от която и да е папка, само добавяне към $3​$2​$1​"
   },
   "6622304228074863427": {
      "message": "Приложениe"
   },
   "6627510416186113122": {
      "message": "Светлосиньо-зелено"
   },
   "6650600936729710500": {
      "message": "Отговори."
   },
   "6664835828596108553": {
      "message": "Опция"
   },
   "670419277288558500": {
      "message": "Видео/аудио"
   },
   "6707173584987026005": {
      "message": "Днес"
   },
   "6710728478489145370": {
      "message": "Затваряне"
   },
   "6713235295664405475": {
      "message": "на|към"
   },
   "6715985122107380503": {
      "message": "Записи"
   },
   "6726462693927865256": {
      "message": "Подробности"
   },
   "6726879257388338969": {
      "message": "Отпечатване"
   },
   "6732800471045353930": {
      "message": "Тази бележка е споделена с максималния брой хора."
   },
   "673551770550324419": {
      "message": "Побиране в ширината"
   },
   "6747379635033535953": {
      "message": "Добавяне на новите елементи най-долу"
   },
   "6747528043814108113": {
      "message": "Превключихте към $1​"
   },
   "6749829802551750923": {
      "message": "стрелка за нагоре"
   },
   "6750600017746655174": {
      "message": "Опция"
   },
   "6750827506231593056": {
      "message": "Превключване между профилите"
   },
   "6761622351199419182": {
      "message": "Бележката е в архива"
   },
   "6773222938695237983": {
      "message": "{NUM_ITEMS,plural, =0{Unused}=1{Да се сподели ли този елемент?}other{Да се споделят ли тези елементи?}}"
   },
   "6778577079172085976": {
      "message": "Фиксирани"
   },
   "678660085936036852": {
      "message": "Изображенията се обработват..."
   },
   "6787580031482277539": {
      "message": "Никога"
   },
   "6797862596948579998": {
      "message": "Приложение за Chrome"
   },
   "6798055902819777633": {
      "message": "Панорама с докосване"
   },
   "6801348618370627980": {
      "message": "Етикетът „$1​“ бе създаден."
   },
   "6815042072535422726": {
      "message": "Аудиозаписът бе изтрит"
   },
   "681598652078493281": {
      "message": "Научете повече"
   },
   "6822520214440117457": {
      "message": "Работа"
   },
   "6823109315717909214": {
      "message": "Изпробвайте"
   },
   "6831650827360444197": {
      "message": "Споделянето на бележката бе прекратено."
   },
   "6833062695195555756": {
      "message": "Отваряне на менюто за опции на инструмента за изтриване"
   },
   "6833760103261954639": {
      "message": "При зареждането на тази страница възникна проблем. Извършва се нов опит..."
   },
   "6861978427131390279": {
      "message": "Изпращане на отзиви"
   },
   "687402923448150707": {
      "message": "Без отметка"
   },
   "689017442055275529": {
      "message": "Семейната група на $1​"
   },
   "6891563484025164308": {
      "message": "Назад"
   },
   "6898823203505321799": {
      "message": "Подробности"
   },
   "6904351530369058983": {
      "message": "Собственик"
   },
   "691041991673354191": {
      "message": "Премахване на мен"
   },
   "6918505531548047245": {
      "message": "Маркер за открояване"
   },
   "6921237745237410511": {
      "message": "Добавяне на коментар"
   },
   "6922953828399110511": {
      "message": "Затваряне на визуализатора"
   },
   "693770783324368110": {
      "message": "Бележките бяха освободени и преместени в кошчето"
   },
   "695253297035211081": {
      "message": "Изпразване на кошчето"
   },
   "6980199665979997122": {
      "message": "Възстановяване"
   },
   "6982682101118067511": {
      "message": "Организира се…"
   },
   "701276785305022936": {
      "message": "Документът е повреден. Моля, проверете дали файлът е в най-новия формат."
   },
   "7017485862232001373": {
      "message": "Добавихте „$1​“ в/ъв „$2​“."
   },
   "7019002927048576918": {
      "message": "$1​ Филтри за търсене"
   },
   "7030308038380934896": {
      "message": "Копирането в Google Документи не бе успешно"
   },
   "7050021021988648361": {
      "message": "Копиране на URL адреса"
   },
   "7050898523853841537": {
      "message": "Опции за честотата"
   },
   "7054631817922169541": {
      "message": "В Google Keep има незапазени промени. Искате ли да излезете от страницата, при което те ще бъдат отхвърлени?"
   },
   "705714112650622350": {
      "message": "При добавянето на елемента в Google Диск възникна проблем."
   },
   "7059437903473652416": {
      "message": "Пускане на видеоклипа в YouTube „$1​“"
   },
   "7065454163742312322": {
      "message": "Още цветове"
   },
   "7066744251212631722": {
      "message": "Лайм"
   },
   "7084324152376766809": {
      "message": "преди $1​ дни"
   },
   "7084991134824194740": {
      "message": "Напомнете ми"
   },
   "7086801490719148597": {
      "message": "Премахване на избора от този елемент"
   },
   "7094548885298700726": {
      "message": "Тъмнокафяво"
   },
   "7120211249329066227": {
      "message": "Имате Асистент!"
   },
   "7121259585839664942": {
      "message": "Отказ"
   },
   "7126326627883991568": {
      "message": "Изтриване на текущата рисунка"
   },
   "7126535013613878060": {
      "message": "Фиксирайте важните бележки в началото."
   },
   "7135182401951359795": {
      "message": "Собствеността ще бъде прехвърлена към вас."
   },
   "7141983486405549971": {
      "message": "Insert"
   },
   "7145753028985071097": {
      "message": "Бележката се пренарежда"
   },
   "7146242673022399081": {
      "message": "Текст"
   },
   "7148992630785407972": {
      "message": "Този файл е защитен с парола и не може да бъде визуализиран."
   },
   "7153847618034547771": {
      "message": "Активиране"
   },
   "7161134329606048317": {
      "message": "Затваряне"
   },
   "7161718175684624843": {
      "message": "Премахване на етикет"
   },
   "7164532930742017984": {
      "message": "Всеки с връзката"
   },
   "7166989725427500881": {
      "message": "Избиране на бележка в кошчето"
   },
   "7174189954350964804": {
      "message": "Опитайте отново"
   },
   "7174908348310449675": {
      "message": "Персонализиране на стандартните стойности за напомнянията"
   },
   "7181961085183734135": {
      "message": "Отпечатването е деактивирано за този файл"
   },
   "7201188472754345797": {
      "message": "{NUM_ITEMS,plural, =0{unused plural form}=1{Хората ще загубят достъп до този файл, ако са извън {DESTINATION_DOMAIN}.}other{Хората ще загубят достъп до тези файлове, ако са извън {DESTINATION_DOMAIN}.}}"
   },
   "7218693060378095915": {
      "message": "Ново"
   },
   "722264179594523168": {
      "message": "Отказ"
   },
   "7225445911355686176": {
      "message": "Избиране на архивирана бележка"
   },
   "722702934847795304": {
      "message": "Project"
   },
   "7231231875581131930": {
      "message": "{NUM_ITEMS,plural, =0{Unused}=1{Този елемент не може да бъде върнат в/ъв „{TEAM_DRIVE_NAME}“, затова няма да сте в състояние да отмените това действие.}other{Поне един елемент не може да бъде върнат в/ъв „{TEAM_DRIVE_NAME}“, затова няма да сте в състояние да отмените това действие.}}"
   },
   "723223692006219983": {
      "message": "пт"
   },
   "7247530225058410142": {
      "message": "$2​ $1​"
   },
   "7247965266239591227": {
      "message": "При извличането на „$1​“ възникна проблем."
   },
   "7251490702980298031": {
      "message": "Отваряне на инструмента за избор на размера и цвета на маркера за открояване"
   },
   "7265183966796883739": {
      "message": "Скриване на приключените коментари"
   },
   "7278398674737413598": {
      "message": "Документът не може да бъде преобразуван."
   },
   "7278859550373246865": {
      "message": "{count,plural, =1{Бележката бе архивирана}other{# бележки бяха архивирани}}"
   },
   "7290932540630116546": {
      "message": "Напомнянето е зададено. $1​"
   },
   "7295254213841803546": {
      "message": "Да се отхвърлят ли промените?  Те няма да се запазят."
   },
   "7299749713933143099": {
      "message": "Лилаво"
   },
   "7304355547638486270": {
      "message": "Изтегляне на аудиофайл ($1​)"
   },
   "7306962184871750459": {
      "message": "Собствеността ще бъде прехвърлена от „$4​“ в/ъв $3​ към „$2​“ в/ъв $1​."
   },
   "7337660181466605745": {
      "message": "Файлът „$1​“ не можа да бъде актуализиран в Диск."
   },
   "7342923890755029722": {
      "message": "Затваряне"
   },
   "7344507440412470266": {
      "message": "Разширяване на избраната област."
   },
   "734478884582426793": {
      "message": "Компресиран архив"
   },
   "7353547650196788656": {
      "message": "Червено"
   },
   "7364571366369083618": {
      "message": "Видеоклип"
   },
   "7376703418960184879": {
      "message": "Копиране"
   },
   "7377239345926788722": {
      "message": "Действия"
   },
   "7382688299146249119": {
      "message": "Изтегляне на елемента"
   },
   "7388342865555961406": {
      "message": "след $1​ ден"
   },
   "7393771571081973549": {
      "message": "С"
   },
   "7420117636241237177": {
      "message": "Съобщенията от „$1​“ бяха извлечени в профила ви за електронна поща под етикета „Импортиране: $2​“."
   },
   "7426603384368095928": {
      "message": "Моля, презаредете страницата, за да влезете отново и да продължите работа."
   },
   "7427333772418801813": {
      "message": "Бутонът „+ ОЩЕ $1​“ бе разгънат"
   },
   "7429084719905985261": {
      "message": "Objective C"
   },
   "7432956605646331928": {
      "message": "SQL"
   },
   "7440735091552109962": {
      "message": "$2​ (редакция: $1​)"
   },
   "7441891675459021164": {
      "message": "Запазва се в Диск"
   },
   "744753705925710199": {
      "message": "За съжаление, не успяхме да упълномощим това приложение за всички файлове, които опитахте да отворите. Моля, опитайте отново."
   },
   "7452116603589558390": {
      "message": "Премахване на избора от фиксираната бележка"
   },
   "7453297286571818554": {
      "message": "Копиране в Google Документи"
   },
   "7453307802804717178": {
      "message": "Светлосиньо"
   },
   "7458942806393710991": {
      "message": "Премахване на избора от архивираната бележка"
   },
   "7464780237502381438": {
      "message": "Свързване на още приложения"
   },
   "7468842863971844562": {
      "message": "Нов списък"
   },
   "7469895656894091562": {
      "message": "Този имейл адрес не е валиден"
   },
   "7482924911694634213": {
      "message": "{weekNumber,plural, =1{Повтаря се ежемесечно в първия/първата {day} от месеца}=2{Повтаря се ежемесечно във втория/втората {day} от месеца}=3{Повтаря се ежемесечно в третия/третата {day} от месеца}=4{Повтаря се ежемесечно в четвъртия/четвъртата {day} от месеца}other{Повтаря се ежемесечно в последния/последната {day} от месеца}}"
   },
   "7483088916037874359": {
      "message": "Файлът е твърде голям. "
   },
   "7488945223835574498": {
      "message": "PostScript"
   },
   "7503234138288940590": {
      "message": "Търсете"
   },
   "7507827375601925075": {
      "message": "Преместване на бележката на следващата/предишната позиция"
   },
   "7516769578943800930": {
      "message": "С отметка"
   },
   "7528204871156404767": {
      "message": "Safari"
   },
   "7529683448345488779": {
      "message": "Въведената парола не е правилна. Моля, въведете друга."
   },
   "7530677128711603655": {
      "message": "Резултати от търсенето на „$1​“"
   },
   "754367112212424716": {
      "message": "По-късно днес"
   },
   "7564771400033548584": {
      "message": "{selectedCount,plural, =1{# избрано}other{# избрани}}"
   },
   "7565383798249439151": {
      "message": "след $1​ дни"
   },
   "7579280421767578228": {
      "message": "Напомняне за някой ден"
   },
   "7586291841734385643": {
      "message": "Отделяне"
   },
   "7587936635257676112": {
      "message": "Добавихте $1​"
   },
   "7598582624136632660": {
      "message": "Отваряне на лентата за търсене/намиране на следващото"
   },
   "7598850438299201663": {
      "message": "„$1​“ се отваря..."
   },
   "7599358608613738069": {
      "message": "Изтриване"
   },
   "7604275940271852148": {
      "message": "Извличане в профила ви в Gmail"
   },
   "7604400308311739073": {
      "message": "Фиксиране"
   },
   "7610628906656867728": {
      "message": "Архив"
   },
   "7610654194202731772": {
      "message": "Изтриване"
   },
   "7624042048123264803": {
      "message": "Отваряне на бележката"
   },
   "7629685876277801112": {
      "message": "При показването на този файл с карти възникна проблем."
   },
   "7630723924002267143": {
      "message": "Клавишните комбинации са активирани."
   },
   "7631302417932873160": {
      "message": "Файлът не може да бъде сканиран за вируси"
   },
   "7648759818896108920": {
      "message": "+ $1​"
   },
   "7649506133540465463": {
      "message": "Действието не можа да бъде отменено."
   },
   "7653702763016575386": {
      "message": "Синьо"
   },
   "7656983816661099886": {
      "message": "Неща"
   },
   "7659047104232758352": {
      "message": "този|тази|това|онзи|онази|онова"
   },
   "7669677145513127809": {
      "message": "Да се извърши ли преместване между екипните дискове?"
   },
   "7669846901402551021": {
      "message": "Днес"
   },
   "7690349821507417537": {
      "message": "Списъчният елемент $1​ бе премахнат"
   },
   "7690355160889785521": {
      "message": "Зелено"
   },
   "7691521283331762131": {
      "message": "Тук се показват архивираните ви бележки"
   },
   "7709557808259730054": {
      "message": "Одобрения"
   },
   "7709889936233398701": {
      "message": "Премахване"
   },
   "7715735412192018288": {
      "message": "Помощ"
   },
   "7715892737835649602": {
      "message": "Можете да добавите етикети и като въведете „#“."
   },
   "772000107335590599": {
      "message": "след $1​ минути"
   },
   "7724602581120994002": {
      "message": "Оранжево"
   },
   "7728066040934031356": {
      "message": "Лилаво"
   },
   "7734578122414851725": {
      "message": "PHP"
   },
   "7735981667219692675": {
      "message": "{resultCount,plural, =1{# резултат от търсенето}other{# резултата от търсенето}}"
   },
   "774390292128857049": {
      "message": "Търсене"
   },
   "7751981235297474273": {
      "message": "Отмяна"
   },
   "7754093419850121316": {
      "message": "⌘"
   },
   "7757440777278143092": {
      "message": "Тъмносиво"
   },
   "7772544658778579390": {
      "message": "Търсене в документа"
   },
   "777546328624962090": {
      "message": "Този файл не може да бъде качен. Приемаме тези във формат $1​, по-малки от $2​ МБ и $3​ мегапиксела."
   },
   "778181404304502404": {
      "message": "Намалихте елемента."
   },
   "7791050524692390574": {
      "message": "Цветове"
   },
   "7800318069267901681": {
      "message": "Променено"
   },
   "7814778057875152792": {
      "message": "При преместването на прикачения файл в избраната папка в Google Диск възникна проблем."
   },
   "7821512290975371360": {
      "message": "Яркорозово"
   },
   "7828886646639771557": {
      "message": "Създайте бележка…"
   },
   "7830513726270865588": {
      "message": "Календар"
   },
   "7842164552344536314": {
      "message": "Организира се..."
   },
   "7844842290699524598": {
      "message": "Достигнато е ограничението за етикети. Изтрийте съществуващ, за да добавите нов."
   },
   "7845751753397906805": {
      "message": "Намерени са несъвместими редакции"
   },
   "785840448809859989": {
      "message": "Опции за часа"
   },
   "7865240075542402013": {
      "message": "Добавяне на звезда"
   },
   "7868324478160174739": {
      "message": "Синьо"
   },
   "7873060817438017568": {
      "message": "$2​ · $1​"
   },
   "7873698934773957560": {
      "message": "Нищо"
   },
   "787773550893657271": {
      "message": "Отворена е предишната рисунка"
   },
   "7888520165977111723": {
      "message": "Да се извърши ли преместване в екипния диск?"
   },
   "7895643887742936844": {
      "message": "точка и запетая"
   },
   "7906726367011430855": {
      "message": "Свързване"
   },
   "7910887984113996757": {
      "message": "Включване на функцията за споделяне"
   },
   "7922692430438844436": {
      "message": "Извличане"
   },
   "792315196550007047": {
      "message": "Няма съответстващи резултати."
   },
   "7943657844420237650": {
      "message": "OpenOffice Impress"
   },
   "7946114032014914338": {
      "message": "{repeatSentence}. {endSentence}"
   },
   "7947001788143789176": {
      "message": "Зарежда се…"
   },
   "7959130747647079558": {
      "message": "{selectedCount,plural, =1{Избрана е # бележка}other{Избрани са # бележки}}"
   },
   "7976461426527138085": {
      "message": "Списъци"
   },
   "7988058806865329896": {
      "message": "Избор на дата и час"
   },
   "7991475666499751798": {
      "message": "Означаване на напомнянето като готово"
   },
   "7996360883730444101": {
      "message": "За съжаление, при отварянето на този файл възникна грешка. Моля, опитайте отново."
   },
   "7998118521140187915": {
      "message": "Приключените коментари са скрити"
   },
   "8003252582874834655": {
      "message": "Преместването на елементи в екипен диск променя достъпа и собствеността."
   },
   "8010075936095394680": {
      "message": "Версията на файла е твърде стара. Моля, проверете дали файлът е в най-новия формат. "
   },
   "8011497727123874703": {
      "message": "Бутон за папката „$1​“"
   },
   "8013687642711017862": {
      "message": "{NUM_ITEMS_1,plural, =0{unused plural form}=1{Премествате един елемент извън споделените папки, така че хората ще загубят достъп.}other{Премествате {NUM_ITEMS_2} елемента извън споделените папки, така че хората ще загубят достъп.}}"
   },
   "8019402848412685977": {
      "message": "Преименувахте „$2​“ на „$1​“."
   },
   "802668096552856965": {
      "message": "{checkedItemCount,plural, =1{# завършен елемент}other{# завършени елемента}}"
   },
   "8043514121228710092": {
      "message": "Добавяне на изображение"
   },
   "8044700199531805239": {
      "message": "Приложението $3​$1​$2​ е свързано."
   },
   "8046884224424523922": {
      "message": "{NUM_ITEMS_1,plural, =0{unused plural form}=1{{NUM_ITEMS_2} файл бе преместен от „{XXX_1}“ в/ъв „{XXX_2}“.}other{{NUM_ITEMS_2} файла бяха преместени от „{XXX_3}“ в/ъв „{XXX_4}“.}}"
   },
   "8063817953234049242": {
      "message": "Инструмент за избиране"
   },
   "8066398070826666542": {
      "message": "{count,plural, =1{+ # завършен елемент}other{+ # завършени елемента}}"
   },
   "8069384932934428393": {
      "message": "след $1​ минута"
   },
   "807840433749698811": {
      "message": "Циан"
   },
   "8080583426915938264": {
      "message": "Приложения на компютъра ви"
   },
   "8085493757603803516": {
      "message": "Редактиране на избраното"
   },
   "8090743714060857028": {
      "message": "Обикновените потребители не могат да изтеглят"
   },
   "8095838445486198080": {
      "message": "{FILE_SIZE,plural, =0{0 байта}=1{1 байт}other{# байта}}"
   },
   "8111632928339277375": {
      "message": "{NUM_FOLDERS,plural, =1{Преместване от една папка}=2{Преместване и от двете папки}other{Преместване от всичките # папки}}"
   },
   "8125425371755035523": {
      "message": "Отмяна"
   },
   "8133866583554546341": {
      "message": "$1​, $2​"
   },
   "8135145577663029437": {
      "message": "Запазване и на двете"
   },
   "8139785559888164453": {
      "message": "Научете повече"
   },
   "8144512434938656483": {
      "message": "или"
   },
   "8146560259680897627": {
      "message": "Отказ"
   },
   "8149439558305434788": {
      "message": "$1​, $2​"
   },
   "8159493406018222636": {
      "message": "Изпращане на отзиви"
   },
   "8163781449224244510": {
      "message": "Свиване на избраната област."
   },
   "8174654098152723289": {
      "message": "Редактиране на описанието"
   },
   "818217888086545352": {
      "message": "Жълто"
   },
   "8189126656205301402": {
      "message": "Копиране в Google Документи"
   },
   "8194941811853358224": {
      "message": "При премахването на звездата от „$1​“ възникна проблем."
   },
   "821942580510564685": {
      "message": "Моля, въведете паролата на този документ, за да го видите"
   },
   "8223878224920694193": {
      "message": "Всеки/всяка"
   },
   "8224193807932432983": {
      "message": "Действия"
   },
   "8225614702924834215": {
      "message": "Още опции"
   },
   "8231449936104909428": {
      "message": "При преместването на „$1​“ в избраната папка в Диск възникна проблем."
   },
   "8233945959714786736": {
      "message": "Назад"
   },
   "8242655297101700529": {
      "message": "Моят диск"
   },
   "826433162451399549": {
      "message": "Утре"
   },
   "8273434617910595878": {
      "message": "стрелка за надолу"
   },
   "8281141013543828574": {
      "message": "RAW изображение"
   },
   "8292708563843446267": {
      "message": "Елементите ще бъдат собственост на „$1​“."
   },
   "8304474373444239435": {
      "message": "Отговор от $1​."
   },
   "8305505634689906340": {
      "message": "Търсете в/ъв „$1​“"
   },
   "8322416564157128458": {
      "message": "Споделяне"
   },
   "8332720954679654953": {
      "message": "Изтегляния на приложението"
   },
   "8337582740675387693": {
      "message": "Java"
   },
   "8342620486324515462": {
      "message": "Отхвърляне"
   },
   "837692854094319105": {
      "message": "Със следните потребители не може да се сподели, защото администраторът им е деактивирал споделянето в домейна им."
   },
   "8379952094517631162": {
      "message": "Не"
   },
   "8409190394690387796": {
      "message": "Добавяне на коментар"
   },
   "8412098268689886334": {
      "message": "Обединяване"
   },
   "8412733496413412439": {
      "message": "Офлайн"
   },
   "84334343973701810": {
      "message": "Home"
   },
   "8452647597930138120": {
      "message": "Откройте клетка, която да коментирате"
   },
   "8453627484113670693": {
      "message": "Светлооранжево"
   },
   "8467894483369467251": {
      "message": "Светкавица"
   },
   "8471029293590878384": {
      "message": "Пауза"
   },
   "8493378997610580289": {
      "message": "Още клавишни комбинации"
   },
   "8505989225387082493": {
      "message": "Добавяне на етикет"
   },
   "8509270263487836281": {
      "message": "Вход"
   },
   "8517148045938431718": {
      "message": "Коригиране на грешките"
   },
   "8535303351837089357": {
      "message": "Можете да отменяте и възстановявате промени чрез {modifierKey}+Z и {modifierKey}+Y."
   },
   "8562196940800756925": {
      "message": "Инструмент за отбелязване"
   },
   "8589423377647285975": {
      "message": "Списъчен елемент „$3​“, $1​, $2​."
   },
   "8591848339430983053": {
      "message": "Бележки"
   },
   "8595175575778060149": {
      "message": "Още"
   },
   "8596279649507974639": {
      "message": "Преместване тук"
   },
   "8602525917014156029": {
      "message": "Места"
   },
   "8616342546716995946": {
      "message": "Разбрах"
   },
   "8621067185485606452": {
      "message": "ECMAScript"
   },
   "8621178077822096827": {
      "message": "Списъчният елемент $1​ бе вмъкнат"
   },
   "8626694988569301667": {
      "message": "Рисуването не е възможно"
   },
   "8637215430007224613": {
      "message": "Отворена е следващата рисунка"
   },
   "8646821180780920830": {
      "message": "Етикети"
   },
   "8652657235429996594": {
      "message": "Скоро"
   },
   "8660016472468563221": {
      "message": "двоеточие"
   },
   "8663507590720636709": {
      "message": "$1​ + още $2​"
   },
   "8663993454460982287": {
      "message": "Квадратчетата за отметка са скрити"
   },
   "8674222789100049233": {
      "message": "Затваряне"
   },
   "86815590954366945": {
      "message": "Списък с архивираното съдържание"
   },
   "8708723278154759600": {
      "message": "Бележките бяха архивирани"
   },
   "8726038895018570620": {
      "message": "Към връзката"
   },
   "8734569874711220205": {
      "message": "Меню за навигация"
   },
   "8738345098829705526": {
      "message": "Размер 12"
   },
   "8742388056829916665": {
      "message": "Показване на разширени визуализации на връзки"
   },
   "8773943264600860531": {
      "message": "Internet Explorer"
   },
   "8775097441636640256": {
      "message": "„$2​“ – $1​"
   },
   "8781837301864053001": {
      "message": "Форматиран текст"
   },
   "8786673003584562680": {
      "message": "Page Up"
   },
   "8792038552136453044": {
      "message": "Ами сега! Нещо се обърка"
   },
   "8793166064242077041": {
      "message": "При показването на това изображение възникна проблем."
   },
   "8822326207328431952": {
      "message": "Качването на изображения не е налично."
   },
   "8825353897919495748": {
      "message": "{NUM_ITEMS,plural, =0{unused plural form}=1{Наистина ли искате да преместите този файл?}other{Наистина ли искате да преместите тези файлове?}}"
   },
   "8845176264121061589": {
      "message": "Премахване на отметките от всички елементи"
   },
   "8851252390780816895": {
      "message": "Клиентски регистрационен файл"
   },
   "8852550049823214385": {
      "message": "след това"
   },
   "8860658114732392347": {
      "message": "Изтриване на напомнянето"
   },
   "8867634760949689122": {
      "message": "Файлът не можа да бъде преобразуван: времето за изчакване на преобразуването изтече. Моля, опитайте отново по-късно."
   },
   "8868758864963683383": {
      "message": "Премахване на избора от бележката"
   },
   "8869202143464930500": {
      "message": "Собствеността да се прехвърли ли към „$1​“?"
   },
   "887001400549949730": {
      "message": "Отваряне в нов прозорец"
   },
   "888015650266122140": {
      "message": "повторения"
   },
   "8889019648958415451": {
      "message": "Неизвестен файл"
   },
   "8917554093651202032": {
      "message": "Пускане на „$1​“"
   },
   "8919660666733306860": {
      "message": "Изображение"
   },
   "8923591894816841670": {
      "message": "Преместване на избраната област надолу."
   },
   "8925842014466254066": {
      "message": "Копира се в Google Документи"
   },
   "8930959387403789939": {
      "message": "Напомняне"
   },
   "8931267220766224111": {
      "message": "Искате ли да включите напомнянията в Google Keep? Може да се наложи да разрешите известията в браузъра."
   },
   "8938626240031421092": {
      "message": "Превключване на квадратчетата за отметка"
   },
   "8943760679396635042": {
      "message": "Показва се „$1​“."
   },
   "8953555255469284376": {
      "message": "Преместете изображенията тук"
   },
   "8962132866274125834": {
      "message": "Възстановяване"
   },
   "896590342186332268": {
      "message": "Размер 16"
   },
   "8975305711699693093": {
      "message": "Скриване на колоната с коментари"
   },
   "8978442832029227748": {
      "message": "Google Jamboard"
   },
   "8979104019474011578": {
      "message": "{every,plural, =1{Повтаря се ежеседмично}other{Повтаря се на всеки # седмици}}"
   },
   "8979615310931291676": {
      "message": "Редактирано: $1​"
   },
   "8988925599985431446": {
      "message": "Освобождаване"
   },
   "900086393693234779": {
      "message": "Дом"
   },
   "9003585743562048321": {
      "message": "Коментарите не можаха да бъдат синхронизирани поради грешка в мрежата."
   },
   "9012753183662045049": {
      "message": "Въведете по-кратко име на етикета"
   },
   "9021945828354340363": {
      "message": "{count,plural, =1{Тази бележка вече няма да е споделена с вас.}other{Тези бележки вече няма да са споделени с вас.}}"
   },
   "9024023699330078373": {
      "message": "Отварянето на тoзи елемент ще го добави към вашия Диск"
   },
   "9058308423774656474": {
      "message": "Hangul Word Processor"
   },
   "9063863448028905602": {
      "message": "Премахване от резултатите"
   },
   "9072994494820207560": {
      "message": "Елемент с отметка"
   },
   "9083935734710258396": {
      "message": "Отказвам"
   },
   "9094248058931620597": {
      "message": "Панелът за подробности е свит."
   },
   "911586799466052745": {
      "message": "Чертеж в OpenOffice"
   },
   "911698676339750373": {
      "message": "Семейна група"
   },
   "9121915169985572840": {
      "message": "Промяна на цвета"
   },
   "9124422680181020503": {
      "message": "Рисунката бе изтрита"
   },
   "9131268871618792263": {
      "message": "{NUM_ITEMS,plural, =0{unused plural form}=1{unused plural form}other{Членовете на екипните дискове ще загубят достъп, освен ако тези елементи не са споделени с тях.}}"
   },
   "9149141099919589043": {
      "message": "Стойности, разделени със запетая"
   },
   "9155213204821633067": {
      "message": "Премахнахте избора от $1​."
   },
   "9180910903828232576": {
      "message": "{NUM_ITEMS_1,plural, =0{unused plural form}=1{{NUM_ITEMS_2} папка бе добавена в/ъв „{XXX_1}“.}other{{NUM_ITEMS_2} папки бяха добавени в/ъв „{XXX_2}“.}}"
   },
   "9197837492705576727": {
      "message": "Към следващия елемент"
   },
   "919969969251998566": {
      "message": "Извличане на този архив в профила ви в пощата."
   },
   "9203454763088526300": {
      "message": "Текстът не може да бъде разпознат."
   },
   "9208632284144316801": {
      "message": "Повтаряне"
   },
   "9213031420087755232": {
      "message": "Изчистване на страницата"
   },
   "9220412150349575379": {
      "message": "инча"
   },
   "938074023403688885": {
      "message": "Премахване"
   },
   "951963820437151566": {
      "message": "Google Сайтове"
   },
   "960732173870658714": {
      "message": "Документ в Google Keep"
   },
   "969509857504028202": {
      "message": "Преместването на файлове извън екипен диск променя достъпа и собствеността."
   },
   "976103457024703736": {
      "message": "„$1​“ не се отвори."
   },
   "985197728509875956": {
      "message": "Химически модел"
   },
   "991852286447868510": {
      "message": "„$1​“ се търси"
   },
   "99635082918315028": {
      "message": "Текстът от изображенията е извлечен"
   },
   "996381410993745580": {
      "message": "Photoshop"
   },
   "996406443443155276": {
      "message": "„$1​“ не се отвори."
   },
   "appDesc": {
      "description": "App description",
      "message": "Бързо записвайте това, което мислите, и го споделяйте с близки и приятели."
   },
   "appName": {
      "description": "App name",
      "message": "Google Keep – бележки и списъци"
   },
   "shortName": {
      "description": "App short name",
      "message": "Google Keep"
   }
}
