omae wa mou shindeiru

nani


-------------------------------------------------------------


“Se ni’ mondo esistesse un po’ di bene
e ognun si honsiderasse suo fratello
ci sarebbe meno pensieri e meno pene
e il mondo ne sarebbe assai più bello”


fede