{
    "suggest.maxCompleteItemCount": 15,
    "suggest.timeout": 500,
    "java.errors.incompleteClasspath.severity": "ignore",
    "suggest.enablePreview":true,
	"list.insertMappings": {
        "<C-g>": "feedkeys:\\<Esc>"
    },
    "rpc.detailsEditing": "Bugs: Zero. I'm not a frickin loser",
    "rpc.detailsInExplorer":"{null}",
    "rpc.lowerDetailsEditing": "busy doing hot-vim shit",
    "rpc.lowerDetailsViewing": "busy doing hot-vim shit"
}
