<svg width="98" height="98" viewBox="0 0 98 98" fill="none" xmlns="http://www.w3.org/2000/svg">
<g clip-path="url(#clip0)">
<path d="M71.5161 45.355C71.5161 59.8454 59.7488 71.6128 45.2584 71.6128C30.768 71.6128 19.0006 59.8454 19.0006 45.2578C18.9033 30.7674 30.6707 19 45.2584 19C59.7488 19 71.5161 30.7674 71.5161 45.355Z" fill="#5248F9"/>
<path d="M47.1062 58.9702H43.3135C41.1739 58.9702 39.2289 58.1922 37.6729 56.6362C36.2141 55.0801 35.3389 53.1351 35.3389 50.9956H39.8124C39.8124 51.9681 40.2014 52.8434 40.8822 53.4269C41.5629 54.1076 42.4382 54.3994 43.3135 54.3994H47.1062C47.9815 54.3994 48.954 54.0104 49.5375 53.3296C50.2183 52.6489 50.51 51.7736 50.51 50.8984C50.51 49.9258 50.121 49.1478 49.5375 48.4671C48.8568 47.7863 47.9815 47.4946 47.1062 47.4946H43.3135C41.1739 47.4946 39.2289 46.7166 37.6729 45.1605C36.2141 43.6045 35.3389 41.6595 35.3389 39.52C35.3389 37.3805 36.1169 35.4355 37.6729 33.8794C39.2289 32.4207 41.1739 31.5454 43.3135 31.5454H47.1062C49.2458 31.5454 51.1908 32.3234 52.7468 33.8794C54.3028 35.4355 55.0808 37.3805 55.0808 39.52H50.6073C50.6073 38.5475 50.2183 37.6722 49.6348 37.0887C48.954 36.408 48.0787 36.1162 47.2035 36.1162H43.3135C42.4382 36.1162 41.5629 36.5052 40.8822 37.0887C40.2014 37.7695 39.9097 38.6447 39.9097 39.52C39.9097 40.3953 40.2987 41.2705 40.8822 41.9513C41.5629 42.632 42.4382 42.9238 43.3135 42.9238H47.1062C49.2458 42.9238 51.1908 43.7018 52.7468 45.2578C54.2056 46.7166 55.0808 48.7588 55.0808 50.8984C55.0808 53.0379 54.3028 54.9829 52.7468 56.5389C51.1908 58.0949 49.2458 58.9702 47.1062 58.9702Z" fill="white"/>
<path d="M47.495 29.3086H43.0215V33.8794H47.495V29.3086Z" fill="white"/>
<path d="M47.495 56.7334H43.0215V61.3042H47.495V56.7334Z" fill="white"/>
<path d="M47.1791 5.90752V1.86127C47.1791 0.833319 46.3458 0 45.3178 0C44.2899 0 43.4565 0.83332 43.4565 1.86127V5.90752C43.4565 6.93547 44.2899 7.76879 45.3178 7.76879C46.3458 7.76879 47.1791 6.93547 47.1791 5.90752Z" fill="#242D3C"/>
<path d="M31.9485 8.19337L30.4004 4.45505C30.0071 3.50533 28.9184 3.05425 27.9687 3.44755C27.0189 3.84084 26.5679 4.92957 26.9611 5.8793L28.5092 9.61762C28.9025 10.5673 29.9913 11.0184 30.941 10.6251C31.8907 10.2318 32.3418 9.1431 31.9485 8.19337Z" fill="#242D3C"/>
<path d="M18.7728 16.1312L15.9117 13.2701C15.1848 12.5432 14.0063 12.5432 13.2795 13.2701C12.5526 13.9969 12.5526 15.1754 13.2795 15.9023L16.1406 18.7634C16.8674 19.4902 18.0459 19.4902 18.7728 18.7634C19.4997 18.0365 19.4997 16.858 18.7728 16.1312Z" fill="#242D3C"/>
<path d="M9.63587 28.5077L5.89755 26.9588C4.94782 26.5653 3.85892 27.0162 3.46542 27.9659C3.07192 28.9156 3.52283 30.0045 4.47256 30.398L8.21088 31.9469C9.16061 32.3404 10.2495 31.8895 10.643 30.9398C11.0365 29.9901 10.5856 28.9012 9.63587 28.5077Z" fill="#242D3C"/>
<path d="M5.90752 43.4565H1.86127C0.833319 43.4565 0 44.2899 0 45.3178C0 46.3458 0.83332 47.1791 1.86127 47.1791H5.90752C6.93547 47.1791 7.76879 46.3458 7.76879 45.3178C7.76879 44.2899 6.93547 43.4565 5.90752 43.4565Z" fill="#242D3C"/>
<path d="M8.18793 58.6088L4.44961 60.1573C3.49989 60.5507 3.04889 61.6395 3.44229 62.5893C3.83569 63.539 4.92451 63.99 5.87423 63.5966L9.61255 62.0481C10.5623 61.6547 11.0133 60.5659 10.6199 59.6161C10.2265 58.6664 9.13766 58.2154 8.18793 58.6088Z" fill="#242D3C"/>
<path d="M16.1192 71.7865L13.2577 74.6472C12.5307 75.374 12.5306 76.5525 13.2573 77.2794C13.9841 78.0064 15.1626 78.0066 15.8895 77.2798L18.751 74.4191C19.478 73.6923 19.4782 72.5139 18.7514 71.7869C18.0246 71.0599 16.8462 71.0598 16.1192 71.7865Z" fill="#242D3C"/>
<path d="M28.4942 80.928L26.9457 84.6664C26.5523 85.6161 27.0033 86.7049 27.953 87.0983C28.9028 87.4917 29.9916 87.0407 30.385 86.091L31.9335 82.3526C32.3269 81.4029 31.8759 80.3141 30.9261 79.9207C29.9764 79.5273 28.8876 79.9783 28.4942 80.928Z" fill="#242D3C"/>
<path d="M47.1791 88.6936V84.6474C47.1791 83.6195 46.3458 82.7861 45.3178 82.7861C44.2899 82.7861 43.4565 83.6195 43.4565 84.6474V88.6936C43.4565 89.7216 44.2899 90.5549 45.3178 90.5549C46.3458 90.5549 47.1791 89.7216 47.1791 88.6936Z" fill="#242D3C"/>
<path d="M63.5869 84.6876L62.0396 80.9489C61.6465 79.9991 60.5578 79.5477 59.608 79.9408C58.6582 80.3339 58.2068 81.4226 58.5999 82.3724L60.1472 86.1111C60.5403 87.061 61.629 87.5123 62.5788 87.1192C63.5286 86.7261 63.9799 85.6375 63.5869 84.6876Z" fill="#242D3C"/>
<path d="M86.0813 60.1817L82.343 58.6332C81.3933 58.2398 80.3044 58.6908 79.911 59.6405C79.5176 60.5902 79.9686 61.679 80.9184 62.0724L84.6567 63.6209C85.6064 64.0143 86.6952 63.5633 87.0886 62.6136C87.482 61.6639 87.031 60.5751 86.0813 60.1817Z" fill="#242D3C"/>
<path d="M88.6936 43.4565H84.6474C83.6195 43.4565 82.7861 44.2899 82.7861 45.3178C82.7861 46.3458 83.6195 47.1791 84.6474 47.1791H88.6936C89.7216 47.1791 90.5549 46.3458 90.5549 45.3178C90.5549 44.2899 89.7216 43.4565 88.6936 43.4565Z" fill="#242D3C"/>
<path d="M84.6796 26.9716L80.9413 28.5201C79.9916 28.9135 79.5406 30.0023 79.934 30.9521C80.3274 31.9018 81.4162 32.3528 82.3659 31.9594L86.1042 30.4109C87.054 30.0175 87.505 28.9287 87.1116 27.9789C86.7182 27.0292 85.6294 26.5782 84.6796 26.9716Z" fill="#242D3C"/>
<path d="M74.6569 13.2891L71.795 16.1494C71.0679 16.876 71.0676 18.0545 71.7942 18.7816C72.5209 19.5086 73.6994 19.509 74.4265 18.7823L77.2884 15.922C78.0154 15.1954 78.0158 14.0169 77.2891 13.2898C76.5625 12.5627 75.384 12.5624 74.6569 13.2891Z" fill="#242D3C"/>
<path d="M60.1652 4.48896L58.6183 8.22769C58.2253 9.17752 58.6767 10.2661 59.6266 10.6591C60.5764 11.0521 61.6649 10.6007 62.0579 9.65082L63.6048 5.91209C63.9978 4.96226 63.5464 3.8737 62.5966 3.48071C61.6467 3.08772 60.5582 3.53913 60.1652 4.48896Z" fill="#242D3C"/>
<path d="M96.6946 94.0736L89.9977 87.3805C89.2707 86.6539 88.0922 86.6542 87.3655 87.3813C86.6389 88.1083 86.6392 89.2868 87.3663 90.0135L94.0632 96.7066C94.7902 97.4332 95.9687 97.4329 96.6954 96.7058C97.422 95.9787 97.4217 94.8003 96.6946 94.0736Z" fill="#242D3C"/>
<path d="M83.3754 93.9467C81.8193 95.4955 79.1811 94.903 78.4368 92.8374L72.4942 76.3469C71.6321 73.9545 73.951 71.6417 76.3411 72.5102L92.8316 78.5023C94.8977 79.253 95.4815 81.8975 93.9234 83.4482L83.3754 93.9467ZM76.474 76.474L81.5723 90.474L90.555 81.4914L76.474 76.474Z" fill="#242D3C"/>
</g>
<defs>
<clipPath id="clip0">
<rect width="98" height="98" rx="4" fill="white"/>
</clipPath>
</defs>
</svg>
