<svg width="50" height="44" viewBox="0 0 50 44" fill="none" xmlns="http://www.w3.org/2000/svg">
<rect x="30" y="4" width="20" height="20" rx="10" fill="#5248F9"/>
<path d="M21.9999 32.5416L10.6846 38.4908L12.8461 25.8903L3.67944 16.9675L16.3294 15.1341L21.9871 3.67029L27.6448 15.1341L40.2948 16.9675L31.1281 25.8903L33.2896 38.4908L21.9999 32.5416Z" stroke="#373A65" stroke-width="2.75" stroke-linecap="round" stroke-linejoin="round"/>
</svg>
