<svg width="115" height="108" viewBox="0 0 115 108" fill="none" xmlns="http://www.w3.org/2000/svg">
<g clip-path="url(#clip0)">
<path d="M58.7183 33.0262C57.9363 32.2398 56.6638 32.2398 55.8818 33.0262L40.3818 48.6148C40.0092 48.9895 39.8 49.4965 39.8 50.0249V68.1999C39.8 69.3044 40.6955 70.1999 41.8 70.1999H51.0001C52.1046 70.1999 53 69.3044 53 68.1999V62.4999C53 61.3953 53.8955 60.4999 55 60.4999H59.7001C60.8046 60.4999 61.7001 61.3953 61.7001 62.4999V68.1999C61.7001 69.3044 62.5955 70.1999 63.7001 70.1999H72.8001C73.9046 70.1999 74.8001 69.3044 74.8001 68.1999V50.0249C74.8001 49.4965 74.5909 48.9895 74.2183 48.6148L58.7183 33.0262Z" fill="#5248F9"/>
<path d="M77.9139 52.7289C77.1295 53.4895 75.88 53.4798 75.1074 52.7073L58.7142 36.3141C57.9332 35.5331 56.6669 35.5331 55.8858 36.3141L39.5142 52.6857C38.7332 53.4667 37.4669 53.4667 36.6858 52.6857L36.3111 52.311C35.5313 51.5312 35.5299 50.2673 36.3079 49.4857L55.8858 29.8204C56.6663 29.0364 57.9351 29.035 58.7174 29.8173L78.3639 49.4638C79.1534 50.2533 79.1436 51.5365 78.342 52.3138L77.9139 52.7289Z" fill="#242D3C"/>
<path d="M114.7 83.3C114.7 84.4046 113.805 85.3 112.7 85.3H2C0.895432 85.3 0 84.4046 0 83.3V18.5C0 17.3954 0.89543 16.5 2 16.5H112.7C113.805 16.5 114.7 17.3954 114.7 18.5V83.3ZM4.6 78.7C4.6 79.8046 5.49543 80.7 6.6 80.7H108.1C109.205 80.7 110.1 79.8046 110.1 78.7V23.1C110.1 21.9954 109.205 21.1 108.1 21.1H6.6C5.49543 21.1 4.6 21.9954 4.6 23.1V78.7Z" fill="#242D3C"/>
<path d="M107.8 19.1C107.8 20.2046 106.905 21.1 105.8 21.1H8.90003C7.79546 21.1 6.90002 20.2046 6.90002 19.1V2C6.90002 0.895433 7.79545 0 8.90002 0H46.2C47.3046 0 48.2 0.895431 48.2 2V3.5C48.2 4.60457 49.0955 5.5 50.2 5.5H105.8C106.905 5.5 107.8 6.39543 107.8 7.5V19.1ZM11.5 14.5C11.5 15.6046 12.3955 16.5 13.5 16.5H101.2C102.305 16.5 103.2 15.6046 103.2 14.5V12.1C103.2 10.9954 102.305 10.1 101.2 10.1H45.6C44.4955 10.1 43.6 9.20457 43.6 8.1V6.6C43.6 5.49543 42.7046 4.6 41.6 4.6H13.5C12.3955 4.6 11.5 5.49543 11.5 6.6V14.5Z" fill="#242D3C"/>
<path d="M57.3 107.3C52.5 107.3 48.6 103.4 48.6 98.5999C48.6 93.7999 52.5 89.8999 57.3 89.8999C62.1 89.8999 66 93.7999 66 98.5999C66 103.4 62.1 107.3 57.3 107.3ZM57.3 94.4999C55 94.4999 53.2 96.3999 53.2 98.5999C53.2 100.9 55.1 102.7 57.3 102.7C59.6 102.7 61.4 100.8 61.4 98.5999C61.5 96.2999 59.6 94.4999 57.3 94.4999Z" fill="#242D3C"/>
<path d="M103.5 96.3H65.7999C64.6954 96.3 63.7999 97.1955 63.7999 98.3V98.9C63.7999 100.005 64.6954 100.9 65.7999 100.9H103.5C104.604 100.9 105.5 100.005 105.5 98.9V98.3C105.5 97.1955 104.604 96.3 103.5 96.3Z" fill="#242D3C"/>
<path d="M48.8999 96.3H11.2C10.0954 96.3 9.19995 97.1955 9.19995 98.3V98.9C9.19995 100.005 10.0954 100.9 11.2 100.9H48.9C50.0045 100.9 50.9 100.005 50.9 98.9V98.3C50.9 97.1955 50.0045 96.3 48.8999 96.3Z" fill="#242D3C"/>
<path d="M57.6 83H57C55.8954 83 55 83.8954 55 85V90.2C55 91.3046 55.8954 92.2 57 92.2H57.6C58.7046 92.2 59.6 91.3046 59.6 90.2V85C59.6 83.8954 58.7046 83 57.6 83Z" fill="#242D3C"/>
</g>
<defs>
<clipPath id="clip0">
<rect width="114.7" height="107.3" fill="white"/>
</clipPath>
</defs>
</svg>
