__size_of_I2C_SlaveEnableIrq 0 0 ABS 0
___lldiv@counter 31 0 BANK0 1
setAnLeds@ledState C5 0 BANK1 1
_getPowerOnState C92 0 CODE 0
_setPowerOnState CF0 0 CODE 0
_PR2 1B 0 ABS 0
_PR4 416 0 ABS 0
__S0 1000 0 ABS 0
__S1 EA 0 ABS 0
_PR6 41D 0 ABS 0
__S2 0 0 ABS 0
__S3 0 0 ABS 0
__Hintentry 6B 0 CODE 0
_showStartupPattern 95 0 CODE 0
__Lintentry 4 0 CODE 0
__pintentry 4 0 CODE 0
_TMR0 15 0 ABS 0
_TMR2 1A 0 ABS 0
_TMR4 415 0 ABS 0
_TMR6 41C 0 ABS 0
_LATA 10C 0 ABS 0
_LATB 10D 0 ABS 0
_LATC 10E 0 ABS 0
_LATD 10F 0 ABS 0
_LATE 110 0 ABS 0
_i2cRegAdd 4F 0 BANK0 1
_WPUB 20D 0 ABS 0
_WPUE 210 0 ABS 0
__end_of_PWM5_LoadDutyValue EDB 0 CODE 0
_PLLR 4D6 0 ABS 0
__end_of_PIN_MANAGER_Initialize F10 0 CODE 0
__end_of_TMR1_Initialize E35 0 CODE 0
_main 531 0 CODE 0
_i2cSlaveAddr 51 0 BANK0 1
_I2C_SlaveSetWriteIntHandler D25 0 CODE 0
___sp 0 0 STACK 2
btemp 7E 0 ABS 0
start 6B 0 CODE 0
_I2C_SlaveDefWrColInterruptHandler 3 0 CODE 0
_TMR1_WriteTimer E02 0 CODE 0
_TMR1H 17 0 ABS 0
_TMR1L 16 0 ABS 0
__end_of_I2C_SlaveSetWrColIntHandler D25 0 CODE 0
__size_of_I2C_SlaveOpen 0 0 ABS 0
_TRISA 8C 0 ABS 0
_TRISB 8D 0 ABS 0
_TRISC 8E 0 ABS 0
reset_vec 0 0 CODE 0
_TRISD 8F 0 ABS 0
_TRISE 90 0 ABS 0
_T1CON 18 0 ABS 0
_T2CON 1C 0 ABS 0
_T4CON 417 0 ABS 0
_T6CON 41E 0 ABS 0
__size_of_I2C_SlaveSendTxData 0 0 ABS 0
__end_of_setI2cRegister 531 0 CODE 0
wtemp0 7E 0 ABS 0
setPowerOnState@state BD 0 BANK1 1
_EPWM1_Initialize DA9 0 CODE 0
_EPWM2_Initialize DB6 0 CODE 0
_EPWM3_Initialize DC3 0 CODE 0
__Hconfig 8009 0 CONFIG 4
__Lconfig 0 0 CONFIG 4
TMR1_WriteTimer@timerVal 70 0 COMMON 1
_i2cState 54 0 BANK0 1
_I2C_SlaveIsWriteCollision CA6 0 CODE 0
_I2C_Open 7BF 0 CODE 0
_I2C_SlaveDefRdInterruptHandler 0 0 ABS 0
__size_of_I2C_SlaveSetSlaveAddr 0 0 ABS 0
__size_of_getI2cRegister 0 0 ABS 0
__Hbigram 0 0 ABS 0
_I2C_SlaveClearIrq C80 0 CODE 0
__Lbigram 0 0 ABS 0
__Hram 0 0 ABS 0
__Lram 0 0 ABS 0
?i1_getAdcResults 70 0 COMMON 1
_i2cRdData 52 0 BANK0 1
__end_of_I2C_SlaveSetWriteIntHandler D2E 0 CODE 0
_i2cWrData 53 0 BANK0 1
__end_of_TMR2_Initialize CE0 0 CODE 0
int$flags 7E 0 ABS 0
__size_of_TMR4_ISR 0 0 ABS 0
__size_of_EPWM1_LoadDutyValue 0 0 ABS 0
setLowBattLed@now CF 0 BANK1 1
?_getOvervoltageThreshold BC 0 BANK1 1
getI2cRegister@value 37 0 BANK0 1
setI2cRegister@value 32 0 BANK0 1
__Hfunctab 0 0 ENTRY 0
__Lfunctab 0 0 ENTRY 0
__end_of_WDT_Initialize C9C 0 CODE 0
_ADCON0 9D 0 ABS 0
_ADCON1 9E 0 ABS 0
_INTERRUPT_InterruptManager 4 0 CODE 0
_getAdcResults E35 0 CODE 0
_setAdcResults D40 0 CODE 0
_I2C_SlaveSetIsrHandler D0A 0 CODE 0
__end_of_I2C_SlaveIsWriteCollision CAB 0 CODE 0
?_getTimerTickMs BC 0 BANK1 1
_OPTION_REG 95 0 ABS 0
__Hcommon 0 0 ABS 0
__Lcommon 0 0 ABS 0
__end_of_TMR4_ISR CD8 0 CODE 0
_PIE1bits 91 0 ABS 0
_PIE2bits 92 0 ABS 0
_PIE3bits 93 0 ABS 0
__Heeprom_data 0 0 EEDATA 3
__Leeprom_data 0 0 EEDATA 3
_PIR1bits 11 0 ABS 0
_PIR2bits 12 0 ABS 0
__size_of_setLowBattState 0 0 ABS 0
_PIR3bits 13 0 ABS 0
_CCPR1H 292 0 ABS 0
_CCPR2H 299 0 ABS 0
_CCPR3H 312 0 ABS 0
_LATAbits 10C 0 ABS 0
_LATBbits 10D 0 ABS 0
_CCPR5H 31D 0 ABS 0
_LATCbits 10E 0 ABS 0
_LATDbits 10F 0 ABS 0
_LATEbits 110 0 ABS 0
_SSPADD 212 0 ABS 0
__end_of_showStartupPattern 32D 0 CODE 0
___int_sp 0 0 STACK 2
_CCPR1L 291 0 ABS 0
_WPUEbits 210 0 ABS 0
_ANSELA 18C 0 ABS 0
_CCPR2L 298 0 ABS 0
_CCPR3L 311 0 ABS 0
_ANSELB 18D 0 ABS 0
?___lldiv 24 0 BANK0 1
_CCPR5L 31C 0 ABS 0
__size_of_I2C_Isr 0 0 ABS 0
_ANSELD 18F 0 ABS 0
_ANSELE 190 0 ABS 0
__size_of_I2C_Open 0 0 ABS 0
__end_of_ADC_Initialize D37 0 CODE 0
_isPowerOn 4C 0 BANK0 1
_SSPBUF 211 0 ABS 0
_ADRESH 9C 0 ABS 0
_T1GCON 19 0 ABS 0
_APFCON 11D 0 ABS 0
_OSCCON 99 0 ABS 0
__Habs1 0 0 ABS 0
_I2C_SlaveRdInterruptHandler 46 0 BANK0 1
__Labs1 0 0 ABS 0
_ADRESL 9B 0 ABS 0
_BORCON 116 0 ABS 0
_WDTCON 97 0 ABS 0
__Hsfr0 0 0 ABS 0
__Lsfr0 0 0 ABS 0
__Hsfr1 0 0 ABS 0
_SSPMSK 213 0 ABS 0
__Lsfr1 0 0 ABS 0
__Hsfr2 0 0 ABS 0
__Lsfr2 0 0 ABS 0
__Hsfr3 0 0 ABS 0
__Lsfr3 0 0 ABS 0
__Hsfr4 0 0 ABS 0
__Lsfr4 0 0 ABS 0
__Hsfr5 0 0 ABS 0
__Lsfr5 0 0 ABS 0
__Hsfr6 0 0 ABS 0
__Lsfr6 0 0 ABS 0
__Hsfr7 0 0 ABS 0
__Lsfr7 0 0 ABS 0
__Hsfr8 0 0 ABS 0
__Lsfr8 0 0 ABS 0
_I2C_SlaveAddrInterruptHandler 42 0 BANK0 1
__Hsfr9 0 0 ABS 0
__Lsfr9 0 0 ABS 0
__size_of_I2C_SlaveRestart 0 0 ABS 0
PWM5_LoadDutyValue@dutyValue 70 0 COMMON 1
___stackhi 21EF 0 ABS 0
__size_of_setAnLeds 0 0 ABS 0
_isOvervoltage 4A 0 BANK0 1
main@lastSwState D4 0 BANK1 1
_I2C_SlaveGetRxData C83 0 CODE 0
getAdcResults@channel BF 0 BANK1 1
setAdcResults@channel 72 0 COMMON 1
__Hcode 0 0 ABS 0
__Lcode 0 0 ABS 0
setLowBattState@state BD 0 BANK1 1
I2C_SlaveSetIsrHandler@handler BC 0 BANK1 1
__end_of_I2C_SlaveOpen DE1 0 CODE 0
_clearAllLeds EDB 0 CODE 0
_setAnLeds 32D 0 CODE 0
__HcstackBANK0 0 0 ABS 0
__LcstackBANK0 0 0 ABS 0
__end_of_getPowerOnState C95 0 CODE 0
__pcstackBANK0 20 0 BANK0 1
__end_of_I2C_SlaveSetSlaveAddr CB6 0 CODE 0
___lmul F6F 0 CODE 0
__Hinit 6B 0 CODE 0
__Linit 6B 0 CODE 0
__end_of_main 5D6 0 CODE 0
_I2C_SlaveEnableIrq C95 0 CODE 0
__Htext 0 0 ABS 0
__Ltext 0 0 ABS 0
__size_of_TMR4_Initialize 0 0 ABS 0
__size_of_EPWM1_Initialize 0 0 ABS 0
___lmul@multiplier 76 0 COMMON 1
__HdataBANK0 0 0 ABS 0
__LdataBANK0 0 0 ABS 0
__pdataBANK0 55 0 BANK0 1
__size_of_setLowBattLed 0 0 ABS 0
end_of_initialization 91 0 CODE 0
__size_of_I2C_Initialize 0 0 ABS 0
__end_of_TMR4_Initialize D78 0 CODE 0
TMR6_ISR@servo 4E 0 BANK0 1
___stacklo 209A 0 ABS 0
___lmul@multiplicand 7A 0 COMMON 1
__size_of_getOvervoltageState 0 0 ABS 0
__Hsfr10 0 0 ABS 0
__Lsfr10 0 0 ABS 0
_I2C_SlaveIsRead CA1 0 CODE 0
_SSPCON1 215 0 ABS 0
__Hsfr20 0 0 ABS 0
__Lsfr20 0 0 ABS 0
__Hsfr30 0 0 ABS 0
__Hsfr11 0 0 ABS 0
__Lsfr30 0 0 ABS 0
__Lsfr11 0 0 ABS 0
_SSPCON2 216 0 ABS 0
__Hsfr21 0 0 ABS 0
__Lsfr21 0 0 ABS 0
?_getAdcResults BC 0 BANK1 1
__Hsfr31 0 0 ABS 0
__Hsfr12 0 0 ABS 0
__Lsfr31 0 0 ABS 0
__Lsfr12 0 0 ABS 0
__end_of_I2C_SlaveRestart C8C 0 CODE 0
__Hsfr22 0 0 ABS 0
__Lsfr22 0 0 ABS 0
__Hsfr13 0 0 ABS 0
__Lsfr13 0 0 ABS 0
__Hsfr23 0 0 ABS 0
__Lsfr23 0 0 ABS 0
_i2cRegAddReceived 50 0 BANK0 1
__Hsfr14 0 0 ABS 0
__end_of_TMR6_ISR 7BF 0 CODE 0
__Lsfr14 0 0 ABS 0
__Hsfr24 0 0 ABS 0
__Lsfr24 0 0 ABS 0
__Hsfr15 0 0 ABS 0
__Lsfr15 0 0 ABS 0
_getLowBattState C8C 0 CODE 0
__Hsfr25 0 0 ABS 0
__Lsfr25 0 0 ABS 0
_setLowBattState CE0 0 CODE 0
__Hsfr16 0 0 ABS 0
__end_of_incTimerTickMs D54 0 CODE 0
__Lsfr16 0 0 ABS 0
_I2C_SlaveOpen DD1 0 CODE 0
__HdataBANK1 0 0 ABS 0
__size_of_clearAllLeds 0 0 ABS 0
__Hsfr26 0 0 ABS 0
__LdataBANK1 0 0 ABS 0
__Lsfr26 0 0 ABS 0
__Hsfr17 0 0 ABS 0
__Lsfr17 0 0 ABS 0
__Hsfr27 0 0 ABS 0
__Lsfr27 0 0 ABS 0
__pdataBANK1 D7 0 BANK1 1
__Hsfr18 0 0 ABS 0
__Lsfr18 0 0 ABS 0
__Hsfr28 0 0 ABS 0
__Lsfr28 0 0 ABS 0
__end_of_EPWM1_LoadDutyValue E96 0 CODE 0
I2C_SlaveSetWrColIntHandler@handler BC 0 BANK1 1
__Hsfr19 0 0 ABS 0
__Lsfr19 0 0 ABS 0
__Hsfr29 0 0 ABS 0
__Lsfr29 0 0 ABS 0
_isLowBatt 4B 0 BANK0 1
__end_of_PWM5_Initialize D40 0 CODE 0
__end_of_EPWM1_Initialize DB6 0 CODE 0
_i2cRegisters D7 0 BANK1 1
_I2C_SlaveSetAddrIntHandler CF8 0 CODE 0
_T1CONbits 18 0 ABS 0
__Hstrings 0 0 ABS 0
_T2CONbits 1C 0 ABS 0
_T4CONbits 417 0 ABS 0
__Lstrings 0 0 ABS 0
_T6CONbits 41E 0 ABS 0
__size_of_I2C_SlaveSetWrColIntHandler 0 0 ABS 0
_I2C_SlaveWrColCallBack D9C 0 CODE 0
__size_of_PWM5_LoadDutyValue 0 0 ABS 0
getI2cRegister@reg 38 0 BANK0 1
setI2cRegister@reg 37 0 BANK0 1
setLowBattLed@timestamp AF 0 BANK1 1
__size_of_setI2cRegister 0 0 ABS 0
__size_of_PWM5_Initialize 0 0 ABS 0
_SYSTEM_Initialize F10 0 CODE 0
_ECCP1AS 295 0 ABS 0
_ECCP2AS 29C 0 ABS 0
_getLowbattLowerThreshold D84 0 CODE 0
_ECCP3AS 315 0 ABS 0
getLowbattUpperThreshold@value BE 0 BANK1 1
_OSCTUNE 98 0 ABS 0
_CCP1CON 293 0 ABS 0
showStartupPattern@timestamp C8 0 BANK1 1
_CCP2CON 29A 0 ABS 0
_CCP3CON 313 0 ABS 0
_CCP5CON 31E 0 ABS 0
_PWM1CON 294 0 ABS 0
_PWM2CON 29B 0 ABS 0
_PWM3CON 314 0 ABS 0
__Hbank0 0 0 ABS 0
__Lbank0 0 0 ABS 0
I2C_SlaveSetBusColIntHandler@handler BC 0 BANK1 1
__Hbank1 0 0 ABS 0
__Lbank1 0 0 ABS 0
__size_of_I2C_SlaveIsWriteCollision 0 0 ABS 0
__end_of_setPowerOnState CF8 0 CODE 0
__Hbank2 0 0 ABS 0
__Lbank2 0 0 ABS 0
__Hbank3 0 0 ABS 0
__Lbank3 0 0 ABS 0
___latbits 2 0 ABS 0
__Hbank4 0 0 ABS 0
__Lbank4 0 0 ABS 0
__end_of___lmul FA5 0 CODE 0
__Hbank5 0 0 ABS 0
__Lbank5 0 0 ABS 0
__Hpowerup 0 0 CODE 0
_SSPSTAT 214 0 ABS 0
__Lpowerup 0 0 CODE 0
__Hbank6 0 0 ABS 0
__Lbank6 0 0 ABS 0
__Hbank7 0 0 BANK7 1
__Lbank7 0 0 BANK7 1
__size_of_I2C_SlaveClearIrq 0 0 ABS 0
__Hbank8 0 0 BANK8 1
__Lbank8 0 0 BANK8 1
__size_of_TMR1_WriteTimer 0 0 ABS 0
__Hbank9 0 0 BANK9 1
_SSPCON1bits 215 0 ABS 0
__Lbank9 0 0 BANK9 1
_ADC_ISR F3B 0 CODE 0
_SSPCON2bits 216 0 ABS 0
__ptext1 95 0 CODE 0
__ptext2 EDB 0 CODE 0
i1getAdcResults@value 73 0 COMMON 1
__ptext3 CF0 0 CODE 0
__end_of_I2C_SlaveClearIrq C83 0 CODE 0
__ptext4 CE8 0 CODE 0
__ptext5 CE0 0 CODE 0
__ptext6 6E1 0 CODE 0
__ptext7 E6B 0 CODE 0
__HcstackBANK1 0 0 ABS 0
__LcstackBANK1 0 0 ABS 0
__ptext8 32D 0 CODE 0
__size_of_I2C_SlaveGetRxData 0 0 ABS 0
__size_ofi1_getAdcResults 0 0 ABS 0
__end_of_I2C_SlaveGetRxData C86 0 CODE 0
__ptext9 E35 0 CODE 0
__pcstackBANK1 BC 0 BANK1 1
__Hclrtext 0 0 ABS 0
__Lclrtext 0 0 ABS 0
?_getLowbattUpperThreshold BC 0 BANK1 1
__size_of_TMR0_ISR 0 0 ABS 0
__end_of_clearAllLeds EF3 0 CODE 0
_MSSP_InterruptHandler 48 0 BANK0 1
__size_of_I2C_SlaveSetWriteIntHandler 0 0 ABS 0
__end_of__initialization 91 0 CODE 0
__end_of_TMR6_Initialize D84 0 CODE 0
__size_of_TMR6_ISR 0 0 ABS 0
__size_of_EPWM2_LoadDutyValue 0 0 ABS 0
__size_of_I2C_SlaveSetBusColIntHandler 0 0 ABS 0
_I2C_SlaveSendTxData CAB 0 CODE 0
__end_of_I2C_SlaveSetSlaveMask CBC 0 CODE 0
__size_of_getOvervoltageThreshold 0 0 ABS 0
__size_of_I2C_SlaveReleaseClock 0 0 ABS 0
_SSPSTATbits 214 0 ABS 0
__end_of_I2C_Isr 65E 0 CODE 0
__end_ofi1_getAdcResults E02 0 CODE 0
getTimerTickMs@value C0 0 BANK1 1
__end_of_getLowbattUpperThreshold DF1 0 CODE 0
__end_of_EPWM2_LoadDutyValue EAD 0 CODE 0
__end_of_getLowbattLowerThreshold D90 0 CODE 0
_TMR0_Initialize E13 0 CODE 0
_TMR1_Initialize E24 0 CODE 0
_TMR2_Initialize CD8 0 CODE 0
setLowBattLed@lowbatt CC 0 BANK1 1
_TMR4_Initialize D6C 0 CODE 0
_PWM5_Initialize D37 0 CODE 0
__end_of_EPWM2_Initialize DC3 0 CODE 0
_TMR6_Initialize D78 0 CODE 0
__size_of_I2C_SlaveSetSlaveMask 0 0 ABS 0
__Hstack 0 0 STACK 2
__Lstack 0 0 STACK 2
__end_of_setLowBattLed 751 0 CODE 0
I2C_SlaveSendTxData@data 70 0 COMMON 1
__end_of___lldiv 1000 0 CODE 0
_I2C_Isr 5D6 0 CODE 0
__Hspace_0 1000 0 ABS 0
__Lspace_0 0 0 ABS 0
init_ram CC2 0 CODE 0
_I2C_SlaveSetReadIntHandler D13 0 CODE 0
__Hspace_1 EA 0 ABS 0
__Lspace_1 0 0 ABS 0
__end_of_I2C_Open 7FE 0 CODE 0
_incTimerTickMs D4A 0 CODE 0
TMR6_ISR@pulseWidth 3B 0 BANK0 1
_getTimerTickMs E6B 0 CODE 0
?___lmul 76 0 COMMON 1
__Hspace_2 0 0 ABS 0
__Lspace_2 0 0 ABS 0
__Hcinit 95 0 CODE 0
__Lcinit 6D 0 CODE 0
__end_of_getOvervoltageState C92 0 CODE 0
___lldiv FA5 0 CODE 0
__size_of_setOvervoltageState 0 0 ABS 0
__Hspace_3 0 0 ABS 0
__Lspace_3 0 0 ABS 0
__size_of_main 0 0 ABS 0
__end_of_INTERRUPT_InterruptManager 6B 0 CODE 0
__end_of_setAnLeds 437 0 CODE 0
__size_of_getPowerOnState 0 0 ABS 0
_lowbattUpperThreshold 55 0 BANK0 1
__Hspace_4 10010 0 ABS 0
__Lspace_4 0 0 ABS 0
__end_of_I2C_SlaveWrColCallBack DA9 0 CODE 0
__size_of_TMR0_Initialize 0 0 ABS 0
_PIN_MANAGER_Initialize EF3 0 CODE 0
I2C_SlaveSetSlaveMask@maskAddr BC 0 BANK1 1
_I2C_SlaveReleaseClock C86 0 CODE 0
__size_of_I2C_SlaveDefWrColInterruptHandler 0 0 ABS 0
__size_of_getLowbattUpperThreshold 0 0 ABS 0
__HidataBANK0 0 0 ABS 0
__LidataBANK0 0 0 ABS 0
__size_of_getLowbattLowerThreshold 0 0 ABS 0
__pidataBANK0 7FE 0 CODE 0
_I2C_SlaveSetSlaveAddr CB0 0 CODE 0
_I2C_SlaveSetSlaveMask CB6 0 CODE 0
__end_of_TMR1_WriteTimer E13 0 CODE 0
__size_of_TMR1_ISR 0 0 ABS 0
__size_of_TMR6_Initialize 0 0 ABS 0
main@lowbatt BB 0 BANK1 1
__size_of_EPWM2_Initialize 0 0 ABS 0
clear_ram0 CBC 0 CODE 0
__size_of_SYSTEM_Initialize 0 0 ABS 0
i1getAdcResults@channel 75 0 COMMON 1
_getOvervoltageState C8F 0 CODE 0
_setOvervoltageState CE8 0 CODE 0
_getLowbattUpperThreshold DE1 0 CODE 0
__end_of_I2C_SlaveIsRead CA6 0 CODE 0
__size_of_getAdcResults 0 0 ABS 0
__HbssBANK0 0 0 ABS 0
__LbssBANK0 0 0 ABS 0
main@vinAdcResult D5 0 BANK1 1
_I2C_SlaveDefAddrInterruptHandler 0 0 ABS 0
__Hbank10 0 0 BANK10 1
__pbssBANK0 3C 0 BANK0 1
__Lbank10 0 0 BANK10 1
__size_of_I2C_SlaveSetReadIntHandler 0 0 ABS 0
__Hbank20 0 0 BANK20 1
__Lbank20 0 0 BANK20 1
__end_of_I2C_SlaveIsData CA1 0 CODE 0
__Hbank30 0 0 BANK30 1
__Hbank11 0 0 BANK11 1
__Lbank30 0 0 BANK30 1
__Lbank11 0 0 BANK11 1
__Hbank21 0 0 BANK21 1
__Lbank21 0 0 BANK21 1
__end_of_OSCILLATOR_Initialize D6C 0 CODE 0
__Hbank31 0 0 BANK31 1
__Hbank12 0 0 BANK12 1
__Lbank31 0 0 BANK31 1
__Lbank12 0 0 BANK12 1
__end_of_SYSTEM_Initialize F3B 0 CODE 0
__Hbank22 0 0 BANK22 1
__Lbank22 0 0 BANK22 1
__Hbank13 0 0 BANK13 1
__end_of_I2C_SlaveSetIsrHandler D13 0 CODE 0
__Lbank13 0 0 BANK13 1
i1_getAdcResults DF1 0 CODE 0
__HbssBANK1 0 0 ABS 0
__LbssBANK1 0 0 ABS 0
__Hbank23 0 0 BANK23 1
__Lbank23 0 0 BANK23 1
_I2C_SlaveSetBusColIntHandler D01 0 CODE 0
__Hbank14 0 0 BANK14 1
__pbssBANK1 A0 0 BANK1 1
__Lbank14 0 0 BANK14 1
__Hbank24 0 0 BANK24 1
__Lbank24 0 0 BANK24 1
_overvoltageThreshold E6 0 BANK1 1
__ptext10 D90 0 CODE 0
__Hbank15 0 0 BANK15 1
__Lbank15 0 0 BANK15 1
__ptext20 D37 0 CODE 0
__Hbank25 0 0 BANK25 1
__Lbank25 0 0 BANK25 1
_lowbattLowerThreshold E8 0 BANK1 1
__ptext11 DE1 0 CODE 0
__ptext30 D1C 0 CODE 0
__Hbank16 0 0 BANK16 1
__Lbank16 0 0 BANK16 1
__ptext21 EF3 0 CODE 0
__ptext40 751 0 CODE 0
__Hbank26 0 0 BANK26 1
__Lbank26 0 0 BANK26 1
__end_of_EPWM3_LoadDutyValue EC4 0 CODE 0
__ptext12 D84 0 CODE 0
__ptext31 CB6 0 CODE 0
__ptext50 E96 0 CODE 0
__Hbank17 0 0 BANK17 1
__Lbank17 0 0 BANK17 1
setAnLeds@adcResult CC 0 BANK1 1
__ptext22 D60 0 CODE 0
__ptext41 CD0 0 CODE 0
__ptext60 3 0 CODE 0
__Hbank27 0 0 BANK27 1
__Lbank27 0 0 BANK27 1
__ptext13 F10 0 CODE 0
__ptext32 CB0 0 CODE 0
__ptext51 E7F 0 CODE 0
__ptext70 D40 0 CODE 0
__Hbank18 0 0 BANK18 1
__Lbank18 0 0 BANK18 1
_ADCON0bits 9D 0 ABS 0
__end_of_EPWM3_Initialize DD1 0 CODE 0
__ptext23 D54 0 CODE 0
__ptext42 E46 0 CODE 0
__ptext61 CAB 0 CODE 0
__Hbank28 0 0 BANK28 1
__HidataBANK1 0 0 ABS 0
__Lbank28 0 0 BANK28 1
__end_of_I2C_SlaveSetBusColIntHandler D0A 0 CODE 0
__LidataBANK1 0 0 ABS 0
__ptext14 C98 0 CODE 0
__ptext33 D13 0 CODE 0
__ptext52 65E 0 CODE 0
__Hbank19 0 0 BANK19 1
__Lbank19 0 0 BANK19 1
_PWM5_LoadDutyValue EC4 0 CODE 0
__pidataBANK1 E58 0 CODE 0
__ptext24 DC3 0 CODE 0
__ptext43 E02 0 CODE 0
__ptext62 C89 0 CODE 0
__Hbank29 0 0 BANK29 1
__Lbank29 0 0 BANK29 1
__ptext15 D78 0 CODE 0
__ptext34 D0A 0 CODE 0
__end_of_setOvervoltageState CF0 0 CODE 0
__ptext53 DF1 0 CODE 0
__ptext25 DB6 0 CODE 0
__ptext44 CC8 0 CODE 0
__ptext63 C86 0 CODE 0
__ptext16 D6C 0 CODE 0
__ptext35 D01 0 CODE 0
__ptext54 C92 0 CODE 0
__end_of_I2C_SlaveEnableIrq C98 0 CODE 0
__ptext26 DA9 0 CODE 0
__ptext45 D4A 0 CODE 0
__ptext64 CA6 0 CODE 0
__ptext17 CD8 0 CODE 0
__ptext36 CF8 0 CODE 0
__ptext55 C8F 0 CODE 0
__ptext27 D2E 0 CODE 0
__ptext46 5D6 0 CODE 0
__ptext65 CA1 0 CODE 0
__ptext18 E24 0 CODE 0
__ptext37 DD1 0 CODE 0
__ptext56 C8C 0 CODE 0
__ptext28 7BF 0 CODE 0
__ptext47 437 0 CODE 0
__ptext66 C9C 0 CODE 0
__end_of_getAdcResults E46 0 CODE 0
__ptext19 E13 0 CODE 0
__ptext38 C95 0 CODE 0
__ptext57 F6F 0 CODE 0
setOvervoltageState@state BD 0 BANK1 1
__size_of_incTimerTickMs 0 0 ABS 0
__ptext29 D25 0 CODE 0
__ptext48 EC4 0 CODE 0
__ptext67 C83 0 CODE 0
__ptext58 FA5 0 CODE 0
_T1GCONbits 19 0 ABS 0
_I2C_SlaveBusColInterruptHandler 40 0 BANK0 1
__ptext49 EAD 0 CODE 0
__ptext68 C80 0 CODE 0
_timer0ReloadVal 4D 0 BANK0 1
_timer1ReloadVal 3C 0 BANK0 1
_INTCONbits B 0 ABS 0
__ptext59 D9C 0 CODE 0
__ptext69 F3B 0 CODE 0
__Hend_init 6D 0 CODE 0
I2C_SlaveSetSlaveAddr@slaveAddr BC 0 BANK1 1
__Lend_init 6B 0 CODE 0
getLowbattLowerThreshold@value BE 0 BANK1 1
__size_of_I2C_SlaveWrColCallBack 0 0 ABS 0
___lldiv@divisor 24 0 BANK0 1
__size_of___lldiv 0 0 ABS 0
_I2C_Initialize D54 0 CODE 0
_ADC_Initialize D2E 0 CODE 0
_WDT_Initialize C98 0 CODE 0
__size_of_ADC_ISR 0 0 ABS 0
__size_of_getTimerTickMs 0 0 ABS 0
__end_of_I2C_SlaveSendTxData CB0 0 CODE 0
__size_of_TMR1_Initialize 0 0 ABS 0
_OSCILLATOR_Initialize D60 0 CODE 0
setAnLeds@adcChannel C4 0 BANK1 1
_I2C_SlaveDefWrInterruptHandler 0 0 ABS 0
__size_of_INTERRUPT_InterruptManager 0 0 ABS 0
__Hreset_vec 2 0 CODE 0
__end_of_ADC_ISR F6F 0 CODE 0
__Lreset_vec 0 0 CODE 0
__size_of_PIN_MANAGER_Initialize 0 0 ABS 0
_PSTR1CON 296 0 ABS 0
_PSTR2CON 29D 0 ABS 0
_PSTR3CON 316 0 ABS 0
__size_of_I2C_SlaveSetAddrIntHandler 0 0 ABS 0
_I2C_SlaveWrColInterruptHandler 3E 0 BANK0 1
_timerTickMs B3 0 BANK1 1
intlevel0 0 0 ENTRY 0
__end_of_TMR0_ISR CD0 0 CODE 0
ADC_ISR@channel 78 0 COMMON 1
intlevel1 0 0 ENTRY 0
intlevel2 0 0 ENTRY 0
__size_of_EPWM3_LoadDutyValue 0 0 ABS 0
intlevel3 0 0 ENTRY 0
__size_of___lmul 0 0 ABS 0
setLowBattLed@delay C8 0 BANK1 1
intlevel4 0 0 ENTRY 0
intlevel5 0 0 ENTRY 0
__size_of_WDT_Initialize 0 0 ABS 0
_getI2cRegister 65E 0 CODE 0
_setI2cRegister 437 0 CODE 0
__end_of_I2C_SlaveSetReadIntHandler D1C 0 CODE 0
__end_of_getLowBattState C8F 0 CODE 0
EPWM1_LoadDutyValue@dutyValue 70 0 COMMON 1
EPWM2_LoadDutyValue@dutyValue 70 0 COMMON 1
EPWM3_LoadDutyValue@dutyValue 70 0 COMMON 1
__size_of_setPowerOnState 0 0 ABS 0
__size_of_I2C_SlaveIsRead 0 0 ABS 0
_TMR0_ISR CC8 0 CODE 0
_TMR1_ISR E46 0 CODE 0
_getOvervoltageThreshold D90 0 CODE 0
_TMR4_ISR CD0 0 CODE 0
__end_of_getTimerTickMs E7F 0 CODE 0
_TMR6_ISR 751 0 CODE 0
getOvervoltageThreshold@value BE 0 BANK1 1
__end_of_setAdcResults D4A 0 CODE 0
I2C_SlaveSetWriteIntHandler@handler BC 0 BANK1 1
_CCPTMRS0bits 29E 0 ABS 0
__HcstackCOMMON 0 0 ABS 0
__size_of_I2C_SlaveIsData 0 0 ABS 0
__LcstackCOMMON 0 0 ABS 0
_setLowBattLed 6E1 0 CODE 0
_CCPTMRS1bits 29F 0 ABS 0
__pcstackCOMMON 70 0 COMMON 1
__end_of_I2C_Initialize D60 0 CODE 0
_adcResults A0 0 BANK1 1
start_initialization 6D 0 CODE 0
___lldiv@quotient 2D 0 BANK0 1
I2C_SlaveSetReadIntHandler@handler BC 0 BANK1 1
_I2C_SlaveDefBusColInterruptHandler 0 0 ABS 0
__size_of_I2C_SlaveSetIsrHandler 0 0 ABS 0
__size_of_showStartupPattern 0 0 ABS 0
_I2C_SlaveWrInterruptHandler 44 0 BANK0 1
_I2C_SlaveIsData C9C 0 CODE 0
__end_of_TMR1_ISR E58 0 CODE 0
__Hmaintext 0 0 ABS 0
__Lmaintext 0 0 ABS 0
__size_of_getLowBattState 0 0 ABS 0
__size_of_setAdcResults 0 0 ABS 0
__pmaintext 531 0 CODE 0
__size_of_ADC_Initialize 0 0 ABS 0
__size_of_OSCILLATOR_Initialize 0 0 ABS 0
_OPTION_REGbits 95 0 ABS 0
_I2C_SlaveSetWrColIntHandler D1C 0 CODE 0
?_getLowbattLowerThreshold BC 0 BANK1 1
I2C_SlaveSetAddrIntHandler@handler BC 0 BANK1 1
__Hinittext 0 0 ABS 0
__end_of_I2C_SlaveSetAddrIntHandler D01 0 CODE 0
__Linittext 0 0 ABS 0
getAdcResults@value C0 0 BANK1 1
setAdcResults@value 70 0 COMMON 1
__initialization 6D 0 CODE 0
__size_of_TMR2_Initialize 0 0 ABS 0
_EPWM1_LoadDutyValue E7F 0 CODE 0
_EPWM2_LoadDutyValue E96 0 CODE 0
_EPWM3_LoadDutyValue EAD 0 CODE 0
__end_of_I2C_SlaveDefWrColInterruptHandler 4 0 CODE 0
___lmul@product 20 0 BANK0 1
__end_of_getI2cRegister 6E1 0 CODE 0
__end_of_getOvervoltageThreshold D9C 0 CODE 0
__end_of_TMR0_Initialize E24 0 CODE 0
_I2C_SlaveRestart C89 0 CODE 0
__end_of_I2C_SlaveReleaseClock C89 0 CODE 0
_setLowBattLed$1953 CD 0 BANK1 1
__end_of_setLowBattState CE8 0 CODE 0
__size_of_EPWM3_Initialize 0 0 ABS 0
___lldiv@dividend 28 0 BANK0 1
%segments
reset_vec 0 3 CODE 0 0
intentry 8 FFF CODE 8 0
cstackCOMMON 70 7D COMMON 70 1
bssBANK1 A0 E9 BANK1 A0 1
cstackBANK0 20 56 BANK0 20 1
text58 1F4A 1FFF CODE 1F4A 0
text57 1EDE 1F49 CODE 1EDE 0
text69 1E76 1EDD CODE 1E76 0
text13 1E20 1E75 CODE 1E20 0
text21 1DE6 1E1F CODE 1DE6 0
text2 1DB6 1DE5 CODE 1DB6 0
text48 1D88 1DB5 CODE 1D88 0
text49 1D5A 1D87 CODE 1D5A 0
text50 1D2C 1D59 CODE 1D2C 0
text51 1CFE 1D2B CODE 1CFE 0
text7 1CD6 1CFD CODE 1CD6 0
idataBANK1 1CB0 1CD5 CODE 1CB0 0
text42 1C8C 1CAF CODE 1C8C 0
text9 1C6A 1C8B CODE 1C6A 0
text18 1C48 1C69 CODE 1C48 0
text19 1C26 1C47 CODE 1C26 0
text43 1C04 1C25 CODE 1C04 0
text53 1BE2 1C03 CODE 1BE2 0
text11 1BC2 1BE1 CODE 1BC2 0
text37 1BA2 1BC1 CODE 1BA2 0
text24 1B86 1BA1 CODE 1B86 0
text25 1B6C 1B85 CODE 1B6C 0
text26 1B52 1B6B CODE 1B52 0
text59 1B38 1B51 CODE 1B38 0
text10 1B20 1B37 CODE 1B20 0
text12 1B08 1B1F CODE 1B08 0
text15 1AF0 1B07 CODE 1AF0 0
text16 1AD8 1AEF CODE 1AD8 0
text22 1AC0 1AD7 CODE 1AC0 0
text23 1AA8 1ABF CODE 1AA8 0
text45 1A94 1AA7 CODE 1A94 0
text70 1A80 1A93 CODE 1A80 0
text20 1A6E 1A7F CODE 1A6E 0
text27 1A5C 1A6D CODE 1A5C 0
text29 1A4A 1A5B CODE 1A4A 0
text30 1A38 1A49 CODE 1A38 0
text33 1A26 1A37 CODE 1A26 0
text34 1A14 1A25 CODE 1A14 0
text35 1A02 1A13 CODE 1A02 0
text36 19F0 1A01 CODE 19F0 0
text3 19E0 19EF CODE 19E0 0
text4 19D0 19DF CODE 19D0 0
text5 19C0 19CF CODE 19C0 0
text17 19B0 19BF CODE 19B0 0
text41 19A0 19AF CODE 19A0 0
text44 1990 199F CODE 1990 0
inittext 1984 198F CODE 1984 0
clrtext 1978 1983 CODE 1978 0
text31 196C 1977 CODE 196C 0
text32 1960 196B CODE 1960 0
text61 1956 195F CODE 1956 0
text64 194C 1955 CODE 194C 0
text65 1942 194B CODE 1942 0
text66 1938 1941 CODE 1938 0
text14 1930 1937 CODE 1930 0
text38 192A 192F CODE 192A 0
text54 1924 1929 CODE 1924 0
text55 191E 1923 CODE 191E 0
text56 1918 191D CODE 1918 0
text62 1912 1917 CODE 1912 0
text63 190C 1911 CODE 190C 0
text67 1906 190B CODE 1906 0
text68 1900 1905 CODE 1900 0
text60 6 7 CODE 6 0
%locals
dist/default/production\EDU-BIT.X.production.o
C:\Users\waiwe\AppData\Local\Temp\sehc.s
6766 6D 0 CODE 0
6769 6D 0 CODE 0
6894 6D 0 CODE 0
6895 70 0 CODE 0
6896 71 0 CODE 0
6897 74 0 CODE 0
6901 75 0 CODE 0
6902 76 0 CODE 0
6903 77 0 CODE 0
6904 78 0 CODE 0
6905 79 0 CODE 0
6906 7A 0 CODE 0
6907 7B 0 CODE 0
6908 7C 0 CODE 0
6909 7D 0 CODE 0
6910 7E 0 CODE 0
6927 81 0 CODE 0
6928 82 0 CODE 0
6929 83 0 CODE 0
6930 84 0 CODE 0
6931 85 0 CODE 0
6932 86 0 CODE 0
6936 89 0 CODE 0
6937 8A 0 CODE 0
6938 8B 0 CODE 0
6939 8C 0 CODE 0
6940 8D 0 CODE 0
6941 8E 0 CODE 0
6947 91 0 CODE 0
6949 91 0 CODE 0
6950 92 0 CODE 0
6951 93 0 CODE 0
6883 CC2 0 CODE 0
6884 CC2 0 CODE 0
6885 CC3 0 CODE 0
6886 CC3 0 CODE 0
6887 CC4 0 CODE 0
6888 CC5 0 CODE 0
6889 CC6 0 CODE 0
6890 CC7 0 CODE 0
6916 CBC 0 CODE 0
6917 CBC 0 CODE 0
6918 CBD 0 CODE 0
6919 CBD 0 CODE 0
6920 CBE 0 CODE 0
6921 CBF 0 CODE 0
6922 CC0 0 CODE 0
6923 CC1 0 CODE 0
main.c
28 531 0 CODE 0
31 531 0 CODE 0
34 534 0 CODE 0
37 537 0 CODE 0
40 538 0 CODE 0
43 539 0 CODE 0
47 53B 0 CODE 0
49 53C 0 CODE 0
52 53C 0 CODE 0
55 53D 0 CODE 0
58 546 0 CODE 0
59 54F 0 CODE 0
60 551 0 CODE 0
63 554 0 CODE 0
64 556 0 CODE 0
65 55A 0 CODE 0
66 55E 0 CODE 0
67 562 0 CODE 0
72 563 0 CODE 0
75 567 0 CODE 0
77 56D 0 CODE 0
78 576 0 CODE 0
82 577 0 CODE 0
83 57B 0 CODE 0
84 57F 0 CODE 0
89 583 0 CODE 0
90 591 0 CODE 0
91 593 0 CODE 0
92 594 0 CODE 0
93 5A2 0 CODE 0
96 5A3 0 CODE 0
99 5A7 0 CODE 0
104 5AC 0 CODE 0
105 5BA 0 CODE 0
106 5BC 0 CODE 0
107 5C0 0 CODE 0
108 5C1 0 CODE 0
109 5C1 0 CODE 0
110 5C3 0 CODE 0
115 5C7 0 CODE 0
116 5CD 0 CODE 0
119 5D0 0 CODE 0
led.c
84 95 0 CODE 0
87 95 0 CODE 0
88 97 0 CODE 0
89 98 0 CODE 0
90 99 0 CODE 0
91 9A 0 CODE 0
92 9B 0 CODE 0
93 9C 0 CODE 0
95 9D 0 CODE 0
96 9E 0 CODE 0
97 9F 0 CODE 0
98 A0 0 CODE 0
99 A1 0 CODE 0
100 A2 0 CODE 0
101 A3 0 CODE 0
103 A4 0 CODE 0
104 A5 0 CODE 0
105 A6 0 CODE 0
106 A7 0 CODE 0
107 A8 0 CODE 0
108 A9 0 CODE 0
109 AA 0 CODE 0
113 AB 0 CODE 0
114 B7 0 CODE 0
115 B8 0 CODE 0
114 B9 0 CODE 0
120 D7 0 CODE 0
122 DA 0 CODE 0
123 E6 0 CODE 0
124 E7 0 CODE 0
123 E8 0 CODE 0
128 106 0 CODE 0
129 116 0 CODE 0
130 126 0 CODE 0
131 136 0 CODE 0
132 146 0 CODE 0
133 156 0 CODE 0
134 166 0 CODE 0
136 176 0 CODE 0
137 186 0 CODE 0
138 196 0 CODE 0
139 1A6 0 CODE 0
140 1B6 0 CODE 0
141 1C6 0 CODE 0
142 1D6 0 CODE 0
144 1E6 0 CODE 0
145 1F6 0 CODE 0
146 206 0 CODE 0
147 216 0 CODE 0
148 226 0 CODE 0
149 236 0 CODE 0
150 246 0 CODE 0
153 256 0 CODE 0
154 262 0 CODE 0
155 263 0 CODE 0
154 264 0 CODE 0
158 282 0 CODE 0
159 294 0 CODE 0
160 2A6 0 CODE 0
161 2B8 0 CODE 0
162 2CA 0 CODE 0
163 2DC 0 CODE 0
164 2EE 0 CODE 0
167 300 0 CODE 0
168 30C 0 CODE 0
169 30D 0 CODE 0
168 30E 0 CODE 0
171 32C 0 CODE 0
40 EDB 0 CODE 0
42 EDB 0 CODE 0
44 EDD 0 CODE 0
45 EDE 0 CODE 0
46 EDF 0 CODE 0
47 EE0 0 CODE 0
48 EE1 0 CODE 0
49 EE2 0 CODE 0
50 EE3 0 CODE 0
52 EE4 0 CODE 0
53 EE5 0 CODE 0
54 EE6 0 CODE 0
55 EE7 0 CODE 0
56 EE8 0 CODE 0
57 EE9 0 CODE 0
58 EEA 0 CODE 0
60 EEB 0 CODE 0
61 EEC 0 CODE 0
62 EED 0 CODE 0
63 EEE 0 CODE 0
64 EEF 0 CODE 0
65 EF0 0 CODE 0
66 EF1 0 CODE 0
67 EF2 0 CODE 0
variables.c
63 CF0 0 CODE 0
65 CF2 0 CODE 0
66 CF7 0 CODE 0
87 CE8 0 CODE 0
89 CEA 0 CODE 0
90 CEF 0 CODE 0
75 CE0 0 CODE 0
77 CE2 0 CODE 0
78 CE7 0 CODE 0
led.c
275 6E1 0 CODE 0
279 6E3 0 CODE 0
280 6E8 0 CODE 0
282 701 0 CODE 0
283 70D 0 CODE 0
284 72B 0 CODE 0
285 73B 0 CODE 0
290 745 0 CODE 0
291 745 0 CODE 0
292 747 0 CODE 0
294 750 0 CODE 0
variables.c
239 E6B 0 CODE 0
242 E6B 0 CODE 0
244 E6D 0 CODE 0
247 E75 0 CODE 0
249 E76 0 CODE 0
250 E7E 0 CODE 0
led.c
188 32D 0 CODE 0
191 32F 0 CODE 0
192 338 0 CODE 0
194 342 0 CODE 0
195 34B 0 CODE 0
198 34D 0 CODE 0
199 356 0 CODE 0
202 358 0 CODE 0
203 361 0 CODE 0
206 363 0 CODE 0
207 36C 0 CODE 0
210 36E 0 CODE 0
211 377 0 CODE 0
214 379 0 CODE 0
215 382 0 CODE 0
218 384 0 CODE 0
219 38D 0 CODE 0
225 390 0 CODE 0
226 396 0 CODE 0
227 39D 0 CODE 0
228 3A4 0 CODE 0
229 3AB 0 CODE 0
230 3B2 0 CODE 0
231 3B9 0 CODE 0
232 3C0 0 CODE 0
235 3C1 0 CODE 0
236 3C7 0 CODE 0
237 3CE 0 CODE 0
238 3D5 0 CODE 0
239 3DC 0 CODE 0
240 3E3 0 CODE 0
241 3EA 0 CODE 0
242 3F1 0 CODE 0
245 3F2 0 CODE 0
246 3F8 0 CODE 0
247 3FF 0 CODE 0
248 406 0 CODE 0
249 40D 0 CODE 0
250 414 0 CODE 0
251 41B 0 CODE 0
252 422 0 CODE 0
256 423 0 CODE 0
257 436 0 CODE 0
variables.c
135 E35 0 CODE 0
138 E37 0 CODE 0
140 E38 0 CODE 0
143 E40 0 CODE 0
145 E41 0 CODE 0
146 E45 0 CODE 0
120 D90 0 CODE 0
123 D90 0 CODE 0
125 D92 0 CODE 0
128 D96 0 CODE 0
130 D97 0 CODE 0
131 D9B 0 CODE 0
94 DE1 0 CODE 0
97 DE1 0 CODE 0
99 DE3 0 CODE 0
102 DEB 0 CODE 0
104 DEC 0 CODE 0
105 DF0 0 CODE 0
107 D84 0 CODE 0
110 D84 0 CODE 0
112 D86 0 CODE 0
115 D8A 0 CODE 0
117 D8B 0 CODE 0
118 D8F 0 CODE 0
mcc_generated_files/mcc.c
50 F10 0 CODE 0
53 F10 0 CODE 0
54 F13 0 CODE 0
55 F16 0 CODE 0
56 F19 0 CODE 0
57 F1C 0 CODE 0
58 F1F 0 CODE 0
59 F22 0 CODE 0
60 F25 0 CODE 0
61 F28 0 CODE 0
62 F2B 0 CODE 0
63 F2E 0 CODE 0
64 F31 0 CODE 0
65 F34 0 CODE 0
66 F37 0 CODE 0
67 F3A 0 CODE 0
83 C98 0 CODE 0
86 C98 0 CODE 0
87 C9B 0 CODE 0
mcc_generated_files/tmr6.c
64 D78 0 CODE 0
69 D78 0 CODE 0
72 D7B 0 CODE 0
75 D7C 0 CODE 0
78 D7E 0 CODE 0
81 D80 0 CODE 0
82 D83 0 CODE 0
mcc_generated_files/tmr4.c
64 D6C 0 CODE 0
69 D6C 0 CODE 0
72 D6F 0 CODE 0
75 D70 0 CODE 0
78 D72 0 CODE 0
81 D74 0 CODE 0
82 D77 0 CODE 0
mcc_generated_files/tmr2.c
62 CD8 0 CODE 0
67 CD8 0 CODE 0
70 CDB 0 CODE 0
73 CDC 0 CODE 0
76 CDD 0 CODE 0
77 CDF 0 CODE 0
mcc_generated_files/tmr1.c
63 E24 0 CODE 0
68 E24 0 CODE 0
71 E26 0 CODE 0
74 E28 0 CODE 0
77 E2A 0 CODE 0
80 E2B 0 CODE 0
83 E2F 0 CODE 0
86 E31 0 CODE 0
87 E34 0 CODE 0
mcc_generated_files/tmr0.c
64 E13 0 CODE 0
69 E13 0 CODE 0
72 E18 0 CODE 0
75 E1B 0 CODE 0
78 E21 0 CODE 0
81 E22 0 CODE 0
82 E23 0 CODE 0
mcc_generated_files/pwm5.c
64 D37 0 CODE 0
69 D37 0 CODE 0
72 D3A 0 CODE 0
75 D3B 0 CODE 0
78 D3C 0 CODE 0
80 D3F 0 CODE 0
mcc_generated_files/pin_manager.c
55 EF3 0 CODE 0
60 EF3 0 CODE 0
61 EF5 0 CODE 0
62 EF6 0 CODE 0
63 EF7 0 CODE 0
64 EF8 0 CODE 0
69 EF9 0 CODE 0
70 EFC 0 CODE 0
71 EFE 0 CODE 0
72 EFF 0 CODE 0
73 F01 0 CODE 0
78 F02 0 CODE 0
79 F04 0 CODE 0
80 F05 0 CODE 0
81 F06 0 CODE 0
86 F08 0 CODE 0
87 F0A 0 CODE 0
88 F0B 0 CODE 0
94 F0D 0 CODE 0
101 F0F 0 CODE 0
mcc_generated_files/mcc.c
69 D60 0 CODE 0
72 D60 0 CODE 0
74 D63 0 CODE 0
76 D64 0 CODE 0
80 D66 0 CODE 0
78 D66 0 CODE 0
81 D6B 0 CODE 0
mcc_generated_files/i2c_slave.c
107 D54 0 CODE 0
109 D54 0 CODE 0
110 D57 0 CODE 0
111 D5D 0 CODE 0
112 D5E 0 CODE 0
113 D5F 0 CODE 0
mcc_generated_files/epwm3.c
64 DC3 0 CODE 0
69 DC3 0 CODE 0
72 DC6 0 CODE 0
75 DC7 0 CODE 0
78 DC9 0 CODE 0
81 DCB 0 CODE 0
84 DCC 0 CODE 0
87 DCD 0 CODE 0
88 DD0 0 CODE 0
mcc_generated_files/epwm2.c
64 DB6 0 CODE 0
69 DB6 0 CODE 0
72 DB9 0 CODE 0
75 DBA 0 CODE 0
78 DBC 0 CODE 0
81 DBE 0 CODE 0
84 DBF 0 CODE 0
87 DC0 0 CODE 0
88 DC2 0 CODE 0
mcc_generated_files/epwm1.c
64 DA9 0 CODE 0
69 DA9 0 CODE 0
72 DAC 0 CODE 0
75 DAD 0 CODE 0
78 DAF 0 CODE 0
81 DB1 0 CODE 0
84 DB2 0 CODE 0
87 DB3 0 CODE 0
88 DB5 0 CODE 0
mcc_generated_files/adc.c
68 D2E 0 CODE 0
73 D2E 0 CODE 0
76 D31 0 CODE 0
79 D33 0 CODE 0
82 D34 0 CODE 0
85 D35 0 CODE 0
86 D36 0 CODE 0
mcc_generated_files/i2c_slave.c
115 7BF 0 CODE 0
117 7BF 0 CODE 0
118 7C2 0 CODE 0
119 7C6 0 CODE 0
120 7CA 0 CODE 0
121 7D2 0 CODE 0
122 7DA 0 CODE 0
123 7E2 0 CODE 0
124 7EA 0 CODE 0
125 7F2 0 CODE 0
126 7FA 0 CODE 0
127 7FD 0 CODE 0
246 D25 0 CODE 0
247 D25 0 CODE 0
248 D2D 0 CODE 0
279 D1C 0 CODE 0
280 D1C 0 CODE 0
281 D24 0 CODE 0
336 CB6 0 CODE 0
338 CB8 0 CODE 0
339 CBB 0 CODE 0
331 CB0 0 CODE 0
333 CB2 0 CODE 0
334 CB5 0 CODE 0
229 D13 0 CODE 0
230 D13 0 CODE 0
231 D1B 0 CODE 0
223 D0A 0 CODE 0
225 D0A 0 CODE 0
226 D12 0 CODE 0
295 D01 0 CODE 0
296 D01 0 CODE 0
297 D09 0 CODE 0
263 CF8 0 CODE 0
264 CF8 0 CODE 0
265 D00 0 CODE 0
310 DD1 0 CODE 0
312 DD1 0 CODE 0
314 DD6 0 CODE 0
315 DD8 0 CODE 0
316 DDE 0 CODE 0
317 DDF 0 CODE 0
321 DE0 0 CODE 0
341 C95 0 CODE 0
343 C95 0 CODE 0
344 C97 0 CODE 0
mcc_generated_files/interrupt_manager.c
52 4 0 CODE 0
55 6 0 CODE 0
57 E 0 CODE 0
58 11 0 CODE 0
59 12 0 CODE 0
61 16 0 CODE 0
63 20 0 CODE 0
64 23 0 CODE 0
65 24 0 CODE 0
67 2E 0 CODE 0
68 31 0 CODE 0
69 32 0 CODE 0
71 3C 0 CODE 0
72 41 0 CODE 0
73 42 0 CODE 0
77 4D 0 CODE 0
79 57 0 CODE 0
80 5A 0 CODE 0
81 5B 0 CODE 0
83 65 0 CODE 0
84 68 0 CODE 0
88 69 0 CODE 0
94 69 0 CODE 0
mcc_generated_files/tmr6.c
116 751 0 CODE 0
125 751 0 CODE 0
128 753 0 CODE 0
130 754 0 CODE 0
133 75C 0 CODE 0
134 761 0 CODE 0
137 763 0 CODE 0
140 767 0 CODE 0
141 76A 0 CODE 0
148 76B 0 CODE 0
149 76B 0 CODE 0
151 76D 0 CODE 0
154 775 0 CODE 0
155 77A 0 CODE 0
158 77C 0 CODE 0
161 780 0 CODE 0
162 785 0 CODE 0
169 786 0 CODE 0
170 786 0 CODE 0
172 788 0 CODE 0
175 790 0 CODE 0
176 795 0 CODE 0
179 797 0 CODE 0
182 79B 0 CODE 0
183 7A0 0 CODE 0
190 7A1 0 CODE 0
191 7A1 0 CODE 0
194 7A3 0 CODE 0
197 7A5 0 CODE 0
198 7A7 0 CODE 0
199 7A8 0 CODE 0
200 7BE 0 CODE 0
mcc_generated_files/tmr4.c
116 CD0 0 CODE 0
119 CD0 0 CODE 0
122 CD2 0 CODE 0
123 CD4 0 CODE 0
126 CD5 0 CODE 0
127 CD7 0 CODE 0
mcc_generated_files/tmr1.c
153 E46 0 CODE 0
156 E46 0 CODE 0
157 E48 0 CODE 0
161 E4F 0 CODE 0
162 E51 0 CODE 0
163 E53 0 CODE 0
164 E55 0 CODE 0
165 E57 0 CODE 0
116 E02 0 CODE 0
118 E02 0 CODE 0
121 E07 0 CODE 0
124 E08 0 CODE 0
125 E0A 0 CODE 0
128 E0C 0 CODE 0
129 E0D 0 CODE 0
133 E0E 0 CODE 0
134 E10 0 CODE 0
136 E12 0 CODE 0
mcc_generated_files/tmr0.c
105 CC8 0 CODE 0
109 CC8 0 CODE 0
111 CC9 0 CODE 0
113 CCC 0 CODE 0
116 CCF 0 CODE 0
variables.c
252 D4A 0 CODE 0
254 D4A 0 CODE 0
255 D53 0 CODE 0
mcc_generated_files/i2c_slave.c
159 5D6 0 CODE 0
161 5D6 0 CODE 0
164 5D9 0 CODE 0
166 5E0 0 CODE 0
167 5E8 0 CODE 0
168 5ED 0 CODE 0
170 5EE 0 CODE 0
175 5F4 0 CODE 0
177 5FC 0 CODE 0
178 608 0 CODE 0
179 60F 0 CODE 0
180 614 0 CODE 0
184 615 0 CODE 0
189 61A 0 CODE 0
190 61D 0 CODE 0
195 621 0 CODE 0
197 629 0 CODE 0
198 62F 0 CODE 0
199 633 0 CODE 0
200 637 0 CODE 0
204 638 0 CODE 0
205 63E 0 CODE 0
213 647 0 CODE 0
218 64A 0 CODE 0
219 65A 0 CODE 0
220 65D 0 CODE 0
variables.c
190 437 0 CODE 0
192 439 0 CODE 0
196 440 0 CODE 0
197 44A 0 CODE 0
198 453 0 CODE 0
201 454 0 CODE 0
206 45F 0 CODE 0
211 46A 0 CODE 0
216 475 0 CODE 0
221 4A7 0 CODE 0
226 4DC 0 CODE 0
233 511 0 CODE 0
235 530 0 CODE 0
mcc_generated_files/pwm5.c
82 EC4 0 CODE 0
85 EC4 0 CODE 0
88 ECF 0 CODE 0
89 EDA 0 CODE 0
mcc_generated_files/epwm3.c
90 EAD 0 CODE 0
93 EAD 0 CODE 0
96 EB8 0 CODE 0
97 EC3 0 CODE 0
mcc_generated_files/epwm2.c
90 E96 0 CODE 0
93 E96 0 CODE 0
96 EA1 0 CODE 0
97 EAC 0 CODE 0
mcc_generated_files/epwm1.c
90 E7F 0 CODE 0
93 E7F 0 CODE 0
96 E8A 0 CODE 0
97 E95 0 CODE 0
variables.c
155 65E 0 CODE 0
157 660 0 CODE 0
159 661 0 CODE 0
162 668 0 CODE 0
163 66C 0 CODE 0
166 66D 0 CODE 0
167 6A4 0 CODE 0
170 6A5 0 CODE 0
171 6AC 0 CODE 0
174 6AD 0 CODE 0
175 6B4 0 CODE 0
178 6B5 0 CODE 0
179 6BC 0 CODE 0
182 6BD 0 CODE 0
183 6C5 0 CODE 0
184 6C6 0 CODE 0
187 6DF 0 CODE 0
188 6E0 0 CODE 0
135 DF1 0 CODE 0
138 DF2 0 CODE 0
140 DF4 0 CODE 0
143 DFC 0 CODE 0
145 DFD 0 CODE 0
146 E01 0 CODE 0
58 C92 0 CODE 0
60 C92 0 CODE 0
61 C94 0 CODE 0
82 C8F 0 CODE 0
84 C8F 0 CODE 0
85 C91 0 CODE 0
70 C8C 0 CODE 0
72 C8C 0 CODE 0
73 C8E 0 CODE 0
C:\Program Files\Microchip\xc8\v2.20\pic\sources\c99\common\Umul32.c
15 F6F 0 CODE 0
119 F6F 0 CODE 0
121 F78 0 CODE 0
122 F7C 0 CODE 0
123 F85 0 CODE 0
124 F8C 0 CODE 0
125 F93 0 CODE 0
128 F9B 0 CODE 0
129 FA4 0 CODE 0
C:\Program Files\Microchip\xc8\v2.20\pic\sources\c99\common\__lldiv.c
5 FA5 0 CODE 0
13 FA5 0 CODE 0
14 FAE 0 CODE 0
15 FB6 0 CODE 0
16 FB8 0 CODE 0
17 FB9 0 CODE 0
18 FC0 0 CODE 0
16 FC4 0 CODE 0
21 FC8 0 CODE 0
22 FCF 0 CODE 0
23 FE1 0 CODE 0
24 FE9 0 CODE 0
26 FEA 0 CODE 0
27 FF1 0 CODE 0
29 FF7 0 CODE 0
30 FFF 0 CODE 0
mcc_generated_files/i2c_slave.c
283 D9C 0 CODE 0
285 D9C 0 CODE 0
287 DA3 0 CODE 0
289 DA8 0 CODE 0
291 3 0 CODE 0
292 3 0 CODE 0
391 CAB 0 CODE 0
393 CAC 0 CODE 0
394 CAF 0 CODE 0
376 C89 0 CODE 0
378 C89 0 CODE 0
379 C8B 0 CODE 0
361 C86 0 CODE 0
363 C86 0 CODE 0
364 C88 0 CODE 0
366 CA6 0 CODE 0
368 CA6 0 CODE 0
369 CAA 0 CODE 0
351 CA1 0 CODE 0
353 CA1 0 CODE 0
354 CA5 0 CODE 0
371 C9C 0 CODE 0
373 C9C 0 CODE 0
374 CA0 0 CODE 0
396 C83 0 CODE 0
398 C83 0 CODE 0
399 C85 0 CODE 0
356 C80 0 CODE 0
358 C80 0 CODE 0
359 C82 0 CODE 0
mcc_generated_files/adc.c
144 F3B 0 CODE 0
147 F3B 0 CODE 0
150 F3D 0 CODE 0
151 F44 0 CODE 0
154 F57 0 CODE 0
155 F61 0 CODE 0
157 F62 0 CODE 0
160 F6C 0 CODE 0
161 F6E 0 CODE 0
variables.c
148 D40 0 CODE 0
150 D41 0 CODE 0
151 D49 0 CODE 0
