(footprint "MIC-9.7MM"
	(version 20240108)
	(generator "pcbnew")
	(generator_version "8.0")
	(layer "F.Cu")
	(descr "Microphone - 9.7mm\n\nCreated by: Wai Weng")
	(property "Reference" "REF**"
		(at 0 -2.286 0)
		(unlocked yes)
		(layer "F.Fab")
		(uuid "c87f0762-27ac-4db6-be92-e1699b157201")
		(effects
			(font
				(size 0.6477 0.6477)
				(thickness 0.1143)
			)
		)
	)
	(property "Value" "MIC-9.7MM"
		(at 0 -1.27 0)
		(unlocked yes)
		(layer "F.Fab")
		(uuid "b6ddf525-1884-4507-833c-f2759691bb77")
		(effects
			(font
				(size 0.6477 0.6477)
				(thickness 0.1143)
			)
		)
	)
	(property "Footprint" ""
		(at 0 0 0)
		(layer "F.Fab")
		(hide yes)
		(uuid "2d5bb0c8-ae73-4841-833d-3edf7bfba680")
		(effects
			(font
				(size 1.27 1.27)
				(thickness 0.15)
			)
		)
	)
	(property "Datasheet" ""
		(at 0 0 0)
		(layer "F.Fab")
		(hide yes)
		(uuid "cc4ca7d7-d35b-4671-8292-ee63231f2b90")
		(effects
			(font
				(size 1.27 1.27)
				(thickness 0.15)
			)
		)
	)
	(property "Description" ""
		(at 0 0 0)
		(layer "F.Fab")
		(hide yes)
		(uuid "e803c90d-debe-459b-b1db-5a14b439e815")
		(effects
			(font
				(size 1.27 1.27)
				(thickness 0.15)
			)
		)
	)
	(fp_circle
		(center 0 0)
		(end 4.85 0)
		(stroke
			(width 0.2032)
			(type solid)
		)
		(fill none)
		(layer "F.Fab")
		(uuid "2a53e809-ee57-4a4b-bf99-de19a063ae45")
	)
	(pad "+" thru_hole rect
		(at -1.3 2)
		(size 1.7 1.7)
		(drill 0.8)
		(layers "*.Cu" "*.Mask")
		(remove_unused_layers no)
		(solder_mask_margin 0.0508)
		(thermal_bridge_angle 0)
		(uuid "0ca60845-85f2-4402-bea1-f05e28d58f0f")
	)
	(pad "-" thru_hole circle
		(at 1.3 2)
		(size 1.7 1.7)
		(drill 0.8)
		(layers "*.Cu" "*.Mask")
		(remove_unused_layers no)
		(solder_mask_margin 0.0508)
		(thermal_bridge_angle 0)
		(uuid "77beb997-ca3c-4f66-81ae-1b56137a042c")
	)
)
