(footprint "TP-1.5MM"
	(version 20240108)
	(generator "pcbnew")
	(generator_version "8.0")
	(layer "F.Cu")
	(descr "Test Point - 1.5mm\n\nCreated by: Wai Weng")
	(property "Reference" "REF**"
		(at 0 0 0)
		(layer "F.SilkS")
		(uuid "475c88f3-076d-4ca9-98d8-edee624fe256")
		(effects
			(font
				(size 1.27 1.27)
				(thickness 0.15)
			)
		)
	)
	(property "Value" ""
		(at 0 0 0)
		(layer "F.Fab")
		(uuid "4b7f00af-372e-4524-aea0-fece7fd7df90")
		(effects
			(font
				(size 1.27 1.27)
				(thickness 0.15)
			)
		)
	)
	(property "Footprint" ""
		(at 0 0 0)
		(layer "F.Fab")
		(hide yes)
		(uuid "359922a2-492f-482b-86ea-a0a3820f1026")
		(effects
			(font
				(size 1.27 1.27)
				(thickness 0.15)
			)
		)
	)
	(property "Datasheet" ""
		(at 0 0 0)
		(layer "F.Fab")
		(hide yes)
		(uuid "772f7e78-5243-45cf-a1ba-c13ebbb23124")
		(effects
			(font
				(size 1.27 1.27)
				(thickness 0.15)
			)
		)
	)
	(property "Description" ""
		(at 0 0 0)
		(layer "F.Fab")
		(hide yes)
		(uuid "b00b32e5-d73e-42aa-b7bb-9eaaeffae351")
		(effects
			(font
				(size 1.27 1.27)
				(thickness 0.15)
			)
		)
	)
	(pad "P$1" smd roundrect
		(at 0 0)
		(size 1.5 1.5)
		(layers "F.Cu" "F.Mask")
		(roundrect_rratio 0.5)
		(solder_mask_margin 0.0508)
		(zone_connect 2)
		(thermal_bridge_angle 0)
		(uuid "94805186-1887-45ee-9dd1-a4bf27396b62")
	)
)
