(footprint "LED-1608"
	(version 20240108)
	(generator "pcbnew")
	(generator_version "8.0")
	(layer "F.Cu")
	(descr "SMD LED\nSize: 1.6 x 0.8mm\n\nSame with size 0603 in inches.\n\nCreated by: OoiBP")
	(property "Reference" "REF**"
		(at 0 -1.778 0)
		(unlocked yes)
		(layer "F.Fab")
		(uuid "e9ed84c7-7751-4879-8daf-6956c3a86585")
		(effects
			(font
				(size 0.6477 0.6477)
				(thickness 0.1143)
			)
			(justify bottom)
		)
	)
	(property "Value" "LED-1608"
		(at 0 -0.762 0)
		(unlocked yes)
		(layer "F.Fab")
		(uuid "3f8a0082-b78e-4231-8ae2-da1dec72f619")
		(effects
			(font
				(size 0.6477 0.6477)
				(thickness 0.1143)
			)
			(justify right top)
		)
	)
	(property "Footprint" ""
		(at 0 0 0)
		(layer "F.Fab")
		(hide yes)
		(uuid "752b7a1b-dc29-44a8-9645-379d5e8db489")
		(effects
			(font
				(size 1.27 1.27)
				(thickness 0.15)
			)
		)
	)
	(property "Datasheet" ""
		(at 0 0 0)
		(layer "F.Fab")
		(hide yes)
		(uuid "5b1c5d01-10fb-4500-8f4b-86aa3f058eb9")
		(effects
			(font
				(size 1.27 1.27)
				(thickness 0.15)
			)
		)
	)
	(property "Description" ""
		(at 0 0 0)
		(layer "F.Fab")
		(hide yes)
		(uuid "3da4d229-c2c2-42a9-8bdd-93c7f4c45462")
		(effects
			(font
				(size 1.27 1.27)
				(thickness 0.15)
			)
		)
	)
	(fp_line
		(start -0.8 -0.4)
		(end -0.8 0.4)
		(stroke
			(width 0.2032)
			(type solid)
		)
		(layer "F.Fab")
		(uuid "9b029667-1da3-4ed6-b9a4-849f3b8b2d0a")
	)
	(fp_line
		(start -0.8 0.4)
		(end 0.8 0.4)
		(stroke
			(width 0.2032)
			(type solid)
		)
		(layer "F.Fab")
		(uuid "a9710376-f121-4dc2-9a4b-86eec8169b78")
	)
	(fp_line
		(start 0.8 -0.4)
		(end -0.8 -0.4)
		(stroke
			(width 0.2032)
			(type solid)
		)
		(layer "F.Fab")
		(uuid "704a12f6-637e-4c5a-83e5-f9b512ebfedc")
	)
	(fp_line
		(start 0.8 0.4)
		(end 0.8 -0.4)
		(stroke
			(width 0.2032)
			(type solid)
		)
		(layer "F.Fab")
		(uuid "ba846532-5dfb-4206-86b4-dc6257f26100")
	)
	(fp_poly
		(pts
			(xy -0.8 0.4) (xy -0.6 0.4) (xy -0.6 -0.4) (xy -0.8 -0.4)
		)
		(stroke
			(width 0)
			(type default)
		)
		(fill solid)
		(layer "F.Fab")
		(uuid "74900070-a5e3-4a5c-8d8d-f72bc5eacea4")
	)
	(fp_poly
		(pts
			(xy 0.6 0.4) (xy 0.8 0.4) (xy 0.8 -0.4) (xy 0.6 -0.4)
		)
		(stroke
			(width 0)
			(type default)
		)
		(fill solid)
		(layer "F.Fab")
		(uuid "383b1dff-1dc1-439b-9129-af5f72513966")
	)
	(pad "A" smd roundrect
		(at -0.9 0)
		(size 0.8 1)
		(layers "F.Cu" "F.Paste" "F.Mask")
		(roundrect_rratio 0.25)
		(solder_mask_margin 0.0508)
		(thermal_bridge_angle 0)
		(uuid "a703d258-228f-4218-8626-3740bba4d104")
	)
	(pad "C" smd roundrect
		(at 0.9 0)
		(size 0.8 1)
		(layers "F.Cu" "F.Paste" "F.Mask")
		(roundrect_rratio 0.25)
		(solder_mask_margin 0.0508)
		(thermal_bridge_angle 0)
		(uuid "df51a519-e509-44c0-a9d2-deb51c367fbf")
	)
)
