(footprint "ECAP-CHEMICON-F"
	(version 20240108)
	(generator "pcbnew")
	(generator_version "8.0")
	(layer "F.Cu")
	(descr "SMD Aluminium Electrolytic Capacitor\nSize: 6.6 x 6.6mm\n\nRelated Cap Value:\n16V: 100, 150, 220uF\n25V: 47, 56, 100uF\n35V: 33, 100uF\n50V: 22, 33, 47uF")
	(property "Reference" "REF**"
		(at 0 -1 0)
		(unlocked yes)
		(layer "F.Fab")
		(uuid "57e2bbd1-c304-4d88-977d-94c427d0a1ff")
		(effects
			(font
				(size 0.6477 0.6477)
				(thickness 0.1143)
			)
			(justify bottom)
		)
	)
	(property "Value" "ECAP-CHEMICON-F"
		(at 0 1 0)
		(unlocked yes)
		(layer "F.Fab")
		(uuid "fc8a4d8f-8a3b-40e3-9436-9c2202e336ae")
		(effects
			(font
				(size 0.6477 0.6477)
				(thickness 0.1143)
			)
			(justify top)
		)
	)
	(property "Footprint" ""
		(at 0 0 0)
		(layer "F.Fab")
		(hide yes)
		(uuid "f50f18e4-9b8c-4886-8463-5afc64eb00bc")
		(effects
			(font
				(size 1.27 1.27)
				(thickness 0.15)
			)
		)
	)
	(property "Datasheet" ""
		(at 0 0 0)
		(layer "F.Fab")
		(hide yes)
		(uuid "eb55b8e2-c0c0-4a17-95bb-b802af60f158")
		(effects
			(font
				(size 1.27 1.27)
				(thickness 0.15)
			)
		)
	)
	(property "Description" ""
		(at 0 0 0)
		(layer "F.Fab")
		(hide yes)
		(uuid "8ff85025-9c30-4168-aa56-57d1bccd869a")
		(effects
			(font
				(size 1.27 1.27)
				(thickness 0.15)
			)
		)
	)
	(fp_line
		(start -3.3 -3.3)
		(end -3.3 3.3)
		(stroke
			(width 0.2032)
			(type solid)
		)
		(layer "F.Fab")
		(uuid "9a22b025-b6aa-4670-aaa9-37624b13c1d9")
	)
	(fp_line
		(start -3.3 3.3)
		(end 2.2 3.3)
		(stroke
			(width 0.2032)
			(type solid)
		)
		(layer "F.Fab")
		(uuid "2819ac89-cc7f-4777-a0ab-79ed0d0a4bbc")
	)
	(fp_line
		(start 2.2 -3.3)
		(end -3.3 -3.3)
		(stroke
			(width 0.2032)
			(type solid)
		)
		(layer "F.Fab")
		(uuid "df7c697f-34c5-4728-bb72-bb0952acd93b")
	)
	(fp_line
		(start 2.2 3.3)
		(end 3.3 2.2)
		(stroke
			(width 0.2032)
			(type solid)
		)
		(layer "F.Fab")
		(uuid "fa68700b-cfc0-40a2-a4f4-585b3fef7d0a")
	)
	(fp_line
		(start 3.3 -2.2)
		(end 2.2 -3.3)
		(stroke
			(width 0.2032)
			(type solid)
		)
		(layer "F.Fab")
		(uuid "d2cfdb2f-bd8a-4859-b063-570248828e94")
	)
	(fp_line
		(start 3.3 2.2)
		(end 3.3 -2.2)
		(stroke
			(width 0.2032)
			(type solid)
		)
		(layer "F.Fab")
		(uuid "55db00d1-1e5e-4599-becf-ae86f9c757db")
	)
	(fp_circle
		(center 0 0)
		(end 3.3 0)
		(stroke
			(width 0.2032)
			(type solid)
		)
		(fill none)
		(layer "F.Fab")
		(uuid "4f20bdd3-8544-4dda-ba8d-d962878325b3")
	)
	(fp_poly
		(pts
			(xy -3.7 0.4) (xy -0.95 0.4) (xy -0.95 -0.4) (xy -3.7 -0.4)
		)
		(stroke
			(width 0)
			(type default)
		)
		(fill solid)
		(layer "F.Fab")
		(uuid "f33d55dd-a2a9-4fb4-8005-79245c73dda3")
	)
	(fp_poly
		(pts
			(xy 0.95 0.4) (xy 3.7 0.4) (xy 3.7 -0.4) (xy 0.95 -0.4)
		)
		(stroke
			(width 0)
			(type default)
		)
		(fill solid)
		(layer "F.Fab")
		(uuid "ef5ec89a-6c8e-4c5d-8191-f5b3bf3c2ba9")
	)
	(pad "+" smd roundrect
		(at 2.4 0)
		(size 3.2 1.3)
		(layers "F.Cu" "F.Paste" "F.Mask")
		(roundrect_rratio 0.25)
		(solder_mask_margin 0.0508)
		(thermal_bridge_angle 0)
		(uuid "6c97bbfe-4a83-4499-bb18-1626f804cf24")
	)
	(pad "-" smd roundrect
		(at -2.4 0)
		(size 3.2 1.3)
		(layers "F.Cu" "F.Paste" "F.Mask")
		(roundrect_rratio 0.25)
		(solder_mask_margin 0.0508)
		(thermal_bridge_angle 0)
		(uuid "f4d01757-8954-4aa5-97cf-ad594bf82fe7")
	)
)
