(footprint "3216"
	(version 20240108)
	(generator "pcbnew")
	(generator_version "8.0")
	(layer "F.Cu")
	(descr "SMD resistor, capacitor and other devices.\nSize: 3.2 x 1.6mm\n\nSame with size 1206 in inches.\n\nCreated by: Wai Weng")
	(property "Reference" "REF**"
		(at 0 -1.331 0)
		(unlocked yes)
		(layer "F.Fab")
		(uuid "58534986-7e48-4382-850c-82e316ca80a3")
		(effects
			(font
				(size 0.6477 0.6477)
				(thickness 0.1143)
			)
			(justify bottom)
		)
	)
	(property "Value" "3216"
		(at 0 1.331 0)
		(unlocked yes)
		(layer "F.Fab")
		(uuid "6acff28a-e7b9-4f9f-9747-e9e8d9fb0880")
		(effects
			(font
				(size 0.6477 0.6477)
				(thickness 0.1143)
			)
			(justify top)
		)
	)
	(property "Footprint" ""
		(at 0 0 0)
		(layer "F.Fab")
		(hide yes)
		(uuid "b41775c3-945a-4ad0-9851-7024bd9df3a2")
		(effects
			(font
				(size 1.27 1.27)
				(thickness 0.15)
			)
		)
	)
	(property "Datasheet" ""
		(at 0 0 0)
		(layer "F.Fab")
		(hide yes)
		(uuid "d5e053ec-49ce-4c51-b0ba-65cd4bc9d078")
		(effects
			(font
				(size 1.27 1.27)
				(thickness 0.15)
			)
		)
	)
	(property "Description" ""
		(at 0 0 0)
		(layer "F.Fab")
		(hide yes)
		(uuid "0db6516d-84b5-4558-bc70-8799599076d4")
		(effects
			(font
				(size 1.27 1.27)
				(thickness 0.15)
			)
		)
	)
	(fp_line
		(start -1.6 -0.8)
		(end -1.6 0.8)
		(stroke
			(width 0.2032)
			(type solid)
		)
		(layer "F.Fab")
		(uuid "5ba23c48-25d1-4618-82f7-4c85b7c3c8b5")
	)
	(fp_line
		(start -1.6 0.8)
		(end 1.6 0.8)
		(stroke
			(width 0.2032)
			(type solid)
		)
		(layer "F.Fab")
		(uuid "3d3b2302-febd-488c-9efe-acd490300856")
	)
	(fp_line
		(start 1.6 -0.8)
		(end -1.6 -0.8)
		(stroke
			(width 0.2032)
			(type solid)
		)
		(layer "F.Fab")
		(uuid "beec88ff-39ab-4138-8ea2-aad4c504e409")
	)
	(fp_line
		(start 1.6 0.8)
		(end 1.6 -0.8)
		(stroke
			(width 0.2032)
			(type solid)
		)
		(layer "F.Fab")
		(uuid "f3fe3b03-0c0f-4a6f-894b-da71c15ffd7f")
	)
	(fp_poly
		(pts
			(xy -1.6 0.8) (xy -1.1 0.8) (xy -1.1 -0.8) (xy -1.6 -0.8)
		)
		(stroke
			(width 0)
			(type default)
		)
		(fill solid)
		(layer "F.Fab")
		(uuid "7050aaf7-c1d3-43c4-8b20-f362ca71e9aa")
	)
	(fp_poly
		(pts
			(xy 1.1 0.8) (xy 1.6 0.8) (xy 1.6 -0.8) (xy 1.1 -0.8)
		)
		(stroke
			(width 0)
			(type default)
		)
		(fill solid)
		(layer "F.Fab")
		(uuid "aa2b26bb-59f8-405b-ae61-0f7fd1c01858")
	)
	(pad "1" smd roundrect
		(at -1.6 0)
		(size 1.3 2)
		(layers "F.Cu" "F.Paste" "F.Mask")
		(roundrect_rratio 0.15)
		(solder_mask_margin 0.0508)
		(thermal_bridge_angle 0)
		(uuid "b943737b-5bb5-44c0-864c-d1fa884f8985")
	)
	(pad "2" smd roundrect
		(at 1.6 0)
		(size 1.3 2)
		(layers "F.Cu" "F.Paste" "F.Mask")
		(roundrect_rratio 0.15)
		(solder_mask_margin 0.0508)
		(thermal_bridge_angle 0)
		(uuid "396b4378-b82a-4272-818c-0f89a57dcf31")
	)
)
