(footprint "LED-5050-WS2812B"
	(version 20240108)
	(generator "pcbnew")
	(generator_version "8.0")
	(layer "F.Cu")
	(descr "SMD RGB LED (Addressable)\nSize: 5.0x 5.0mm\n\n* Need to check the orientation.")
	(property "Reference" "REF**"
		(at -1.778 -2.794 0)
		(unlocked yes)
		(layer "F.Fab")
		(uuid "15eb3026-0d86-463a-bb23-ee3a0f2f1508")
		(effects
			(font
				(size 0.6477 0.6477)
				(thickness 0.1143)
			)
			(justify left bottom)
		)
	)
	(property "Value" "LED-5050-WS2812B"
		(at -1.905 3.556 0)
		(unlocked yes)
		(layer "F.Fab")
		(uuid "1e7d84cc-296e-48ef-a72c-4fb1052b0cb5")
		(effects
			(font
				(size 0.6477 0.6477)
				(thickness 0.1143)
			)
			(justify left bottom)
		)
	)
	(property "Footprint" ""
		(at 0 0 0)
		(layer "F.Fab")
		(hide yes)
		(uuid "f28e1586-de9c-462b-8032-52bd2d0d4c08")
		(effects
			(font
				(size 1.27 1.27)
				(thickness 0.15)
			)
		)
	)
	(property "Datasheet" ""
		(at 0 0 0)
		(layer "F.Fab")
		(hide yes)
		(uuid "0ead7583-03b6-4e9d-a10a-07411ba73191")
		(effects
			(font
				(size 1.27 1.27)
				(thickness 0.15)
			)
		)
	)
	(property "Description" ""
		(at 0 0 0)
		(layer "F.Fab")
		(hide yes)
		(uuid "71089744-6b79-41f8-9548-d10ce7a27500")
		(effects
			(font
				(size 1.27 1.27)
				(thickness 0.15)
			)
		)
	)
	(fp_line
		(start -2.5 -2.5)
		(end 2.5 -2.5)
		(stroke
			(width 0.2032)
			(type solid)
		)
		(layer "F.Fab")
		(uuid "a33051fe-3b3c-4526-994b-509f721fd3c2")
	)
	(fp_line
		(start -2.5 -0.85)
		(end -2.5 0.85)
		(stroke
			(width 0.2032)
			(type solid)
		)
		(layer "F.Fab")
		(uuid "2acae668-f5f0-4f63-85f1-6003d989f9a5")
	)
	(fp_line
		(start -2.5 2.5)
		(end 2 2.5)
		(stroke
			(width 0.2032)
			(type solid)
		)
		(layer "F.Fab")
		(uuid "057308ef-fd7e-4f19-9ca1-a1a75d2575b4")
	)
	(fp_line
		(start 2 2.5)
		(end 2.39 2.3)
		(stroke
			(width 0.2032)
			(type solid)
		)
		(layer "F.Fab")
		(uuid "b50af143-0918-4e24-96d5-88ef81226279")
	)
	(fp_line
		(start 2.5 -0.85)
		(end 2.5 0.85)
		(stroke
			(width 0.2032)
			(type solid)
		)
		(layer "F.Fab")
		(uuid "f813b640-d027-4bd3-b540-77b3cd7d88bd")
	)
	(fp_text user "."
		(at -2.921 -0.635 0)
		(unlocked yes)
		(layer "F.Fab")
		(uuid "1ea6e059-585e-4279-a1de-4fa307e5aca6")
		(effects
			(font
				(size 0.6477 0.6477)
				(thickness 0.1143)
			)
			(justify left bottom)
		)
	)
	(pad "1" smd rect
		(at -2.35 -1.6)
		(size 1.3 1)
		(layers "F.Cu" "F.Paste" "F.Mask")
		(solder_mask_margin 0.0508)
		(thermal_bridge_angle 0)
		(uuid "ff917bf1-38ad-4fae-931e-29bb1794e3bb")
	)
	(pad "2" smd rect
		(at -2.35 1.6)
		(size 1.3 1)
		(layers "F.Cu" "F.Paste" "F.Mask")
		(solder_mask_margin 0.0508)
		(thermal_bridge_angle 0)
		(uuid "5bfdb194-58e5-43f0-9387-82c3c8b3e04b")
	)
	(pad "3" smd rect
		(at 2.35 1.6)
		(size 1.3 1)
		(layers "F.Cu" "F.Paste" "F.Mask")
		(solder_mask_margin 0.0508)
		(thermal_bridge_angle 0)
		(uuid "650a52eb-94d7-4b52-8c29-7edc1efd6af6")
	)
	(pad "4" smd rect
		(at 2.35 -1.6)
		(size 1.3 1)
		(layers "F.Cu" "F.Paste" "F.Mask")
		(solder_mask_margin 0.0508)
		(thermal_bridge_angle 0)
		(uuid "d644c695-527e-4f01-aa54-deb85142719f")
	)
)
