%
M48
M72
T01C0.01575
T02C0.02756
T03C0.02953
T04C0.03000
T05C0.03150
T06C0.03543
T07C0.03937
T08C0.04000
T09C0.04134
T10C0.04331
T11C0.05512
T12C0.05906
T13C0.07087
T14C0.11811
%
T01
X12811Y28811
X42811Y28811
X72811Y28811
X102811Y28811
X132811Y28811
X162811Y28811
X192811Y28811
X222811Y28811
X252811Y28811
X282811Y28811
X312811Y28811
X342811Y28811
X372811Y28811
X402811Y28811
X432811Y28811
X462811Y28811
X492811Y28811
X522811Y28811
X552811Y28811
X582811Y28811
X612811Y28811
X582811Y63811
X586811Y99311
X592811Y118811
X577811Y118811
X572811Y133811
X552811Y138811
X527811Y138811
X517811Y183811
X514811Y219811
X529311Y225311
X522811Y245811
X514811Y250311
X502811Y250311
X508811Y262811
X518811Y280811
X513811Y285811
X508811Y291811
X506811Y300311
X506811Y311311
X528311Y285811
X532811Y263311
X561311Y257311
X566311Y257311
X575811Y252811
X578811Y236811
X570811Y236811
X553811Y222811
X586811Y213311
X617311Y214811
X607811Y183811
X586811Y183811
X557811Y183811
X612811Y138811
X496811Y237811
X488811Y237811
X480811Y237811
X474811Y246311
X463311Y252311
X461811Y245311
X461811Y239811
X461811Y226811
X432311Y230311
X424811Y218811
X406811Y213311
X381311Y219311
X372311Y233311
X371811Y238311
X371811Y245311
X390811Y236811
X402311Y257311
X411311Y262811
X394311Y273311
X390311Y285311
X379811Y285311
X370311Y285311
X370311Y300811
X380311Y300811
X385311Y300811
X390311Y300811
X405311Y300811
X416311Y292311
X430311Y300811
X425311Y273811
X425311Y260311
X441811Y250311
X456311Y281811
X475311Y300311
X475311Y319311
X466311Y341811
X464311Y356811
X470311Y364811
X470311Y379811
X470311Y394811
X461811Y392811
X465811Y407311
X470311Y410811
X494311Y399311
X494311Y383811
X494311Y368811
X494311Y352811
X497811Y339311
X519311Y347311
X530811Y347311
X538811Y347311
X538811Y357311
X525311Y357311
X530311Y335311
X543811Y335311
X552811Y342311
X552811Y347311
X552811Y352311
X560311Y349811
X560311Y344811
X560311Y354811
X560311Y359811
X560311Y364811
X560311Y369811
X560311Y374811
X552811Y372311
X552811Y367311
X552811Y362311
X552811Y377311
X544311Y382311
X543811Y407311
X538811Y407311
X532811Y417811
X527811Y407311
X525811Y426811
X520311Y426811
X515811Y430311
X504311Y445311
X531811Y426811
X547811Y435811
X547811Y439811
X552811Y439811
X552811Y435811
X557811Y435811
X557811Y439811
X561311Y407311
X611811Y425311
X509811Y486811
X423811Y423311
X414311Y412811
X418311Y397811
X435811Y389811
X432811Y376811
X444811Y376811
X440311Y352311
X440311Y334811
X402311Y331811
X353311Y322811
X330311Y318811
X321811Y331311
X315811Y333811
X325311Y337811
X302811Y333311
X290311Y328111
X281311Y332311
X277311Y336311
X273177Y332311
X283811Y345811
X276811Y362811
X263811Y360811
X258311Y360811
X260811Y368311
X257311Y371811
X253811Y375311
X236311Y381311
X223811Y369311
X210811Y364311
X189311Y338311
X184311Y338311
X179311Y338311
X164311Y349311
X153311Y330311
X147811Y330311
X142311Y330311
X136811Y330311
X131311Y330311
X125811Y330311
X119311Y330311
X118811Y307311
X125811Y307311
X131311Y307311
X136811Y307311
X142311Y307311
X147811Y307311
X153311Y307311
X164811Y307311
X173311Y303311
X179311Y303311
X184311Y303311
X189311Y303311
X189311Y297311
X199811Y307311
X204811Y307311
X204811Y330311
X199811Y330311
X238311Y299311
X258311Y293811
X263811Y288811
X270311Y282811
X273811Y272311
X286811Y259811
X286811Y253811
X300811Y236811
X308811Y236811
X295811Y219811
X316811Y213311
X334811Y218811
X307811Y186811
X287811Y183811
X247811Y183811
X217811Y186811
X197811Y183811
X226811Y213311
X244311Y218811
X258811Y240811
X251811Y253311
X247311Y259311
X235311Y260811
X214811Y247311
X210811Y236811
X174311Y263311
X143311Y298311
X126311Y252811
X120811Y236811
X132811Y236811
X154811Y218811
X136811Y213311
X127811Y186811
X136811Y183811
X157811Y183811
X107811Y183811
X67811Y183811
X37811Y186811
X17811Y183811
X46811Y213311
X64811Y218811
X42811Y236811
X30811Y236811
X8811Y229811
X6311Y271311
X16811Y273311
X24811Y271311
X22622Y282811
X29533Y294811
X42811Y299311
X55989Y294811
X63100Y282811
X69811Y273311
X86811Y264311
X74811Y247811
X64811Y247811
X56811Y310311
X30311Y318811
X40311Y343811
X6311Y354811
X6311Y376311
X6311Y404311
X7311Y434811
X7311Y442811
X7311Y450811
X25311Y475311
X64811Y474811
X72811Y482811
X88311Y490311
X98311Y484311
X93311Y473811
X99311Y444311
X83311Y430811
X80311Y418811
X98311Y421811
X82811Y405811
X68311Y393311
X82811Y381811
X101811Y355811
X115811Y404811
X145311Y433811
X145311Y448811
X145311Y463811
X145811Y478811
X154811Y486811
X121811Y444811
X51811Y436311
X51811Y428311
X51811Y420311
X35311Y418811
X35311Y422811
X40311Y405811
X40311Y392811
X40311Y387811
X40311Y382811
X200311Y402811
X209311Y401311
X213811Y402811
X226811Y410811
X232811Y400311
X238811Y396311
X265611Y391511
X278811Y389811
X286311Y392811
X289811Y376811
X295311Y376811
X296811Y370811
X320811Y374311
X322811Y389811
X317311Y389811
X317311Y410811
X307811Y437311
X276811Y432811
X273811Y412311
X278811Y408311
X216811Y440311
X208811Y471311
X295311Y485311
X362311Y426811
X354811Y411811
X361811Y406311
X377811Y389811
X377811Y376811
X352811Y296811
X335311Y300811
X330311Y300811
X334311Y274811
X316811Y262811
X339811Y251811
X354811Y251811
X373811Y269311
X285811Y314311
X397811Y186811
X377811Y183811
X337811Y183811
X347811Y138811
X367811Y138811
X393811Y136811
X437811Y138811
X457811Y138811
X467811Y183811
X427811Y183811
X480811Y277811
X489311Y277811
X555811Y292811
X555811Y301811
X555811Y321811
X560311Y330311
X611811Y294311
X618811Y288811
X618811Y267311
X591811Y246811
X457811Y83811
X437811Y83811
X367811Y83811
X349311Y84311
X340811Y84311
X296311Y66811
X290811Y77311
X257811Y83811
X257811Y138811
X277811Y138811
X187811Y138811
X167811Y138811
X149311Y133311
X133811Y122811
X128311Y140311
X97811Y138811
X77811Y138811
X38811Y99811
X57811Y94811
X77811Y83811
X97811Y83811
X133811Y96811
X167811Y83811
X187811Y83811
X33811Y67311
X7811Y93811
X7811Y138811
T02
X302811Y109311
X312811Y99311
X322811Y109311
T03
X487811Y92811
X497811Y92811
X497811Y48811
X487811Y48811
X487811Y136811
X497811Y136811
T04
X318323Y54811
X307299Y54811
X307299Y44811
X318323Y44811
T05
X137929Y69685
X127693Y69685
T06
X14811Y65906
X14811Y77717
T07
X203520Y88811
X212969Y61252
X222811Y61252
X232654Y61252
X242102Y88811
X242811Y343811
X242811Y353811
X242811Y363811
X242811Y373811
X242811Y383811
X257811Y439411
X238311Y451811
X257811Y463811
T08
X581311Y459811
X581311Y469811
X591311Y469811
X591311Y459811
X601311Y459811
X601311Y469811
X601311Y449811
X591311Y449811
X581311Y449811
T09
X107811Y398811
X107811Y388811
X97811Y388811
X87811Y388811
X77811Y388811
X77811Y398811
X87811Y398811
X97811Y398811
T10
X603811Y404811
X603811Y384811
X603811Y334811
X603811Y314811
T11
X505764Y345228
X299858Y345228
T12
X48059Y124811
X24437Y124811
T13
X82811Y393811
X102811Y393811
X353598Y333811
X452024Y333811
T14
X12811Y12811
X12811Y153811
X72811Y153811
X102811Y153811
X162811Y153811
X192811Y153811
X252811Y153811
X282811Y153811
X342811Y153811
X372811Y153811
X432811Y153811
X462811Y153811
X522811Y153811
X552811Y153811
X612811Y153811
X612811Y253811
X612811Y483811
X612811Y12811
X12811Y253811
X12811Y483811
M30
