(footprint "1608"
	(version 20240108)
	(generator "pcbnew")
	(generator_version "8.0")
	(layer "F.Cu")
	(descr "SMD resistor, capacitor and other devices.\nSize: 1.6 x 0.8mm\n\nSame with size 0603 in inches.")
	(property "Reference" "REF**"
		(at 0 -0.762 0)
		(unlocked yes)
		(layer "F.Fab")
		(uuid "5d21e71b-dc0a-4d03-a026-52c9e28dbe1e")
		(effects
			(font
				(size 0.6477 0.6477)
				(thickness 0.1143)
			)
			(justify bottom)
		)
	)
	(property "Value" "1608"
		(at 0 0.762 0)
		(unlocked yes)
		(layer "F.Fab")
		(uuid "6267cc53-66ee-4663-9a9c-5f462d6e66ce")
		(effects
			(font
				(size 0.6477 0.6477)
				(thickness 0.1143)
			)
			(justify top)
		)
	)
	(property "Footprint" ""
		(at 0 0 0)
		(layer "F.Fab")
		(hide yes)
		(uuid "b1802797-ddaf-4b37-887a-1dc53cecf02e")
		(effects
			(font
				(size 1.27 1.27)
				(thickness 0.15)
			)
		)
	)
	(property "Datasheet" ""
		(at 0 0 0)
		(layer "F.Fab")
		(hide yes)
		(uuid "9dc10464-d7b4-4e48-b38c-3b57a9a73dbc")
		(effects
			(font
				(size 1.27 1.27)
				(thickness 0.15)
			)
		)
	)
	(property "Description" ""
		(at 0 0 0)
		(layer "F.Fab")
		(hide yes)
		(uuid "946989c5-4ccc-47c6-b0d0-4876b97866b5")
		(effects
			(font
				(size 1.27 1.27)
				(thickness 0.15)
			)
		)
	)
	(fp_line
		(start -0.432 0.356)
		(end 0.432 0.356)
		(stroke
			(width 0.1524)
			(type solid)
		)
		(layer "F.Fab")
		(uuid "8e66d0ce-1014-4fea-ae5b-b97d09f37261")
	)
	(fp_line
		(start 0.432 -0.356)
		(end -0.432 -0.356)
		(stroke
			(width 0.1524)
			(type solid)
		)
		(layer "F.Fab")
		(uuid "9d63e495-91b5-42f3-9275-c815a564e911")
	)
	(fp_poly
		(pts
			(xy -0.8382 0.4318) (xy -0.4318 0.4318) (xy -0.4318 -0.4318) (xy -0.8382 -0.4318)
		)
		(stroke
			(width 0)
			(type default)
		)
		(fill solid)
		(layer "F.Fab")
		(uuid "43f58277-a539-49fc-babf-7b868585c97c")
	)
	(fp_poly
		(pts
			(xy 0.4318 0.4318) (xy 0.8382 0.4318) (xy 0.8382 -0.4318) (xy 0.4318 -0.4318)
		)
		(stroke
			(width 0)
			(type default)
		)
		(fill solid)
		(layer "F.Fab")
		(uuid "5a16df24-2639-42ec-a245-1c3ec506615f")
	)
	(pad "1" smd roundrect
		(at -0.85 0)
		(size 1 1.1)
		(layers "F.Cu" "F.Paste" "F.Mask")
		(roundrect_rratio 0.375)
		(solder_mask_margin 0.0508)
		(thermal_bridge_angle 0)
		(uuid "1b5d903f-3700-4acb-9a6f-257514700627")
	)
	(pad "2" smd roundrect
		(at 0.85 0)
		(size 1 1.1)
		(layers "F.Cu" "F.Paste" "F.Mask")
		(roundrect_rratio 0.375)
		(solder_mask_margin 0.0508)
		(thermal_bridge_angle 0)
		(uuid "e094bcf4-c2f8-4440-8079-a70c7dda0cf8")
	)
)
