(footprint "TERMINAL-KF127-2P"
	(version 20240108)
	(generator "pcbnew")
	(generator_version "8.0")
	(layer "F.Cu")
	(descr "Screw Terminal Block - 2 Pins")
	(property "Reference" "REF**"
		(at 0 -2.54 0)
		(unlocked yes)
		(layer "F.Fab")
		(uuid "c5d5e104-497f-4823-a0d2-f83ac75d8ebd")
		(effects
			(font
				(size 0.6477 0.6477)
				(thickness 0.1143)
			)
			(justify top)
		)
	)
	(property "Value" ""
		(at 0 0 0)
		(layer "F.Fab")
		(uuid "ea5cdc7b-eb49-4b17-8a90-7fda2b58c6c3")
		(effects
			(font
				(size 1.27 1.27)
				(thickness 0.15)
			)
		)
	)
	(property "Footprint" ""
		(at 0 0 0)
		(layer "F.Fab")
		(hide yes)
		(uuid "fe4b98c0-e02d-4bae-bbd3-e3a94cdabedb")
		(effects
			(font
				(size 1.27 1.27)
				(thickness 0.15)
			)
		)
	)
	(property "Datasheet" ""
		(at 0 0 0)
		(layer "F.Fab")
		(hide yes)
		(uuid "cf39ea61-c509-458e-b0c8-3480e81abaa4")
		(effects
			(font
				(size 1.27 1.27)
				(thickness 0.15)
			)
		)
	)
	(property "Description" ""
		(at 0 0 0)
		(layer "F.Fab")
		(hide yes)
		(uuid "f137681c-ac9f-484f-834d-30a9e249c5b9")
		(effects
			(font
				(size 1.27 1.27)
				(thickness 0.15)
			)
		)
	)
	(fp_line
		(start -5 -4)
		(end 5 -4)
		(stroke
			(width 0.2032)
			(type solid)
		)
		(layer "F.Fab")
		(uuid "1e3c7d2f-b9dd-46df-a00e-deffe608f445")
	)
	(fp_line
		(start -5 4.2)
		(end -5 -4)
		(stroke
			(width 0.2032)
			(type solid)
		)
		(layer "F.Fab")
		(uuid "139f2416-ebf0-4f0d-818e-30d0b400843c")
	)
	(fp_line
		(start -3.81 3.302)
		(end -1.27 3.302)
		(stroke
			(width 0.2032)
			(type solid)
		)
		(layer "F.Fab")
		(uuid "2b01fa41-b020-4430-b305-71e1d71e583d")
	)
	(fp_line
		(start -3.81 4.2)
		(end -5 4.2)
		(stroke
			(width 0.2032)
			(type solid)
		)
		(layer "F.Fab")
		(uuid "822ca335-f858-45d2-a7e9-5ff069b83b34")
	)
	(fp_line
		(start -3.81 4.2)
		(end -3.81 3.302)
		(stroke
			(width 0.2032)
			(type solid)
		)
		(layer "F.Fab")
		(uuid "e308d43d-cf9a-4b24-a3aa-91fcb00ac5c4")
	)
	(fp_line
		(start -1.27 3.302)
		(end -1.27 4.2)
		(stroke
			(width 0.2032)
			(type solid)
		)
		(layer "F.Fab")
		(uuid "ce638941-d295-43e5-98f7-2f2ef25f0404")
	)
	(fp_line
		(start -1.27 4.2)
		(end -3.81 4.2)
		(stroke
			(width 0.2032)
			(type solid)
		)
		(layer "F.Fab")
		(uuid "977bf79c-30a5-4336-9f56-d7ccb7c87860")
	)
	(fp_line
		(start 1.27 3.302)
		(end 3.81 3.302)
		(stroke
			(width 0.2032)
			(type solid)
		)
		(layer "F.Fab")
		(uuid "6b1bf764-f705-40f2-b674-d0fe014045c0")
	)
	(fp_line
		(start 1.27 4.2)
		(end -1.27 4.2)
		(stroke
			(width 0.2032)
			(type solid)
		)
		(layer "F.Fab")
		(uuid "9098682b-7944-4373-a621-8dd4ce7756c2")
	)
	(fp_line
		(start 1.27 4.2)
		(end 1.27 3.302)
		(stroke
			(width 0.2032)
			(type solid)
		)
		(layer "F.Fab")
		(uuid "6904057c-57e6-41ea-86fe-daf73c97c105")
	)
	(fp_line
		(start 3.81 3.302)
		(end 3.81 4.2)
		(stroke
			(width 0.2032)
			(type solid)
		)
		(layer "F.Fab")
		(uuid "1eafa444-b895-4c74-807f-a0f2d78d19a7")
	)
	(fp_line
		(start 3.81 4.2)
		(end 1.27 4.2)
		(stroke
			(width 0.2032)
			(type solid)
		)
		(layer "F.Fab")
		(uuid "61682844-e3f7-486a-b54e-4e0b4b6be35e")
	)
	(fp_line
		(start 5 -4)
		(end 5 4.2)
		(stroke
			(width 0.2032)
			(type solid)
		)
		(layer "F.Fab")
		(uuid "bd98530f-ed35-491b-ac66-ffc3c224f9c6")
	)
	(fp_line
		(start 5 4.2)
		(end 3.81 4.2)
		(stroke
			(width 0.2032)
			(type solid)
		)
		(layer "F.Fab")
		(uuid "85e31e3d-b514-4b02-a063-4e1ce21947f4")
	)
	(fp_text user "${LABEL}"
		(at 0 5.334 0)
		(unlocked yes)
		(layer "F.Fab")
		(uuid "a9a00bbc-1037-4fc2-9285-a0adabaec4bd")
		(effects
			(font
				(size 0.6477 0.6477)
				(thickness 0.1143)
			)
			(justify bottom)
		)
	)
	(pad "1" thru_hole circle
		(at -2.54 0)
		(size 2.5 2.5)
		(drill 1.1)
		(layers "*.Cu" "*.Mask")
		(remove_unused_layers no)
		(solder_mask_margin 0.0508)
		(thermal_bridge_angle 0)
		(uuid "cfcb0687-dd27-4b38-b295-e711b5f97bae")
	)
	(pad "2" thru_hole circle
		(at 2.54 0)
		(size 2.5 2.5)
		(drill 1.1)
		(layers "*.Cu" "*.Mask")
		(remove_unused_layers no)
		(solder_mask_margin 0.0508)
		(thermal_bridge_angle 0)
		(uuid "06dcb64f-606b-47cd-9c04-a750a609ed70")
	)
)
