(footprint "S-BUZZER-HXD-8530A-03627"
	(version 20240108)
	(generator "pcbnew")
	(generator_version "8.0")
	(layer "F.Cu")
	(descr "SMD Piezo Buzzer (Square)\nSize: 8.5mm x 8.5mm\n\nCreated by: Idris")
	(property "Reference" "REF**"
		(at -2.54 -1.27 0)
		(unlocked yes)
		(layer "F.Fab")
		(uuid "1d3172e2-0840-43f9-9dc1-a180b4df5124")
		(effects
			(font
				(size 0.6477 0.6477)
				(thickness 0.1143)
			)
			(justify left bottom)
		)
	)
	(property "Value" ""
		(at 0 0 0)
		(layer "F.Fab")
		(uuid "a2c96db2-2d70-4696-937a-3d57c6d815df")
		(effects
			(font
				(size 1.27 1.27)
				(thickness 0.15)
			)
		)
	)
	(property "Footprint" ""
		(at 0 0 0)
		(layer "F.Fab")
		(hide yes)
		(uuid "91567442-6b3d-45b0-bc36-f6a17b47a540")
		(effects
			(font
				(size 1.27 1.27)
				(thickness 0.15)
			)
		)
	)
	(property "Datasheet" ""
		(at 0 0 0)
		(layer "F.Fab")
		(hide yes)
		(uuid "2577a4e3-1f41-4918-aca0-16a875ea3a76")
		(effects
			(font
				(size 1.27 1.27)
				(thickness 0.15)
			)
		)
	)
	(property "Description" ""
		(at 0 0 0)
		(layer "F.Fab")
		(hide yes)
		(uuid "f0f61073-4c83-48b6-a224-634ad6111d31")
		(effects
			(font
				(size 1.27 1.27)
				(thickness 0.15)
			)
		)
	)
	(fp_line
		(start -4.25 -4.25)
		(end 4.25 -4.25)
		(stroke
			(width 0.2032)
			(type solid)
		)
		(layer "F.Fab")
		(uuid "9013a2a3-5701-408f-bf9b-c63ae0b029a5")
	)
	(fp_line
		(start -4.25 4.25)
		(end -4.25 -4.25)
		(stroke
			(width 0.2032)
			(type solid)
		)
		(layer "F.Fab")
		(uuid "161974b4-4704-4063-8628-7063b849f886")
	)
	(fp_line
		(start 4.25 -4.25)
		(end 4.25 4.25)
		(stroke
			(width 0.2032)
			(type solid)
		)
		(layer "F.Fab")
		(uuid "bba2e3aa-194d-473b-bd39-79d5a39aa0ce")
	)
	(fp_line
		(start 4.25 4.25)
		(end -4.25 4.25)
		(stroke
			(width 0.2032)
			(type solid)
		)
		(layer "F.Fab")
		(uuid "ddee5a38-018b-4755-bcf8-bd9d3e3f2e60")
	)
	(pad "+" smd roundrect
		(at -3.6 3.6 90)
		(size 2 2)
		(layers "F.Cu" "F.Paste" "F.Mask")
		(roundrect_rratio 0.25)
		(solder_mask_margin 0.0508)
		(thermal_bridge_angle 0)
		(uuid "6f9d9b9b-2b42-40ab-91f8-1fb5430b90eb")
	)
	(pad "-" smd roundrect
		(at 3.6 3.6 90)
		(size 2 2)
		(layers "F.Cu" "F.Paste" "F.Mask")
		(roundrect_rratio 0.25)
		(solder_mask_margin 0.0508)
		(thermal_bridge_angle 0)
		(uuid "ffbf4915-7c4c-4f48-9056-ceebfb9780b6")
	)
	(pad "1" smd roundrect
		(at -3.4 -3.4 225)
		(size 2.4 1.5)
		(layers "F.Cu" "F.Paste" "F.Mask")
		(roundrect_rratio 0.25)
		(solder_mask_margin 0.0508)
		(thermal_bridge_angle 0)
		(uuid "bc14b430-7cb1-4129-a44c-2747e0196042")
	)
	(pad "2" smd roundrect
		(at 3.6 -3.6 90)
		(size 2 2)
		(layers "F.Cu" "F.Paste" "F.Mask")
		(roundrect_rratio 0.25)
		(solder_mask_margin 0.0508)
		(thermal_bridge_angle 0)
		(uuid "15e89ebe-672c-40a4-97e6-b556e6bcfeef")
	)
)
