(footprint "GROVE-04-RA"
	(version 20240108)
	(generator "pcbnew")
	(generator_version "8.0")
	(layer "F.Cu")
	(descr "SMD Grove Connector (Right Angle) - 4 Ways\nStandard connector for Seeed Studio Grove System.\n\nCreated by: Wai Weng")
	(property "Reference" "REF**"
		(at 0 0 0)
		(unlocked yes)
		(layer "F.Fab")
		(uuid "99839ba8-0698-4649-925d-86550d01dd7d")
		(effects
			(font
				(size 0.6477 0.6477)
				(thickness 0.1143)
			)
		)
	)
	(property "Value" ""
		(at 0 0 0)
		(layer "F.Fab")
		(uuid "57232ae3-d551-4edd-8737-206b922ec8ef")
		(effects
			(font
				(size 1.27 1.27)
				(thickness 0.15)
			)
		)
	)
	(property "Footprint" ""
		(at 0 0 0)
		(layer "F.Fab")
		(hide yes)
		(uuid "356837e4-9e9c-43f7-8773-37c72f96f60d")
		(effects
			(font
				(size 1.27 1.27)
				(thickness 0.15)
			)
		)
	)
	(property "Datasheet" ""
		(at 0 0 0)
		(layer "F.Fab")
		(hide yes)
		(uuid "921befa1-1a5e-4b69-adfd-2f0a3bcedfd6")
		(effects
			(font
				(size 1.27 1.27)
				(thickness 0.15)
			)
		)
	)
	(property "Description" ""
		(at 0 0 0)
		(layer "F.Fab")
		(hide yes)
		(uuid "814b1b1c-be19-45e1-a6b0-55d7603443f0")
		(effects
			(font
				(size 1.27 1.27)
				(thickness 0.15)
			)
		)
	)
	(fp_line
		(start -5.95 -3.8)
		(end -3.5 -3.8)
		(stroke
			(width 0.2032)
			(type solid)
		)
		(layer "F.Fab")
		(uuid "4fdec82b-412b-4ab0-a530-9670d9d759c1")
	)
	(fp_line
		(start -5.95 5.3)
		(end -5.95 -3.8)
		(stroke
			(width 0.2032)
			(type solid)
		)
		(layer "F.Fab")
		(uuid "b6456be9-7470-4092-880e-c4346cc9daa3")
	)
	(fp_line
		(start -5.25 3.8)
		(end -5.25 5.3)
		(stroke
			(width 0.2032)
			(type solid)
		)
		(layer "F.Fab")
		(uuid "2cac6115-1325-4f1b-8d87-892df68752a4")
	)
	(fp_line
		(start -5.25 5.3)
		(end -5.95 5.3)
		(stroke
			(width 0.2032)
			(type solid)
		)
		(layer "F.Fab")
		(uuid "42505fd1-03c1-4938-bef7-851b5109ab3d")
	)
	(fp_line
		(start -3.5 -3.8)
		(end -3.5 -2.8)
		(stroke
			(width 0.2032)
			(type solid)
		)
		(layer "F.Fab")
		(uuid "c67ab5b9-0578-4ecd-bf3e-baf120bdef68")
	)
	(fp_line
		(start -3.5 -2.8)
		(end 2.5 -2.8)
		(stroke
			(width 0.2032)
			(type solid)
		)
		(layer "F.Fab")
		(uuid "da9631e9-f057-4272-a638-cccf0951c5eb")
	)
	(fp_line
		(start 2.5 -2.8)
		(end 3.3 -2.8)
		(stroke
			(width 0.2032)
			(type solid)
		)
		(layer "F.Fab")
		(uuid "3c9b8791-bbb3-4ce5-ac32-afdee28367af")
	)
	(fp_line
		(start 2.5 -1.4)
		(end 2.5 -2.8)
		(stroke
			(width 0.2032)
			(type solid)
		)
		(layer "F.Fab")
		(uuid "b9cfb454-bc8a-45ce-8701-d48bd8ea9d58")
	)
	(fp_line
		(start 3.3 -2.8)
		(end 3.3 -1.4)
		(stroke
			(width 0.2032)
			(type solid)
		)
		(layer "F.Fab")
		(uuid "619ee637-3607-415c-9c31-6c29c0bd859b")
	)
	(fp_line
		(start 3.3 -2.8)
		(end 3.5 -2.8)
		(stroke
			(width 0.2032)
			(type solid)
		)
		(layer "F.Fab")
		(uuid "cb066085-1691-4603-818a-bfdb8c006f62")
	)
	(fp_line
		(start 3.3 -1.4)
		(end 2.5 -1.4)
		(stroke
			(width 0.2032)
			(type solid)
		)
		(layer "F.Fab")
		(uuid "d73590b1-7ee5-4eb5-aac0-95bea25b5d9f")
	)
	(fp_line
		(start 3.5 -3.8)
		(end 5.95 -3.8)
		(stroke
			(width 0.2032)
			(type solid)
		)
		(layer "F.Fab")
		(uuid "792700da-a4fc-4a3a-a4f0-073b5805bb2d")
	)
	(fp_line
		(start 3.5 -2.8)
		(end 3.5 -3.8)
		(stroke
			(width 0.2032)
			(type solid)
		)
		(layer "F.Fab")
		(uuid "c65bfa6d-d008-4735-8ba8-279227b2938a")
	)
	(fp_line
		(start 5.25 3.8)
		(end -5.25 3.8)
		(stroke
			(width 0.2032)
			(type solid)
		)
		(layer "F.Fab")
		(uuid "935c72dd-f610-4cd4-a5e1-0e2dd65a79c9")
	)
	(fp_line
		(start 5.25 5.3)
		(end 5.25 3.8)
		(stroke
			(width 0.2032)
			(type solid)
		)
		(layer "F.Fab")
		(uuid "dbc16875-4327-49f5-9a8c-e301c2a92531")
	)
	(fp_line
		(start 5.95 -3.8)
		(end 5.95 5.3)
		(stroke
			(width 0.2032)
			(type solid)
		)
		(layer "F.Fab")
		(uuid "8c29e636-2001-45d4-86db-7229a56e7108")
	)
	(fp_line
		(start 5.95 5.3)
		(end 5.25 5.3)
		(stroke
			(width 0.2032)
			(type solid)
		)
		(layer "F.Fab")
		(uuid "71a404f9-9af1-4d36-b1db-7b081def174f")
	)
	(fp_poly
		(pts
			(xy -5.95 -0.8) (xy -4.95 -0.8) (xy -4.95 -3.8) (xy -5.95 -3.8)
		)
		(stroke
			(width 0)
			(type default)
		)
		(fill solid)
		(layer "F.Fab")
		(uuid "3e3fce52-7ba1-4ddb-9c01-247affeadb1b")
	)
	(fp_poly
		(pts
			(xy -3.25 6.3) (xy -2.75 6.3) (xy -2.75 2.2) (xy -3.25 2.2)
		)
		(stroke
			(width 0)
			(type default)
		)
		(fill solid)
		(layer "F.Fab")
		(uuid "0fec0be0-9a41-4aaf-bb70-463cada2bd24")
	)
	(fp_poly
		(pts
			(xy -1.25 6.3) (xy -0.75 6.3) (xy -0.75 2.2) (xy -1.25 2.2)
		)
		(stroke
			(width 0)
			(type default)
		)
		(fill solid)
		(layer "F.Fab")
		(uuid "c7bf3249-6772-4585-a319-538f9955f444")
	)
	(fp_poly
		(pts
			(xy 0.75 6.3) (xy 1.25 6.3) (xy 1.25 2.2) (xy 0.75 2.2)
		)
		(stroke
			(width 0)
			(type default)
		)
		(fill solid)
		(layer "F.Fab")
		(uuid "351d013f-32c5-4d7f-9baa-b8bbdb52a785")
	)
	(fp_poly
		(pts
			(xy 2.75 6.3) (xy 3.25 6.3) (xy 3.25 2.2) (xy 2.75 2.2)
		)
		(stroke
			(width 0)
			(type default)
		)
		(fill solid)
		(layer "F.Fab")
		(uuid "4734bfa2-6bc0-41f7-b5ad-1d1017ba6e12")
	)
	(fp_poly
		(pts
			(xy 4.95 -0.8) (xy 5.95 -0.8) (xy 5.95 -3.8) (xy 4.95 -3.8)
		)
		(stroke
			(width 0)
			(type default)
		)
		(fill solid)
		(layer "F.Fab")
		(uuid "f6024175-a100-48a2-851f-5285f29b51c9")
	)
	(pad "1" smd roundrect
		(at 3 4.5 90)
		(size 4.6 1)
		(layers "F.Cu" "F.Paste" "F.Mask")
		(roundrect_rratio 0.25)
		(solder_mask_margin 0.0508)
		(thermal_bridge_angle 0)
		(uuid "0d8c2fe2-a248-4b7d-bc2b-195dd9896bfb")
	)
	(pad "2" smd roundrect
		(at 1 4.5 90)
		(size 4.6 1)
		(layers "F.Cu" "F.Paste" "F.Mask")
		(roundrect_rratio 0.25)
		(solder_mask_margin 0.0508)
		(thermal_bridge_angle 0)
		(uuid "04701b2b-141f-4946-a703-d5dee85fd9a5")
	)
	(pad "3" smd roundrect
		(at -1 4.5 90)
		(size 4.6 1)
		(layers "F.Cu" "F.Paste" "F.Mask")
		(roundrect_rratio 0.25)
		(solder_mask_margin 0.0508)
		(thermal_bridge_angle 0)
		(uuid "08d9cf87-d941-441a-80c6-b712ea168ca6")
	)
	(pad "4" smd roundrect
		(at -3 4.5 90)
		(size 4.6 1)
		(layers "F.Cu" "F.Paste" "F.Mask")
		(roundrect_rratio 0.25)
		(solder_mask_margin 0.0508)
		(thermal_bridge_angle 0)
		(uuid "134f09fb-00ff-4a50-83f0-8c274bd8aa98")
	)
	(pad "P$1" smd roundrect
		(at -5.55 -2.25 90)
		(size 3.4 1.6)
		(layers "F.Cu" "F.Paste" "F.Mask")
		(roundrect_rratio 0.15)
		(solder_mask_margin 0.0508)
		(thermal_bridge_angle 0)
		(uuid "ae302516-e223-469a-8b34-e4dae7570691")
	)
	(pad "P$2" smd roundrect
		(at 5.55 -2.25 90)
		(size 3.4 1.6)
		(layers "F.Cu" "F.Paste" "F.Mask")
		(roundrect_rratio 0.15)
		(solder_mask_margin 0.0508)
		(thermal_bridge_angle 0)
		(uuid "4c9093ab-fba3-4da9-8cc5-2a6509baecd4")
	)
)
