(footprint "SOIC-16N"
	(version 20240108)
	(generator "pcbnew")
	(generator_version "8.0")
	(layer "F.Cu")
	(descr "Small Outline Integrated Circuit (SOIC)\nNarrow (JEDEC) SOIC Package\n\nSize: 9.90 x 3.90mm / 10.55 x 4.4mm\nLead Pitch: 1.27mm\n\nCreated by: OoiBP")
	(property "Reference" "REF**"
		(at -6.4 2 90)
		(unlocked yes)
		(layer "F.Fab")
		(uuid "efda0a12-c25a-4dc0-9f22-04e97c8905dc")
		(effects
			(font
				(size 0.69088 0.69088)
				(thickness 0.12192)
			)
			(justify left top)
		)
	)
	(property "Value" ""
		(at 0 0 0)
		(layer "F.Fab")
		(uuid "98c1361b-6e31-4b9b-b2c7-276504f6ae9a")
		(effects
			(font
				(size 1.27 1.27)
				(thickness 0.15)
			)
		)
	)
	(property "Footprint" ""
		(at 0 0 0)
		(layer "F.Fab")
		(hide yes)
		(uuid "31391d3e-b72a-4e6b-aa76-fc145a209805")
		(effects
			(font
				(size 1.27 1.27)
				(thickness 0.15)
			)
		)
	)
	(property "Datasheet" ""
		(at 0 0 0)
		(layer "F.Fab")
		(hide yes)
		(uuid "423209d3-119e-4694-b92a-823e1a8d4f1b")
		(effects
			(font
				(size 1.27 1.27)
				(thickness 0.15)
			)
		)
	)
	(property "Description" ""
		(at 0 0 0)
		(layer "F.Fab")
		(hide yes)
		(uuid "720f6eb2-1bbe-4cf7-8346-424d912e16e5")
		(effects
			(font
				(size 1.27 1.27)
				(thickness 0.15)
			)
		)
	)
	(fp_line
		(start -5.275 -2.2)
		(end -5.275 2.2)
		(stroke
			(width 0.2032)
			(type solid)
		)
		(layer "F.Fab")
		(uuid "fed81f71-1aa7-49c9-ad3e-e0e2c890fa09")
	)
	(fp_line
		(start -5.275 2.2)
		(end 5.275 2.2)
		(stroke
			(width 0.2032)
			(type solid)
		)
		(layer "F.Fab")
		(uuid "1f41c3a1-bc4b-45a5-9ab2-d6aef9d6b9b5")
	)
	(fp_line
		(start 5.275 -2.2)
		(end -5.275 -2.2)
		(stroke
			(width 0.2032)
			(type solid)
		)
		(layer "F.Fab")
		(uuid "b067bdaf-b0e5-4f8e-bada-4c1fbae6a755")
	)
	(fp_line
		(start 5.275 2.2)
		(end 5.275 -2.2)
		(stroke
			(width 0.2032)
			(type solid)
		)
		(layer "F.Fab")
		(uuid "25647272-da46-4399-b32d-fba9087d7ee9")
	)
	(fp_circle
		(center -4 1)
		(end -3.4901 1)
		(stroke
			(width 0.2032)
			(type solid)
		)
		(fill none)
		(layer "F.Fab")
		(uuid "0032e459-ba62-4842-9b98-67a5997e395f")
	)
	(fp_poly
		(pts
			(xy -4.65 -2.2) (xy -4.24 -2.2) (xy -4.24 -3.5) (xy -4.65 -3.5)
		)
		(stroke
			(width 0)
			(type default)
		)
		(fill solid)
		(layer "F.Fab")
		(uuid "37fc18c7-b2f8-448a-8669-dc2900854958")
	)
	(fp_poly
		(pts
			(xy -4.65 3.5) (xy -4.24 3.5) (xy -4.24 2.2) (xy -4.65 2.2)
		)
		(stroke
			(width 0)
			(type default)
		)
		(fill solid)
		(layer "F.Fab")
		(uuid "3163352b-294b-4d67-9061-30caa09b6f1e")
	)
	(fp_poly
		(pts
			(xy -3.38 -2.2) (xy -2.97 -2.2) (xy -2.97 -3.5) (xy -3.38 -3.5)
		)
		(stroke
			(width 0)
			(type default)
		)
		(fill solid)
		(layer "F.Fab")
		(uuid "8993ff6c-1bb7-4c1e-a4b5-d75c338e2c67")
	)
	(fp_poly
		(pts
			(xy -3.38 3.5) (xy -2.97 3.5) (xy -2.97 2.2) (xy -3.38 2.2)
		)
		(stroke
			(width 0)
			(type default)
		)
		(fill solid)
		(layer "F.Fab")
		(uuid "63ec1264-0a41-4cd1-8ed3-c75658d32195")
	)
	(fp_poly
		(pts
			(xy -2.11 -2.2) (xy -1.7 -2.2) (xy -1.7 -3.5) (xy -2.11 -3.5)
		)
		(stroke
			(width 0)
			(type default)
		)
		(fill solid)
		(layer "F.Fab")
		(uuid "29cce841-edd3-431c-a9d1-ae80043ea67c")
	)
	(fp_poly
		(pts
			(xy -2.11 3.5) (xy -1.7 3.5) (xy -1.7 2.2) (xy -2.11 2.2)
		)
		(stroke
			(width 0)
			(type default)
		)
		(fill solid)
		(layer "F.Fab")
		(uuid "749611aa-cde5-4556-a4b3-c01bce283948")
	)
	(fp_poly
		(pts
			(xy -0.84 -2.2) (xy -0.43 -2.2) (xy -0.43 -3.5) (xy -0.84 -3.5)
		)
		(stroke
			(width 0)
			(type default)
		)
		(fill solid)
		(layer "F.Fab")
		(uuid "be93cf2b-8382-40e0-8051-8063fa8714de")
	)
	(fp_poly
		(pts
			(xy -0.84 3.5) (xy -0.43 3.5) (xy -0.43 2.2) (xy -0.84 2.2)
		)
		(stroke
			(width 0)
			(type default)
		)
		(fill solid)
		(layer "F.Fab")
		(uuid "13d0788a-410d-45bf-9813-86fa55318004")
	)
	(fp_poly
		(pts
			(xy 0.43 -2.2) (xy 0.84 -2.2) (xy 0.84 -3.5) (xy 0.43 -3.5)
		)
		(stroke
			(width 0)
			(type default)
		)
		(fill solid)
		(layer "F.Fab")
		(uuid "08472926-f181-46ec-9d46-64879eecf081")
	)
	(fp_poly
		(pts
			(xy 0.43 3.5) (xy 0.84 3.5) (xy 0.84 2.2) (xy 0.43 2.2)
		)
		(stroke
			(width 0)
			(type default)
		)
		(fill solid)
		(layer "F.Fab")
		(uuid "c4c63737-59c3-4d58-afd8-9c89af1e882c")
	)
	(fp_poly
		(pts
			(xy 1.7 -2.2) (xy 2.11 -2.2) (xy 2.11 -3.5) (xy 1.7 -3.5)
		)
		(stroke
			(width 0)
			(type default)
		)
		(fill solid)
		(layer "F.Fab")
		(uuid "5fa3f771-b618-4679-a6ef-1246e75ae359")
	)
	(fp_poly
		(pts
			(xy 1.7 3.5) (xy 2.11 3.5) (xy 2.11 2.2) (xy 1.7 2.2)
		)
		(stroke
			(width 0)
			(type default)
		)
		(fill solid)
		(layer "F.Fab")
		(uuid "01ac4571-de60-4d6a-b382-402f9eb312d6")
	)
	(fp_poly
		(pts
			(xy 2.97 -2.2) (xy 3.38 -2.2) (xy 3.38 -3.5) (xy 2.97 -3.5)
		)
		(stroke
			(width 0)
			(type default)
		)
		(fill solid)
		(layer "F.Fab")
		(uuid "5e350a9b-90c7-4a77-83b2-9f7452163296")
	)
	(fp_poly
		(pts
			(xy 2.97 3.5) (xy 3.38 3.5) (xy 3.38 2.2) (xy 2.97 2.2)
		)
		(stroke
			(width 0)
			(type default)
		)
		(fill solid)
		(layer "F.Fab")
		(uuid "e0e2efa7-c7c6-434e-a3f1-e31152d218f5")
	)
	(fp_poly
		(pts
			(xy 4.24 -2.2) (xy 4.65 -2.2) (xy 4.65 -3.5) (xy 4.24 -3.5)
		)
		(stroke
			(width 0)
			(type default)
		)
		(fill solid)
		(layer "F.Fab")
		(uuid "af022e07-6267-40c9-ae2f-42fa81eef5c5")
	)
	(fp_poly
		(pts
			(xy 4.24 3.5) (xy 4.65 3.5) (xy 4.65 2.2) (xy 4.24 2.2)
		)
		(stroke
			(width 0)
			(type default)
		)
		(fill solid)
		(layer "F.Fab")
		(uuid "9ae3c2b3-cd4a-4474-a41d-1c22ba6c59bf")
	)
	(fp_text user "${MPN}"
		(at 6.2 2 90)
		(unlocked yes)
		(layer "F.Fab")
		(uuid "2a8df5cd-246e-45bd-a36f-5efc0547176c")
		(effects
			(font
				(size 0.69088 0.69088)
				(thickness 0.12192)
			)
			(justify left bottom)
		)
	)
	(pad "1" smd roundrect
		(at -4.445 3)
		(size 0.6 1.7)
		(layers "F.Cu" "F.Paste" "F.Mask")
		(roundrect_rratio 0.25)
		(solder_mask_margin 0.0508)
		(thermal_bridge_angle 0)
		(uuid "5df722be-6de7-4091-bc08-32f00b99eb3f")
	)
	(pad "2" smd roundrect
		(at -3.175 3)
		(size 0.6 1.7)
		(layers "F.Cu" "F.Paste" "F.Mask")
		(roundrect_rratio 0.25)
		(solder_mask_margin 0.0508)
		(thermal_bridge_angle 0)
		(uuid "7a092c34-8150-4407-b9d2-2ed71f6e7952")
	)
	(pad "3" smd roundrect
		(at -1.905 3)
		(size 0.6 1.7)
		(layers "F.Cu" "F.Paste" "F.Mask")
		(roundrect_rratio 0.25)
		(solder_mask_margin 0.0508)
		(thermal_bridge_angle 0)
		(uuid "440a07cd-b115-4040-a152-af6fdf5d7c19")
	)
	(pad "4" smd roundrect
		(at -0.635 3)
		(size 0.6 1.7)
		(layers "F.Cu" "F.Paste" "F.Mask")
		(roundrect_rratio 0.25)
		(solder_mask_margin 0.0508)
		(thermal_bridge_angle 0)
		(uuid "4eae41d2-e38e-4ca6-ac4d-ee82b7a7abaa")
	)
	(pad "5" smd roundrect
		(at 0.635 3)
		(size 0.6 1.7)
		(layers "F.Cu" "F.Paste" "F.Mask")
		(roundrect_rratio 0.25)
		(solder_mask_margin 0.0508)
		(thermal_bridge_angle 0)
		(uuid "4fc8856a-887c-42c5-bce9-a02cc76b417c")
	)
	(pad "6" smd roundrect
		(at 1.905 3)
		(size 0.6 1.7)
		(layers "F.Cu" "F.Paste" "F.Mask")
		(roundrect_rratio 0.25)
		(solder_mask_margin 0.0508)
		(thermal_bridge_angle 0)
		(uuid "c5740a7f-2946-4a82-bf2b-f0ba787f7da9")
	)
	(pad "7" smd roundrect
		(at 3.175 3)
		(size 0.6 1.7)
		(layers "F.Cu" "F.Paste" "F.Mask")
		(roundrect_rratio 0.25)
		(solder_mask_margin 0.0508)
		(thermal_bridge_angle 0)
		(uuid "799dff76-6ed1-4019-84b5-bc8a36065ac2")
	)
	(pad "8" smd roundrect
		(at 4.445 3)
		(size 0.6 1.7)
		(layers "F.Cu" "F.Paste" "F.Mask")
		(roundrect_rratio 0.25)
		(solder_mask_margin 0.0508)
		(thermal_bridge_angle 0)
		(uuid "81df63d0-ddcd-4fdf-ae13-fac39655ab4e")
	)
	(pad "9" smd roundrect
		(at 4.445 -3)
		(size 0.6 1.7)
		(layers "F.Cu" "F.Paste" "F.Mask")
		(roundrect_rratio 0.25)
		(solder_mask_margin 0.0508)
		(thermal_bridge_angle 0)
		(uuid "848c647b-4993-48d7-bfa5-9cc729a0c67c")
	)
	(pad "10" smd roundrect
		(at 3.175 -3)
		(size 0.6 1.7)
		(layers "F.Cu" "F.Paste" "F.Mask")
		(roundrect_rratio 0.25)
		(solder_mask_margin 0.0508)
		(thermal_bridge_angle 0)
		(uuid "741a3577-a2e1-4438-b45e-98f8a7b945da")
	)
	(pad "11" smd roundrect
		(at 1.905 -3)
		(size 0.6 1.7)
		(layers "F.Cu" "F.Paste" "F.Mask")
		(roundrect_rratio 0.25)
		(solder_mask_margin 0.0508)
		(thermal_bridge_angle 0)
		(uuid "6be3a61b-f9ef-4244-b4cd-3306246a712e")
	)
	(pad "12" smd roundrect
		(at 0.635 -3)
		(size 0.6 1.7)
		(layers "F.Cu" "F.Paste" "F.Mask")
		(roundrect_rratio 0.25)
		(solder_mask_margin 0.0508)
		(thermal_bridge_angle 0)
		(uuid "52332027-7cb2-41fd-a0f7-13dc81b2fa88")
	)
	(pad "13" smd roundrect
		(at -0.635 -3)
		(size 0.6 1.7)
		(layers "F.Cu" "F.Paste" "F.Mask")
		(roundrect_rratio 0.25)
		(solder_mask_margin 0.0508)
		(thermal_bridge_angle 0)
		(uuid "e9a5c897-5fd8-40d6-b109-127b71743a2b")
	)
	(pad "14" smd roundrect
		(at -1.905 -3)
		(size 0.6 1.7)
		(layers "F.Cu" "F.Paste" "F.Mask")
		(roundrect_rratio 0.25)
		(solder_mask_margin 0.0508)
		(thermal_bridge_angle 0)
		(uuid "02db3d12-5cd0-4f23-b1ad-542d0ab06f0c")
	)
	(pad "15" smd roundrect
		(at -3.175 -3)
		(size 0.6 1.7)
		(layers "F.Cu" "F.Paste" "F.Mask")
		(roundrect_rratio 0.25)
		(solder_mask_margin 0.0508)
		(thermal_bridge_angle 0)
		(uuid "3d78db05-409d-4bd6-89fa-32d3537e9e20")
	)
	(pad "16" smd roundrect
		(at -4.445 -3)
		(size 0.6 1.7)
		(layers "F.Cu" "F.Paste" "F.Mask")
		(roundrect_rratio 0.25)
		(solder_mask_margin 0.0508)
		(thermal_bridge_angle 0)
		(uuid "388fc3d8-8b73-4746-918b-1a853ad385f3")
	)
)
