M48
; DRILL file {KiCad 8.0.6} date 2024-10-28T15:27:14+0800
; FORMAT={-:-/ absolute / metric / decimal}
; #@! TF.CreationDate,2024-10-28T15:27:14+08:00
; #@! TF.GenerationSoftware,Kicad,Pcbnew,8.0.6
; #@! TF.FileFunction,Plated,1,2,PTH
FMAT,2
METRIC
; #@! TA.AperFunction,Plated,PTH,ViaDrill
T1C0.400
; #@! TA.AperFunction,Plated,PTH,ComponentDrill
T2C0.600
; #@! TA.AperFunction,Plated,PTH,ComponentDrill
T3C0.700
; #@! TA.AperFunction,Plated,PTH,ComponentDrill
T4C0.750
; #@! TA.AperFunction,Plated,PTH,ComponentDrill
T5C0.762
; #@! TA.AperFunction,Plated,PTH,ComponentDrill
T6C0.800
; #@! TA.AperFunction,Plated,PTH,ComponentDrill
T7C1.000
; #@! TA.AperFunction,Plated,PTH,ComponentDrill
T8C1.016
; #@! TA.AperFunction,Plated,PTH,ComponentDrill
T9C1.100
%
G90
G05
T1
X68.694Y-65.507
X68.694Y-72.619
X68.694Y-78.08
X68.694Y-100.2
X68.948Y-53.696
X68.948Y-55.728
X68.948Y-57.76
X69.075Y-132.944
X69.075Y-144.374
X69.329Y-109.83
X70.345Y-160.884
X71.361Y-98.781
X71.615Y-121.514
X72.837Y-96.368
X73.393Y-99.289
X73.52Y-47.473
X74.593Y-93.32
X74.79Y-87.224
X74.917Y-108.052
X75.679Y-151.105
X76.06Y-60.808
X76.06Y-61.824
X76.695Y-120.752
X76.949Y-142.85
X77.33Y-65.126
X77.33Y-68.428
X77.33Y-69.698
X77.33Y-70.968
X77.33Y-80.874
X77.965Y-92.177
X77.965Y-108.052
X77.965Y-160.884
X78.981Y-114.021
X80.251Y-57.379
X80.251Y-59.411
X80.251Y-61.443
X81.312Y-93.32
X81.521Y-89.383
X81.775Y-144.12
X83.119Y-96.368
X83.553Y-47.6
X83.553Y-105.258
X83.553Y-112.624
X84.315Y-121.514
X84.442Y-68.301
X84.823Y-98.781
X85.585Y-45.568
X85.585Y-160.884
X86.093Y-105.258
X86.855Y-132.944
X86.855Y-146.914
X87.49Y-61.824
X88.125Y-65.126
X88.125Y-71.222
X88.252Y-58.776
X89.141Y-101.067
X89.522Y-43.663
X90.792Y-47.854
X91.935Y-132.944
X91.935Y-146.914
X92.062Y-45.187
X92.062Y-61.062
X92.316Y-55.347
X92.951Y-77.826
X93.205Y-160.884
X94.475Y-121.514
X96.507Y-65.38
X97.269Y-90.145
X97.396Y-84.303
X97.777Y-108.052
X98.031Y-55.22
X99.047Y-84.303
X99.047Y-90.145
X99.174Y-103.988
X99.555Y-120.752
X99.682Y-132.563
X100.444Y-84.303
X100.444Y-90.145
X100.825Y-108.052
X100.825Y-160.884
X101.079Y-137.008
X101.079Y-143.612
X101.841Y-84.303
X101.841Y-90.145
X101.841Y-114.021
X101.841Y-121.514
X103.238Y-84.303
X103.238Y-90.145
X103.492Y-92.431
X104.0Y-50.394
X104.0Y-54.204
X104.0Y-58.014
X104.127Y-46.584
X104.635Y-84.303
X104.635Y-90.145
X105.016Y-134.341
X106.032Y-84.303
X106.032Y-90.145
X106.413Y-44.552
X106.413Y-112.624
X107.175Y-121.514
X108.445Y-160.884
X108.953Y-90.145
X109.715Y-132.944
X109.715Y-146.914
X111.112Y-91.161
X111.366Y-101.321
X112.636Y-82.271
X112.636Y-91.161
X113.906Y-82.271
X113.906Y-91.161
X114.795Y-132.944
X114.795Y-146.914
X115.176Y-82.271
X115.176Y-91.161
X115.8Y-92.2
X116.065Y-160.884
X117.335Y-121.514
X117.843Y-84.303
X117.843Y-90.145
X117.97Y-65.888
X119.113Y-84.303
X119.113Y-90.145
X120.129Y-48.489
X120.256Y-66.269
X120.637Y-75.667
X120.637Y-108.052
X121.399Y-65.888
X121.653Y-105.385
X122.161Y-56.363
X122.415Y-120.752
X123.685Y-160.884
X123.939Y-74.397
X124.701Y-63.856
X124.701Y-114.021
X126.225Y-66.523
X126.86Y-101.956
X127.114Y-71.349
X127.622Y-92.177
X127.749Y-67.539
X129.146Y-112.624
X129.908Y-102.337
X130.035Y-121.514
X131.051Y-103.861
X131.305Y-160.884
X131.559Y-72.873
X132.448Y-73.762
X132.575Y-132.944
X132.575Y-146.914
X132.702Y-76.556
X132.702Y-93.574
X132.829Y-107.036
X133.337Y-74.651
X134.099Y-76.556
X134.099Y-94.844
X134.556Y-68.758
X135.75Y-96.368
X136.478Y-83.795
X136.639Y-63.475
X136.639Y-99.035
X137.401Y-58.268
X137.401Y-76.048
X137.528Y-82.779
X137.655Y-132.944
X137.909Y-64.491
X137.909Y-69.19
X138.544Y-83.795
X138.925Y-160.884
X139.179Y-80.366
X139.687Y-88.367
X139.814Y-68.428
X139.941Y-102.21
X139.941Y-103.734
X140.195Y-121.514
X140.703Y-72.492
X140.957Y-148.565
X142.1Y-44.933
X142.1Y-72.492
X142.227Y-112.37
X142.354Y-151.232
X142.481Y-74.016
X143.497Y-108.052
X144.005Y-83.541
X144.4Y-82.2
X145.275Y-57.125
X145.275Y-120.752
X145.529Y-108.052
X146.545Y-160.884
X147.307Y-83.414
X147.561Y-101.448
X147.561Y-114.021
X147.688Y-63.856
X147.688Y-69.19
X148.577Y-73.127
X148.831Y-84.049
X149.085Y-69.19
X149.72Y-82.398
X150.99Y-87.224
X151.0Y-92.5
X152.006Y-98.4
X152.133Y-112.624
X152.26Y-92.5
X152.895Y-121.514
X153.403Y-104.242
X153.657Y-146.787
X154.165Y-160.884
X155.435Y-132.944
X155.816Y-146.787
X156.7Y-93.0
X156.832Y-86.208
X157.213Y-63.602
X157.213Y-104.242
X158.991Y-64.999
X159.118Y-59.792
X160.515Y-132.944
X160.515Y-146.914
X161.15Y-92.5
X161.15Y-95.733
X161.531Y-105.893
X161.531Y-107.671
X161.658Y-108.941
X161.785Y-160.884
X162.039Y-99.797
X163.055Y-69.19
X163.055Y-72.492
X163.055Y-121.514
X163.563Y-95.733
X163.7Y-92.5
X163.944Y-112.497
X165.0Y-92.5
X166.23Y-92.5
X166.23Y-95.733
X166.357Y-108.052
X167.119Y-133.452
X167.246Y-98.781
X168.135Y-120.752
X169.278Y-83.922
X169.278Y-102.845
X169.405Y-160.884
X170.1Y-92.5
X170.421Y-114.021
X171.564Y-101.448
X172.326Y-63.348
X172.834Y-93.955
X173.342Y-67.158
X174.739Y-60.681
X174.993Y-112.624
X175.12Y-98.654
X175.12Y-102.083
X175.755Y-121.514
X176.39Y-92.6
X176.898Y-109.703
X177.025Y-72.492
X177.025Y-160.884
X177.787Y-69.19
X178.295Y-132.944
X178.295Y-146.914
X178.93Y-78.715
X178.93Y-83.16
X179.311Y-104.623
X180.073Y-72.492
X182.994Y-96.622
X183.375Y-132.944
X183.375Y-146.914
X184.391Y-68.428
X184.391Y-105.893
X184.391Y-107.29
X184.391Y-110.592
X184.645Y-160.884
X184.772Y-104.115
X185.026Y-77.572
X185.407Y-64.745
X185.534Y-81.382
X185.915Y-121.514
X186.55Y-63.856
X186.55Y-67.92
X186.55Y-71.73
X186.55Y-75.54
X187.693Y-105.639
X187.82Y-87.097
X187.82Y-92.6
X189.217Y-97.638
X189.217Y-107.798
X191.249Y-107.798
X191.376Y-97.638
X192.265Y-160.884
X192.646Y-66.777
X192.646Y-70.714
X192.646Y-74.524
X192.646Y-78.588
X193.281Y-107.798
X194.5Y-84.6
X194.805Y-104.623
X195.186Y-55.093
X195.821Y-89.129
X195.821Y-91.923
X196.329Y-94.082
X196.329Y-101.448
X196.583Y-44.552
X197.599Y-95.606
X197.853Y-104.623
X197.853Y-112.37
X198.107Y-58.903
X198.615Y-121.514
X198.869Y-96.876
X198.996Y-79.985
X199.25Y-59.792
X199.885Y-105.766
X199.885Y-160.884
X200.52Y-77.445
X200.647Y-59.792
X201.155Y-64.745
X201.155Y-132.944
X201.282Y-95.606
X201.536Y-110.973
X201.79Y-83.033
X201.917Y-79.985
X202.171Y-59.792
X202.425Y-62.078
X202.425Y-101.321
X203.949Y-64.745
X203.949Y-77.445
X203.949Y-79.985
X205.219Y-64.745
X205.219Y-83.033
X205.346Y-71.095
X206.235Y-56.49
X206.235Y-57.506
X207.505Y-56.49
X207.505Y-57.506
X207.505Y-72.365
X207.505Y-73.635
X207.505Y-74.905
X207.505Y-76.175
X207.505Y-78.715
X207.505Y-79.985
X207.505Y-81.255
X207.505Y-132.944
X207.505Y-160.884
X207.759Y-111.608
X208.267Y-86.462
X208.267Y-91.542
X208.267Y-93.828
X208.775Y-56.49
X208.775Y-57.506
X208.775Y-121.514
X209.41Y-73.0
X209.41Y-74.27
X209.41Y-75.54
X209.41Y-76.81
X209.41Y-78.08
X209.41Y-79.35
X209.41Y-80.62
X209.41Y-84.303
X209.664Y-64.745
X209.664Y-102.845
X210.934Y-102.845
X212.077Y-108.052
X212.585Y-134.214
X213.347Y-103.988
X213.855Y-138.024
X214.109Y-108.052
X215.125Y-151.994
X215.125Y-160.884
X216.141Y-114.021
X216.141Y-121.514
X216.141Y-142.977
X217.411Y-105.512
X217.665Y-138.024
X221.475Y-121.514
X222.491Y-60.173
X222.491Y-93.447
X222.745Y-132.944
X222.745Y-160.884
X223.888Y-113.64
X224.269Y-94.844
X224.269Y-100.305
T3
X144.005Y-140.437
X146.545Y-142.977
X149.085Y-140.437
T4
X190.995Y-133.452
X190.995Y-144.628
X190.995Y-155.804
X193.535Y-133.452
X193.535Y-144.628
X193.535Y-155.804
T5
X145.145Y-154.28
X145.145Y-156.82
X147.945Y-154.28
X147.945Y-156.82
T6
X99.525Y-150.502
X102.125Y-150.502
T7
X118.785Y-145.644
X121.185Y-152.644
X123.685Y-152.644
X126.185Y-152.644
X127.622Y-53.442
X128.585Y-145.644
X128.765Y-70.714
X128.765Y-73.254
X128.765Y-75.794
X128.765Y-78.334
X128.765Y-80.874
X132.575Y-50.394
X132.575Y-56.591
T8
X214.744Y-48.87
X214.744Y-51.41
X214.744Y-53.95
X217.284Y-48.87
X217.284Y-51.41
X217.284Y-53.95
X219.824Y-48.87
X219.824Y-51.41
X219.824Y-53.95
T9
X220.459Y-65.38
X220.459Y-70.46
X220.459Y-83.16
X220.459Y-88.24
T2
X142.405Y-81.154G85X142.405Y-82.354
G05
X196.405Y-81.154G85X196.405Y-82.354
G05
M30
