(footprint "2012"
	(version 20240108)
	(generator "pcbnew")
	(generator_version "8.0")
	(layer "F.Cu")
	(descr "SMD resistor, capacitor and other devices.\nSize: 2.0 x 1.2mm\n\nSame with size 0805 in inches.")
	(property "Reference" "REF**"
		(at 0 -0.95 0)
		(unlocked yes)
		(layer "F.Fab")
		(uuid "f711eb4b-89d8-4837-ac16-6dcd7d8760e3")
		(effects
			(font
				(size 0.6477 0.6477)
				(thickness 0.1143)
			)
			(justify bottom)
		)
	)
	(property "Value" "2012"
		(at 0 0.95 0)
		(unlocked yes)
		(layer "F.Fab")
		(uuid "3bef4dbf-6425-4770-b68e-536a6f0c68e3")
		(effects
			(font
				(size 0.6477 0.6477)
				(thickness 0.1143)
			)
			(justify top)
		)
	)
	(property "Footprint" ""
		(at 0 0 0)
		(layer "F.Fab")
		(hide yes)
		(uuid "f298cb38-a90a-4ce7-81c2-9d54447bfd00")
		(effects
			(font
				(size 1.27 1.27)
				(thickness 0.15)
			)
		)
	)
	(property "Datasheet" ""
		(at 0 0 0)
		(layer "F.Fab")
		(hide yes)
		(uuid "25b42f5e-1953-460b-a945-c5d33945203f")
		(effects
			(font
				(size 1.27 1.27)
				(thickness 0.15)
			)
		)
	)
	(property "Description" ""
		(at 0 0 0)
		(layer "F.Fab")
		(hide yes)
		(uuid "55f4cad7-da13-4129-881d-ca3afa858100")
		(effects
			(font
				(size 1.27 1.27)
				(thickness 0.15)
			)
		)
	)
	(fp_line
		(start -1 -0.6)
		(end -1 0.6)
		(stroke
			(width 0.2032)
			(type solid)
		)
		(layer "F.Fab")
		(uuid "77423709-2252-4601-9739-f93bc6e76649")
	)
	(fp_line
		(start -1 0.6)
		(end 1 0.6)
		(stroke
			(width 0.2032)
			(type solid)
		)
		(layer "F.Fab")
		(uuid "e5e7f539-a6bf-4052-b9b3-61800292e354")
	)
	(fp_line
		(start 1 -0.6)
		(end -1 -0.6)
		(stroke
			(width 0.2032)
			(type solid)
		)
		(layer "F.Fab")
		(uuid "2fc5b7ac-ad97-42eb-aec1-dbeb47e9a3cb")
	)
	(fp_line
		(start 1 0.6)
		(end 1 -0.6)
		(stroke
			(width 0.2032)
			(type solid)
		)
		(layer "F.Fab")
		(uuid "40faa81e-ea6e-4c92-aa5d-950ed2967357")
	)
	(fp_poly
		(pts
			(xy -1 0.6) (xy -0.5 0.6) (xy -0.5 -0.6) (xy -1 -0.6)
		)
		(stroke
			(width 0)
			(type default)
		)
		(fill solid)
		(layer "F.Fab")
		(uuid "6a7b7ba6-6261-4db6-bdfc-77806f71d5e3")
	)
	(fp_poly
		(pts
			(xy 0.5 0.6) (xy 1 0.6) (xy 1 -0.6) (xy 0.5 -0.6)
		)
		(stroke
			(width 0)
			(type default)
		)
		(fill solid)
		(layer "F.Fab")
		(uuid "4b8e49c4-9c87-45fb-a8ee-64ed0778b878")
	)
	(pad "1" smd roundrect
		(at -1 0)
		(size 1.2 1.6)
		(layers "F.Cu" "F.Paste" "F.Mask")
		(roundrect_rratio 0.375)
		(solder_mask_margin 0.0508)
		(thermal_bridge_angle 0)
		(uuid "9c698d9e-09e9-49ff-9e1f-cfb67f853878")
	)
	(pad "2" smd roundrect
		(at 1 0)
		(size 1.2 1.6)
		(layers "F.Cu" "F.Paste" "F.Mask")
		(roundrect_rratio 0.375)
		(solder_mask_margin 0.0508)
		(thermal_bridge_angle 0)
		(uuid "6e4fc41a-246c-4463-9a95-e86aabcd7d34")
	)
)
