(footprint "SOT-23-5"
	(version 20240108)
	(generator "pcbnew")
	(generator_version "8.0")
	(layer "F.Cu")
	(descr "Small Outline Transistor - 5 Pins (SOT-23-5)")
	(property "Reference" "REF**"
		(at 0 -1.7 0)
		(unlocked yes)
		(layer "F.Fab")
		(uuid "f4534c44-0557-4832-88fd-98a41c57f26c")
		(effects
			(font
				(size 0.6477 0.6477)
				(thickness 0.1143)
			)
			(justify bottom)
		)
	)
	(property "Value" ""
		(at 0 0 0)
		(layer "F.Fab")
		(uuid "71d009fe-0d45-4515-8fa9-51557692065a")
		(effects
			(font
				(size 1.27 1.27)
				(thickness 0.15)
			)
		)
	)
	(property "Footprint" ""
		(at 0 0 0)
		(layer "F.Fab")
		(hide yes)
		(uuid "dc0199b6-7da1-4fc6-bf65-9db0a9e725d3")
		(effects
			(font
				(size 1.27 1.27)
				(thickness 0.15)
			)
		)
	)
	(property "Datasheet" ""
		(at 0 0 0)
		(layer "F.Fab")
		(hide yes)
		(uuid "3db569a5-6866-4db9-ba4e-2e7e993f0d55")
		(effects
			(font
				(size 1.27 1.27)
				(thickness 0.15)
			)
		)
	)
	(property "Description" ""
		(at 0 0 0)
		(layer "F.Fab")
		(hide yes)
		(uuid "ca766823-7944-4e4c-89f0-790eae5029fb")
		(effects
			(font
				(size 1.27 1.27)
				(thickness 0.15)
			)
		)
	)
	(fp_line
		(start -0.8 -1.45)
		(end -0.8 1.45)
		(stroke
			(width 0.2032)
			(type solid)
		)
		(layer "F.Fab")
		(uuid "baa2ac21-6c54-4b70-8615-194f4e68c7b3")
	)
	(fp_line
		(start -0.8 1.45)
		(end 0.8 1.45)
		(stroke
			(width 0.2032)
			(type solid)
		)
		(layer "F.Fab")
		(uuid "f890805c-5d61-4c74-9f36-27cebe06ef88")
	)
	(fp_line
		(start 0.8 -1.45)
		(end -0.8 -1.45)
		(stroke
			(width 0.2032)
			(type solid)
		)
		(layer "F.Fab")
		(uuid "3b229ab5-9c3f-4617-856b-38e26f8c75f1")
	)
	(fp_line
		(start 0.8 1.45)
		(end 0.8 -1.45)
		(stroke
			(width 0.2032)
			(type solid)
		)
		(layer "F.Fab")
		(uuid "c0aa9ac1-96d7-46d7-b754-0547d219f485")
	)
	(fp_poly
		(pts
			(xy -1.4 -0.75) (xy -0.8 -0.75) (xy -0.8 -1.15) (xy -1.4 -1.15)
		)
		(stroke
			(width 0)
			(type default)
		)
		(fill solid)
		(layer "F.Fab")
		(uuid "d5257bf2-26d1-4a27-a24d-7be8f428ee8b")
	)
	(fp_poly
		(pts
			(xy -1.4 0.2) (xy -0.8 0.2) (xy -0.8 -0.2) (xy -1.4 -0.2)
		)
		(stroke
			(width 0)
			(type default)
		)
		(fill solid)
		(layer "F.Fab")
		(uuid "61240f77-a0fd-44c2-a7af-8bf7272c045d")
	)
	(fp_poly
		(pts
			(xy -1.4 1.15) (xy -0.8 1.15) (xy -0.8 0.75) (xy -1.4 0.75)
		)
		(stroke
			(width 0)
			(type default)
		)
		(fill solid)
		(layer "F.Fab")
		(uuid "f0aef735-6845-455c-95d9-4102f90a4c6e")
	)
	(fp_poly
		(pts
			(xy 0.8 -0.75) (xy 1.4 -0.75) (xy 1.4 -1.15) (xy 0.8 -1.15)
		)
		(stroke
			(width 0)
			(type default)
		)
		(fill solid)
		(layer "F.Fab")
		(uuid "0aa17999-702d-42f0-875b-0dcb009e2f3b")
	)
	(fp_poly
		(pts
			(xy 0.8 1.15) (xy 1.4 1.15) (xy 1.4 0.75) (xy 0.8 0.75)
		)
		(stroke
			(width 0)
			(type default)
		)
		(fill solid)
		(layer "F.Fab")
		(uuid "a72f05a9-b562-4287-9251-a3fc94bc9621")
	)
	(fp_text user "${MPN}"
		(at 0 1.7 0)
		(unlocked yes)
		(layer "F.Fab")
		(uuid "37b560ff-ad64-407b-b983-80ac4671d73b")
		(effects
			(font
				(size 0.6477 0.6477)
				(thickness 0.1143)
			)
			(justify top)
		)
	)
	(pad "1" smd roundrect
		(at -1.35 -0.95 270)
		(size 0.6 1)
		(layers "F.Cu" "F.Paste" "F.Mask")
		(roundrect_rratio 0.25)
		(solder_mask_margin 0.0508)
		(thermal_bridge_angle 0)
		(uuid "539ab6f7-83c3-4ae7-a085-eceecd1dbbff")
	)
	(pad "2" smd roundrect
		(at -1.35 0 270)
		(size 0.6 1)
		(layers "F.Cu" "F.Paste" "F.Mask")
		(roundrect_rratio 0.25)
		(solder_mask_margin 0.0508)
		(thermal_bridge_angle 0)
		(uuid "cf2ea7c3-073e-4b91-8cab-0d366250e0ea")
	)
	(pad "3" smd roundrect
		(at -1.35 0.95 270)
		(size 0.6 1)
		(layers "F.Cu" "F.Paste" "F.Mask")
		(roundrect_rratio 0.25)
		(solder_mask_margin 0.0508)
		(thermal_bridge_angle 0)
		(uuid "58eef4fa-05d9-44d2-b385-b4eb42c1d19f")
	)
	(pad "4" smd roundrect
		(at 1.35 0.95 270)
		(size 0.6 1)
		(layers "F.Cu" "F.Paste" "F.Mask")
		(roundrect_rratio 0.25)
		(solder_mask_margin 0.0508)
		(thermal_bridge_angle 0)
		(uuid "85935ea5-fb35-4123-8630-6bf1f2104e19")
	)
	(pad "5" smd roundrect
		(at 1.35 -0.95 270)
		(size 0.6 1)
		(layers "F.Cu" "F.Paste" "F.Mask")
		(roundrect_rratio 0.25)
		(solder_mask_margin 0.0508)
		(thermal_bridge_angle 0)
		(uuid "eb310d6f-f6a1-4d54-b85d-77cc5ccb07f0")
	)
)
