# 1 "mcc_generated_files/device_config.c"
# 1 "<built-in>" 1
# 1 "<built-in>" 3
# 288 "<built-in>" 3
# 1 "<command line>" 1
# 1 "<built-in>" 2
# 1 "C:\\Program Files\\Microchip\\xc8\\v2.20\\pic\\include\\language_support.h" 1 3
# 2 "<built-in>" 2
# 1 "mcc_generated_files/device_config.c" 2
# 50 "mcc_generated_files/device_config.c"
#pragma config FOSC = INTOSC
#pragma config WDTE = ON
#pragma config PWRTE = ON
#pragma config MCLRE = OFF
#pragma config CP = ON
#pragma config CPD = ON
#pragma config BOREN = ON
#pragma config CLKOUTEN = OFF
#pragma config IESO = ON
#pragma config FCMEN = ON


#pragma config WRT = ALL
#pragma config VCAPEN = OFF
#pragma config PLLEN = ON
#pragma config STVREN = ON
#pragma config BORV = LO
#pragma config LVP = OFF
# 67 "mcc_generated_files/device_config.c"

