(footprint "CD54"
	(version 20240108)
	(generator "pcbnew")
	(generator_version "8.0")
	(layer "F.Cu")
	(descr "SMD Inductor\nDiameter: 5.8mm")
	(property "Reference" "REF**"
		(at 0 -3 0)
		(unlocked yes)
		(layer "F.Fab")
		(uuid "d0a616ca-3a9a-410e-85ca-5626970e7f3b")
		(effects
			(font
				(size 0.6477 0.6477)
				(thickness 0.1143)
			)
			(justify bottom)
		)
	)
	(property "Value" "CD54"
		(at 0 3 0)
		(unlocked yes)
		(layer "F.Fab")
		(uuid "90e13d32-b1a3-4ce0-ae2f-ac0ecdc6e318")
		(effects
			(font
				(size 0.6477 0.6477)
				(thickness 0.1143)
			)
			(justify top)
		)
	)
	(property "Footprint" ""
		(at 0 0 0)
		(layer "F.Fab")
		(hide yes)
		(uuid "32c4dcb7-e2f3-4ad3-9ef4-ccad09fbcfb7")
		(effects
			(font
				(size 1.27 1.27)
				(thickness 0.15)
			)
		)
	)
	(property "Datasheet" ""
		(at 0 0 0)
		(layer "F.Fab")
		(hide yes)
		(uuid "8099adda-8360-4ca4-b966-2c6805e93278")
		(effects
			(font
				(size 1.27 1.27)
				(thickness 0.15)
			)
		)
	)
	(property "Description" ""
		(at 0 0 0)
		(layer "F.Fab")
		(hide yes)
		(uuid "e67894b6-26b1-447c-9997-22785d79a942")
		(effects
			(font
				(size 1.27 1.27)
				(thickness 0.15)
			)
		)
	)
	(fp_line
		(start -1.25 -2.6)
		(end 1.25 -2.6)
		(stroke
			(width 0.2032)
			(type solid)
		)
		(layer "F.Fab")
		(uuid "4af67aad-2ccf-4a3c-9d04-6dfc219a883a")
	)
	(fp_line
		(start -1.25 2.6)
		(end 1.25 2.6)
		(stroke
			(width 0.2032)
			(type solid)
		)
		(layer "F.Fab")
		(uuid "5d2d0734-b09d-4360-900a-4e129b03a143")
	)
	(fp_arc
		(start -1.25 2.6)
		(mid -2.906383 0)
		(end -1.25 -2.6)
		(stroke
			(width 0.2032)
			(type solid)
		)
		(layer "F.Fab")
		(uuid "1f39c259-ef5c-464c-8724-780f962b2c8f")
	)
	(fp_arc
		(start 1.25 -2.6)
		(mid 2.906383 0)
		(end 1.25 2.6)
		(stroke
			(width 0.2032)
			(type solid)
		)
		(layer "F.Fab")
		(uuid "31091e05-c4f0-4185-9d86-85e67a726807")
	)
	(pad "1" smd roundrect
		(at -1.95 0 90)
		(size 5.5 2.2)
		(layers "F.Cu" "F.Paste" "F.Mask")
		(roundrect_rratio 0.15)
		(solder_mask_margin 0.0508)
		(thermal_bridge_angle 0)
		(uuid "c2c1fb68-8612-488d-bfc5-56d7c814bf09")
	)
	(pad "2" smd roundrect
		(at 1.95 0 90)
		(size 5.5 2.2)
		(layers "F.Cu" "F.Paste" "F.Mask")
		(roundrect_rratio 0.15)
		(solder_mask_margin 0.0508)
		(thermal_bridge_angle 0)
		(uuid "88c46e81-1412-4504-b1a6-9de586a3c4bf")
	)
)
