\relax 
\providecommand\hyper@newdestlabel[2]{}
\providecommand\HyperFirstAtBeginDocument{\AtBeginDocument}
\HyperFirstAtBeginDocument{\ifx\hyper@anchor\@undefined
\global\let\oldnewlabel\newlabel
\gdef\newlabel#1#2{\newlabelxx{#1}#2}
\gdef\newlabelxx#1#2#3#4#5#6{\oldnewlabel{#1}{{#2}{#3}}}
\AtEndDocument{\ifx\hyper@anchor\@undefined
\let\newlabel\oldnewlabel
\fi}
\fi}
\global\let\hyper@last\relax 
\gdef\HyperFirstAtBeginDocument#1{#1}
\providecommand\HyField@AuxAddToFields[1]{}
\providecommand\HyField@AuxAddToCoFields[2]{}
\providecommand\BKM@entry[2]{}
\gdef \LT@i {\LT@entry 
    {1}{517.89pt}\LT@entry 
    {1}{120.405pt}\LT@entry 
    {1}{48.135pt}\LT@entry 
    {1}{48.135pt}}
\newlabel{LastPage}{{}{68}{}{page.68}{}}
\xdef\lastpage@lastpage{68}
\xdef\lastpage@lastpageHy{68}
\gdef \@abspage@last{68}
