{
  "name": "nbcp",
  "version": "1.0.0",
  "description": "Non-blocking command processor",
  "keywords": "shell, options",
  "repository":
  {
    "type": "git",
    "url": "https://github.com/tbd.git"
  },
  "authors":
  [
    {
      "name": "John Smith",
      "email": "me@john-smith.com",
      "url": "https://www.john-smith/contact"
    },
  ],
  "license": "MIT",
  "homepage": "https://www.helloworld.org/",
  "dependencies": {},
  "frameworks": "*",
  "platforms": "*"
}
