%!PS-Adobe-3.0 EPSF-3.0
%%BoundingBox: 0 0 959 1111
%%Creator: yExport 1.5
%%Producer: org.freehep.graphicsio.ps.EPSGraphics2D Revision: 12753 
%%For: 
%%Title: 
%%CreationDate: Monday, May 16, 2022 at 11:17:25 AM Central European Summer Time
%%LanguageLevel: 3
%%EndComments
%%BeginProlog
100 dict dup begin

%
% File: org/freehep/graphicsio.ps/PSProlog.txt
% Author: Charles Loomis
%

% Redefinitions which save some space in the output file.  These are also
% the same as the PDF operators.
/q {gsave} def
/Q {grestore} def

/n {newpath} def
/m {moveto} def
/l {lineto} def
/c {curveto} def
/h {closepath} def

/re {4 -2 roll moveto
     dup 0 exch rlineto exch 0 rlineto
     neg 0 exch rlineto closepath} def

/f {fill} def
/f* {eofill} def
/F {gsave vg&FC fill grestore} def
/F* {gsave vg&FC eofill grestore} def

/s {closepath stroke} def
/S {stroke} def

/b {closepath gsave vg&FC fill grestore
    gsave stroke grestore newpath} def
/B {gsave vg&FC fill grestore gsave stroke grestore newpath} def
/b* {closepath gsave vg&FC eofill grestore
    gsave stroke grestore newpath} def
/B* {gsave vg&FC eofill grestore gsave stroke grestore newpath} def

/g {1 array astore /vg&fcolor exch def} def
/G {setgray} def
/k {4 array astore /vg&fcolor exch def} def
/K {setcmykcolor} def
/rg {3 array astore /vg&fcolor exch def} def
/RG {setrgbcolor} def

% Initialize the fill color.
0 0 0 rg

/vg&FC {mark vg&fcolor aload pop
        counttomark 1 eq {G} if
        counttomark 3 eq {RG} if
        counttomark 4 eq {K} if
        cleartomark } def

/vg&DFC {/vg&fcolor exch def} def

/vg&C {mark exch aload pop
       counttomark 1 eq {G} if
       counttomark 3 eq {RG} if
       counttomark 4 eq {K} if
       cleartomark } def

/w {setlinewidth} def
/j {setlinejoin} def
/J {setlinecap} def
/M {setmiterlimit} def
/d {setdash} def
/i {setflat} def

/W {clip} def
/W* {eoclip} def

% Setup the default graphics state.
% (black; 1 pt. linewidth; miter join; butt-ends; solid)
/defaultGraphicsState {0 g 1 w 0 j 0 J [] 0 d} def

% Emulation of the rectangle operators for PostScript implementations
% which do not implement all Level 2 features.  This is an INCOMPLETE
% emulation; only the "x y width height rect..." form is emulated.
/*rf {gsave newpath re fill grestore} def
/*rs {gsave newpath re stroke grestore} def
/*rc {newpath re clip} def
/rf  /rectfill where {pop /rectfill}{/*rf} ifelse load def
/rs  /rectstroke where {pop /rectstroke}{/*rs} ifelse load def
/rc  /rectclip where {pop /rectclip}{/*rc} ifelse load def

% Emulation of the selectfont operator.  This includes a 20% increase in
% the fontsize which is necessary to get sizes similar to the Java fonts.
/*sf {exch findfont exch
      dup type /arraytype eq {makefont}{scalefont} ifelse setfont} bind def
/sf /selectfont where {pop {1.2 mul selectfont}}{{1.2 mul *sf}} ifelse def

% Special version of stroke which allows the dash pattern to continue
% across path segments.  (This may be needed for PostScript although
% modern printers seem to do this correctly.)
/vg&stroke {
  currentdash pop length 0 eq
  {stroke}
  {
    currentdash /vg&doffset exch def pop
    flattenpath
    {m vg&resetdash}
    {2 copy
     currentpoint
     3 -1 roll sub dup mul
     3 1 roll sub dup mul
     add sqrt
     3 1 roll l
     currentdash 3 -1 roll add setdash}
     {}
     {h vg&resetdash}
     pathforall
     stroke
     vg&resetdash
  } ifelse
} def
/vg&resetdash {currentdash pop vg&doffset setdash} def

% Initialize variables for safety.
/delta 0 def
/xv 0 def  /yv 0 def  /width 0 def  /height 0 def

% Initialize to portrait INTERNATIONAL (Letter-height, A4-width) page.
/pw 595 def  /ph 791  def  /po true def /ftp false def

% Initialize margins to 20 points.
/ml 20 def  /mr 20 def  /mt 20 def  /mb 20 def

% Temporary matrices.
/smatrix 0 def  /nmatrix 0 def

% set page size (usage: <page width><page height> setpagesize)
/setpagesize {/ph exch def /pw exch def} def

% set page orientation (usage: portrait or landscape)
/portrait {/po true def} def
/landscape {/po false def} def

% force natural size for image (usage: naturalsize)
/naturalsize {/ftp false def} def

% resize image to fill page (usage: fittopage)
/fittopage {/ftp true def} def

% set margins of the page (usage: <left><bottom><top><right> setmargins)
/setmargins {/mr exch def /mt exch def /mb exch def /ml exch def} def

% set the graphic's size (usage: <width><height> setsize)
/setsize {/gh exch def /gw exch def} def

% set the graphic's origin (usage: <x0><y0> setorigin)
/setorigin {/gy exch def /gx exch def} def

% calculate image center
/imagecenter {pw ml sub mr sub 2 div ml add
              ph mt sub mb sub 2 div mb add} def

% calculate the necessary scaling
/imagescale {po {gw}{gh} ifelse pw ml sub mr sub div
             po {gh}{gw} ifelse ph mt sub mb sub div
             2 copy lt {exch} if pop
             ftp not {1 2 copy lt {exch} if pop} if
             1 exch div /sfactor exch def
             /gw gw sfactor mul def /gh gh sfactor mul def} def

% calculate image origin
/imageorigin {pw ml sub mr sub 2 div ml add
              po {gw}{gh} ifelse 2 div sub
              ph mt sub mb sub 2 div mb add
              po {gh}{gw} ifelse 2 div po {add}{sub} ifelse} def

% calculate the clipping origin
/cliporigin  {pw ml sub mr sub 2 div ml add
              po {gw}{gh} ifelse 2 div sub floor
              ph mt sub mb sub 2 div mb add
              po {gh}{gw} ifelse 2 div sub floor} def

% Set the clipping region to the bounding box.
/cliptobounds {cliporigin po {gw}{gh} ifelse 1 add
                          po {gh}{gw} ifelse 1 add rc} def

% set the base transformation matrix (usage: setbasematrix)
/setbasematrix {imageorigin translate
                po {0}{90} ifelse rotate
                sfactor sfactor neg scale
                /defaultmatrix matrix currentmatrix def} def

% The lower-right bias in drawing 1 pt. wide lines.
/bias  {q 0.5 0.5 translate} def
/unbias {Q} def

% Define the composite fonts used to print Unicode strings.
% Undefine particular values in an encoding array.
/vg&undef { {exch dup 3 -1 roll /.notdef put} forall } def
/vg&redef { {3 -1 roll dup 4 2 roll put} forall } def

% usage: key encoding basefontname vg&newbasefont font
/vg&newbasefont {
findfont dup length dict copy
  begin
    currentdict /FID undef
    /Encoding exch def
    dup /FontName exch def
    currentdict
  end
definefont
} def

% usage: key encoding basefontname vg&newskewedbasefont font
/vg&newskewedbasefont {
findfont dup length dict copy
  begin
    currentdict /FID undef
    /Encoding exch def
    dup /FontName exch def
    exch FontMatrix exch matrix concatmatrix /FontMatrix exch def
    currentdict
  end
definefont
} def

% usage: basekey suffix vg&nconcat name
/vg&nconcat {
  2 {dup length string cvs exch} repeat
  dup length 3 -1 roll dup length 3 -1 roll add string
  dup 0 4 -1 roll dup length 5 1 roll putinterval
  dup 4 -2 roll exch putinterval cvn
} def

%usage: fontname vg&skewmatrix matrix
/vg&skewmatrix {
findfont dup /FontInfo known
  {
    /FontInfo get dup /ItalicAngle known
    {
      [ 1 0 4 -1 roll /ItalicAngle get neg dup sin exch cos div 1 0 0 ]
    }
    {pop matrix} ifelse
  }
  {pop matrix} ifelse
} def

% usage: newfontname basefontname vg&newcompositefont --
/vg&newcompositefont {
/vg&fstyle exch def
/vg&bfont exch def
/vg&fname exch def
<<
/FontStyleBits vg&fstyle
/FontType 0
/FontMatrix matrix
/FontName vg&fname
/FMapType 2
/Encoding [ 0 1 255 {pop 6} for ]
          dup 16#00 0 put % Latin
          dup 16#03 1 put % Greek
          dup 16#20 2 put % Punctuation
          dup 16#21 3 put % Arrows
          dup 16#22 4 put % MathOps
          dup 16#27 5 put % Dingbats

/FDepVector [
vg&bfont /-UC-Latin vg&nconcat UCLatinEncoding
vg&bfont vg&newbasefont

vg&bfont vg&skewmatrix
vg&bfont /-UC-Greek vg&nconcat UCGreekEncoding
/Symbol vg&newskewedbasefont

vg&bfont /-UC-Punctuation vg&nconcat UCPunctuationEncoding
vg&bfont vg&newbasefont

/Arrows-UC findfont
/MathOps-UC findfont
/Dingbats-UC findfont
/Undefined-UC findfont ]
>>
vg&fname exch definefont pop
} def

% Null encoding vector (all elements set to .notdef)
/NullEncoding [ 256 {/.notdef} repeat ] def

% Unicode Latin encoding (unicode codes \u0000-\u00ff)
/UCLatinEncoding
  ISOLatin1Encoding dup length array copy
  dup 16#60 /grave put
  [ 16#90 16#91 16#92 16#93 16#94 16#95 16#96
    16#97 16#98 16#9a 16#9b 16#9d 16#9e 16#9f
  ] vg&undef
  def

% Unicode Greek encoding (unicode codes \u0370-\u03ff)
/UCGreekEncoding
  NullEncoding dup length array copy
  << 16#91 /Alpha    16#92 /Beta      16#93 /Gamma    16#94 /Delta
     16#95 /Epsilon  16#96 /Zeta      16#97 /Eta      16#98 /Theta
     16#99 /Iota     16#9a /Kappa     16#9b /Lambda   16#9c /Mu
     16#9d /Nu       16#9e /Xi        16#9f /Omicron  16#a0 /Pi
     16#a1 /Rho      16#a3 /Sigma     16#a4 /Tau      16#a5 /Upsilon
     16#a6 /Phi      16#a7 /Chi       16#a8 /Psi      16#a9 /Omega
     16#b1 /alpha    16#b2 /beta      16#b3 /gamma    16#b4 /delta
     16#b5 /epsilon  16#b6 /zeta      16#b7 /eta      16#b8 /theta
     16#b9 /iota     16#ba /kappa     16#bb /lambda   16#bc /mu
     16#bd /nu       16#be /xi        16#bf /omicron  16#c0 /pi
     16#c1 /rho      16#c2 /sigma1    16#c3 /sigma    16#c4 /tau
     16#c5 /upsilon  16#c6 /phi1      16#c7 /chi      16#c8 /psi
     16#c9 /omega    16#7e /semicolon 16#87 /dotmath  16#d1 /theta1
     16#d2 /Upsilon1 16#d5 /phi       16#d6 /omega1
  >> vg&redef
  def

% Unicode punctuation encoding (unicode codes \u2000-\u206f)
/UCPunctuationEncoding
  NullEncoding dup length array copy
  << 16#10 /hyphen          16#11 /hyphen              16#12 /endash
     16#13 /emdash          16#18 /quoteleft           16#19 /quoteright
     16#1a /quotesinglbase  16#1b /quotesingle         16#1c /quotedblleft
     16#1d /quotedblright   16#1e /quotedblbase        16#1f /quotedbl
     16#20 /dagger          16#21 /daggerdbl           16#22 /bullet
     16#24 /period          16#26 /ellipsis            16#27 /periodcentered
     16#30 /perthousand     16#44 /fraction
     16#70 /zerosuperior    16#74 /foursuperior        16#75 /fivesuperior
     16#76 /sixsuperior     16#77 /sevensuperior       16#78 /eightsuperior
     16#79 /ninesuperior    16#7b /hyphensuperior      16#7d /parenleftsuperior
     16#7e /parenrightsuperior
     16#80 /zeroinferior    16#84 /fourinferior        16#85 /fiveinferior
     16#81 /oneinferior     16#82 /twoinferior         16#83 /threeinferior
     16#86 /sixinferior     16#87 /seveninferior       16#88 /eightinferior
     16#89 /nineinferior    16#8b /hypheninferior      16#8d /parenleftinferior
     16#8e /parenrightinferior
  >> vg&redef
  def

% Unicode mathematical operators encoding (unicode codes \u2200-\u22ff)
/UCMathOpsEncoding
  NullEncoding dup length array copy
  << 16#00 /universal       16#02 /partialdiff         16#03 /existential
     16#05 /emptyset        16#06 /Delta               16#07 /gradient
     16#08 /element         16#09 /notelement          16#0b /suchthat
     16#0f /product         16#11 /summation           16#12 /minus
     16#15 /fraction        16#17 /asteriskmath        16#19 /bullet
     16#1a /radical         16#1d /proportional        16#1e /infinity
     16#20 /angle           16#23 /bar                 16#27 /logicaland
     16#28 /logicalor       16#29 /intersection        16#2a /union
     16#2b /integral        16#34 /therefore           16#36 /colon
     16#3c /similar         16#45 /congruent           16#48 /approxequal
     16#60 /notequal        16#61 /equivalence         16#64 /lessequal
     16#65 /greaterequal    16#82 /propersubset        16#83 /propersuperset
     16#86 /reflexsubset    16#87 /reflexsuperset      16#95 /circleplus
     16#97 /circlemultiply  16#a5 /perpendicular       16#03 /existential
     16#c0 /logicaland      16#c1 /logicalor           16#c2 /intersection
     16#c3 /union           16#c4 /diamond             16#c5 /dotmath
  >> vg&redef
  def

% Unicode arrows encoding (unicode codes \u2190-\u21ff)
% Also includes those "Letterlike" unicode characters
% which are available in the symbol font. (unicode codes \u2100-\u214f)
/UCArrowsEncoding
  NullEncoding dup length array copy
  << 16#11 /Ifraktur        16#1c /Rfraktur            16#22 /trademarkserif
     16#35 /aleph
     16#90 /arrowleft       16#91 /arrowup             16#92 /arrowright
     16#93 /arrowdown       16#94 /arrowboth           16#d0 /arrowdblleft
     16#d1 /arrowdblup      16#d2 /arrowdblright       16#d3 /arrowdbldown
     16#d4 /arrowdblboth
  >> vg&redef
  def

/ZapfDingbats findfont /Encoding get
dup length array copy /UCDingbatsEncoding exch def
16#20 1 16#7f {
  dup 16#20 sub exch
  UCDingbatsEncoding exch get
  UCDingbatsEncoding 3 1 roll put
} for
16#a0 1 16#ff {
  dup 16#40 sub exch
  UCDingbatsEncoding exch get
  UCDingbatsEncoding 3 1 roll put
} for
UCDingbatsEncoding [ 16#c0 1 16#ff {} for ] vg&undef
[ 16#00  16#05 16#0a 16#0b  16#28 16#4c 16#4e  16#53 16#54 16#55  16#57 16#5f
  16#60  16#68 16#69 16#6a  16#6b 16#6c 16#6d  16#6e 16#6f 16#70  16#71 16#72
  16#73  16#74 16#75 16#95  16#96 16#97 16#b0  16#bf
] vg&undef pop

% Define the base fonts which don't change.
/Undefined-UC NullEncoding       /Helvetica    vg&newbasefont pop
/MathOps-UC   UCMathOpsEncoding  /Symbol       vg&newbasefont pop
/Arrows-UC    UCArrowsEncoding   /Symbol       vg&newbasefont pop
/Dingbats-UC  UCDingbatsEncoding /ZapfDingbats vg&newbasefont pop

% Make the SansSerif composite fonts.
/SansSerif /Helvetica 16#00 vg&newcompositefont
/SansSerif-Bold /Helvetica-Bold 16#01 vg&newcompositefont
/SansSerif-Italic /Helvetica-Oblique 16#02 vg&newcompositefont
/SansSerif-BoldItalic /Helvetica-BoldOblique 16#03 vg&newcompositefont

% Make the Serif composite fonts.
/Serif /Times-Roman 16#00 vg&newcompositefont
/Serif-Bold /Times-Bold 16#01 vg&newcompositefont
/Serif-Italic /Times-Italic 16#02 vg&newcompositefont
/Serif-BoldItalic /Times-BoldItalic 16#03 vg&newcompositefont

% Make the Monospaced composite fonts.
/Monospaced /Courier 16#00 vg&newcompositefont
/Monospaced-Bold /Courier-Bold 16#01 vg&newcompositefont
/Monospaced-Italic /Courier-Oblique 16#02 vg&newcompositefont
/Monospaced-BoldItalic /Courier-BoldOblique 16#03 vg&newcompositefont

% Make the Dialog composite fonts.
/Dialog /Helvetica 16#00 vg&newcompositefont
/Dialog-Bold /Helvetica-Bold 16#01 vg&newcompositefont
/Dialog-Italic /Helvetica-Oblique 16#02 vg&newcompositefont
/Dialog-BoldItalic /Helvetica-BoldOblique 16#03 vg&newcompositefont

% Make the DialogInput composite fonts.
/DialogInput /Courier 16#00 vg&newcompositefont
/DialogInput-Bold /Courier-Bold 16#01 vg&newcompositefont
/DialogInput-Italic /Courier-Oblique 16#02 vg&newcompositefont
/DialogInput-BoldItalic /Courier-BoldOblique 16#03 vg&newcompositefont

% Make the Typewriter composite fonts (JDK 1.1 only).
/Typewriter /Courier 16#00 vg&newcompositefont
/Typewriter-Bold /Courier-Bold 16#01 vg&newcompositefont
/Typewriter-Italic /Courier-Oblique 16#02 vg&newcompositefont
/Typewriter-BoldItalic /Courier-BoldOblique 16#03 vg&newcompositefont


/cfontH {
 dup /fontsize exch def /SansSerif exch sf
 /vg&fontstyles [{cfontH} {cfontHB} {cfontHI} {cfontHBI}] def
} def
/cfontHB {
  dup /fontsize exch def /SansSerif-Bold exch sf
 /vg&fontstyles [{cfontH} {cfontHB} {cfontHI} {cfontHBI}] def
} def
/cfontHI {
 dup /fontsize exch def /SansSerif-Italic exch sf
 /vg&fontstyles [{cfontH} {cfontHB} {cfontHI} {cfontHBI}] def
} def
/cfontHBI {
 dup /fontsize exch def /SansSerif-BoldItalic exch sf
 /vg&fontstyles [{cfontH} {cfontHB} {cfontHI} {cfontHBI}] def
} def

/cfontT {
 dup /fontsize exch def /Serif exch sf
 /vg&fontstyles [{cfontT} {cfontTB} {cfontTI} {cfontTBI}] def
} def
/cfontTB {
 dup /fontsize exch def /Serif-Bold exch sf
 /vg&fontstyles [{cfontT} {cfontTB} {cfontTI} {cfontTBI}] def
} def
/cfontTI {
 dup /fontsize exch def /Serif-Italic exch sf
 /vg&fontstyles [{cfontT} {cfontTB} {cfontTI} {cfontTBI}] def
} def
/cfontTBI {
 dup /fontsize exch def /Serif-BoldItalic exch sf
 /vg&fontstyles [{cfontT} {cfontTB} {cfontTI} {cfontTBI}] def
} def

/cfontC {
 dup /fontsize exch def /Typewriter exch sf
 /vg&fontstyles [{cfontC} {cfontCB} {cfontCI} {cfontCBI}] def
} def
/cfontCB {
 dup /fontsize exch def /Typewriter-Bold exch sf
 /vg&fontstyles [{cfontC} {cfontCB} {cfontCI} {cfontCBI}] def
} def
/cfontCI {
 dup /fontsize exch def /Typewriter-Italic exch sf
 /vg&fontstyles [{cfontC} {cfontCB} {cfontCI} {cfontCBI}] def
} def
/cfontCBI {
 dup /fontsize exch def /Typewriter-BoldItalic exch sf
 /vg&fontstyles [{cfontC} {cfontCB} {cfontCI} {cfontCBI}] def
} def

% Darken or lighten the current color.
/darken {0.7 exch exp 3 copy
         q 4 -1 roll vg&C
         currentrgbcolor 3 {4 -2 roll mul} repeat
         3 array astore Q} def

/displayColorMap
<< /Cr   [1.00 0.00 0.00]       /Cg     [0.00 1.00 0.00]
   /Cb   [0.00 0.00 1.00]       /Cc     [1.00 0.00 0.00 0.00]
   /Cm   [0.00 1.00 0.00 0.00]  /Cy     [0.00 0.00 1.00 0.00]
   /Co   [1.00 0.78 0.00]       /Cp     [1.00 0.67 0.67]
   /Cw   [1   ]                 /Cgrl   [0.75]
   /Cgr  [0.50]                 /Cgrd   [0.25]
   /Ck   [0   ]
   /CGr  [1.00 0.00 0.00]       /CGg    [0.00 1.00 0.00]
   /CGb  [0.00 0.00 1.00]       /CGc    [1.00 0.00 0.00 0.00]
   /CGm  [0.00 1.00 0.00 0.00]  /CGy    [0.00 0.00 1.00 0.00]
   /CGo  [1.00 0.78 0.00]       /CGp    [1.00 0.67 0.67]
   /CGw  [1   ]                 /CGgrl  [0.75]
   /CGgr [0.50]                 /CGgrd  [0.25]
   /CGk  [0   ]
   /CIr  [1.00 0.00 0.00]       /CIg    [0.00 1.00 0.00]
   /CIb  [0.00 0.00 1.00]       /CIc    [1.00 0.00 0.00 0.00]
   /CIm  [0.00 1.00 0.00 0.00]  /CIy    [0.00 0.00 1.00 0.00]
   /CIo  [1.00 0.78 0.00]       /CIp    [1.00 0.67 0.67]
   /CIw  [1   ]                 /CIgrl  [0.75]
   /CIgr [0.50]                 /CIgrd  [0.25]
   /CIk  [0   ]
>> def

/printColorMap
<< /Cr   [1.00 0.33 0.33]       /Cg     [0.33 1.00 0.33]
   /Cb   [0.33 0.33 1.00]       /Cc     [1.00 0.00 0.00 0.00]
   /Cm   [0.00 1.00 0.00 0.00]  /Cy     [0.00 0.00 1.00 0.00]
   /Co   [1.00 0.78 0.00]       /Cp     [1.00 0.67 0.67]
   /Cw   [1   ]                 /Cgrl   [0.75]
   /Cgr  [0.50]                 /Cgrd   [0.25]
   /Ck   [0   ]
   /CGr  [1.00 0.33 0.33]       /CGg    [0.33 1.00 0.33]
   /CGb  [0.33 0.33 1.00]       /CGc    [1.00 0.00 0.00 0.00]
   /CGm  [0.00 1.00 0.00 0.00]  /CGy    [0.00 0.00 1.00 0.00]
   /CGo  [1.00 0.78 0.00]       /CGp    [1.00 0.67 0.67]
   /CGw  [1   ]                 /CGgrl  [0.75]
   /CGgr [0.50]                 /CGgrd  [0.25]
   /CGk  [0   ]
   /CIr  [1.00 0.33 0.33]       /CIg    [0.33 1.00 0.33]
   /CIb  [0.33 0.33 1.00]       /CIc    [1.00 0.00 0.00 0.00]
   /CIm  [0.00 1.00 0.00 0.00]  /CIy    [0.00 0.00 1.00 0.00]
   /CIo  [1.00 0.78 0.00]       /CIp    [1.00 0.67 0.67]
   /CIw  [1   ]                 /CIgrl  [0.75]
   /CIgr [0.50]                 /CIgrd  [0.25]
   /CIk  [0   ]
>> def

/grayColorMap
<< /Cr   [0   ]                 /Cg     [0   ]
   /Cb   [0   ]                 /Cc     [0   ]
   /Cm   [0   ]                 /Cy     [0   ]
   /Co   [0   ]                 /Cp     [0   ]
   /Cw   [0   ]                 /Cgrl   [0   ]
   /Cgr  [0   ]                 /Cgrd   [0   ]
   /Ck   [0   ]
   /CGr  [0.75]                 /CGg    [1   ]
   /CGb  [0.50]                 /CGc    [0.75]
   /CGm  [0.50]                 /CGy    [1   ]
   /CGo  [0.75]                 /CGp    [1   ]
   /CGw  [0   ]                 /CGgrl  [0.25]
   /CGgr [0.50]                 /CGgrd  [0.75]
   /CGk  [1   ]
   /CIr  [1   ]                 /CIg    [1   ]
   /CIb  [1   ]                 /CIc    [1   ]
   /CIm  [1   ]                 /CIy    [1   ]
   /CIo  [1   ]                 /CIp    [1   ]
   /CIw  [1   ]                 /CIgrl  [1   ]
   /CIgr [1   ]                 /CIgrd  [1   ]
   /CIk  [1   ]
>> def

/bwColorMap
<< /Cr   [0   ]                 /Cg     [0   ]
   /Cb   [0   ]                 /Cc     [0   ]
   /Cm   [0   ]                 /Cy     [0   ]
   /Co   [0   ]                 /Cp     [0   ]
   /Cw   [0   ]                 /Cgrl   [0   ]
   /Cgr  [0   ]                 /Cgrd   [0   ]
   /Ck   [0   ]
   /CGr  [1   ]                 /CGg    [1   ]
   /CGb  [1   ]                 /CGc    [1   ]
   /CGm  [1   ]                 /CGy    [1   ]
   /CGo  [1   ]                 /CGp    [1   ]
   /CGw  [0   ]                 /CGgrl  [1   ]
   /CGgr [1   ]                 /CGgrd  [1   ]
   /CGk  [1   ]
   /CIr  [1   ]                 /CIg    [1   ]
   /CIb  [1   ]                 /CIc    [1   ]
   /CIm  [1   ]                 /CIy    [1   ]
   /CIo  [1   ]                 /CIp    [1   ]
   /CIw  [1   ]                 /CIgrl  [1   ]
   /CIgr [1   ]                 /CIgrd  [1   ]
   /CIk  [1   ]
>> def

%
% The following routines handle the alignment of and printing of
% tagged strings.
%

% Predefine the bounding box values.
/bbllx 0 def /bblly 0 def /bburx 0 def /bbury 0 def

% This routine pops the first unicode character off of a string and returns
% the remainder of the string, the character code of first character,
% and a "true" if the string was non-zero length.
% <string>      popfirst <remaining string> <true>
% <null string> popfirst <false>
/popfirst {
  dup length 1 gt
    {dup 0 get /vg&fbyte exch def
     dup 1 get /vg&cbyte exch def
     dup length 2 sub 2 exch getinterval true}
    {pop false} ifelse
} def

% This routine shows a single unicode character given the font and
% character codes.
% <font code> <char code> unicharshow --
/unicharshow {
  2 string
  dup 0 5 -1 roll put
  dup 1 4 -1 roll put
  internalshow
} def

% This is an internal routine to alternate between determining the
% bounding box for stringsize and showing the string for recshow.
% <string> internalshow --
/internalshow {show} def

% This is an internal routine to alternate between determining the
% bounding box for stringsize and stroking various ornaments.
% <string> internalstroke --
/internalstroke {S} def

% Sets up internalshow to use the null device to determine string size.
% -- nullinternalshow --
/nullinternalshow {/internalshow {false charpath flattenpath
                                  pathbbox updatebbox} def} def

% Sets up internalstroke to use the null device to determine string size.
% -- nullinternalstroke --
/nullinternalstroke {
 /internalstroke {flattenpath pathbbox updatebbox} def} def

% This routine tests to see if the character code matches the first
% character of a string.
% <char code> <string> testchar <char code> <true or false>
/testchar {exch dup 3 -1 roll 0 get eq} def

% Raise the text baseline for superscripts.
% -- raise --
/raise {
  0 fontsize 2 div rmoveto
  /fontsize fontsize 2 mul 3 div def
  currentfont /FontName get fontsize sf
} def

% Un-raise the text baseline for superscripts.
% -- unraise --
/unraise {
  /fontsize fontsize 1.5 mul def
  0 fontsize 2 div neg rmoveto
} def

% Lower the text baseline for subscripts.
% -- lower --
/lower {
  0 fontsize 3 div neg rmoveto
  /fontsize fontsize 2 mul 3 div def
  currentfont /FontName get fontsize sf
} def

% Un-lower the text baseline for subscripts.
% -- unlower --
/unlower {
  /fontsize fontsize 1.5 mul def
  0 fontsize 3 div rmoveto
} def

% Compare the top two elements on the stack and leave only the
% larger one.
/maxval {2 copy gt {pop} {exch pop} ifelse} def

% Tokenize a string.  Do not use the usual PostScript token because
% parentheses will not be interpreted correctly because of rescanning
% of the string.
/vg&token {/vg&string exch def /vg&index -1 def /vg&level 0 def
0 2 vg&string length 2 sub {
  dup dup 1 add exch vg&string exch get 8 bitshift vg&string 3 -1 roll get or
  dup 16#f0fe eq {pop 1}{16#f0ff eq {-1}{0} ifelse} ifelse
  /vg&level exch vg&level add def
  vg&level 0 eq {/vg&index exch def exit} if pop
} for
vg&index 0 ge {
  vg&string vg&index 2 add dup vg&string length exch sub getinterval
  vg&index 2 gt {vg&string 2 vg&index 2 sub getinterval}{()} ifelse
  true}
{false} ifelse
} bind def

% Recursively show an unicode string.
% <string> recshow --
/recshow {
  popfirst
  {
    % Test to see if this is a string attribute.
    vg&fbyte 16#f0 and 16#e0 eq
    {
      q

      % Font style.
      currentfont dup /FontStyleBits known {/FontStyleBits get}{pop 0} ifelse
      vg&cbyte or vg&fontstyles exch get fontsize exch exec

      vg&token pop recshow currentpoint Q m recshow
    }
    {
      vg&fbyte 16#F8 and 16#F0 eq {

        % Superscript and/or subscript.
        vg&cbyte 16#00 eq {
          vg&token pop exch vg&token pop 3 -1 roll
          q raise recshow unraise currentpoint pop Q exch
          q lower recshow unlower currentpoint pop Q
          maxval currentpoint exch pop m recshow } if

        % Strikeout.
        vg&cbyte 16#01 eq {
          vg&token pop currentpoint 3 -1 roll recshow
          q 0 J vg&underline vg&uthick w
          currentpoint 4 -2 roll fontsize 3 div add moveto
          fontsize 3 div add lineto internalstroke Q
          recshow} if

        % Underline.
        vg&cbyte 16#02 eq {
          vg&token pop currentpoint 3 -1 roll recshow
          q 0 J vg&underline vg&uthick w
          currentpoint 4 -2 roll vg&uoffset add moveto
          vg&uoffset add lineto internalstroke Q
          recshow} if

        % Dashed underline.
        vg&cbyte 16#03 eq {
          vg&token pop currentpoint 3 -1 roll recshow
          q 0 J [ vg&uthick 5 mul vg&uthick 2 mul] 0 d
          vg&underline vg&uthick w
          currentpoint 4 -2 roll vg&uoffset add moveto
          vg&uoffset add lineto internalstroke Q
          recshow} if

        % Dotted underline.
        vg&cbyte 16#04 eq {
          vg&token pop currentpoint 3 -1 roll recshow
          q 1 J [ 0 vg&uthick 3 mul] 0 d
          vg&underline vg&uthick w
          currentpoint 4 -2 roll vg&uoffset add moveto
          vg&uoffset add lineto internalstroke Q
          recshow} if

        % Thick underline.
        vg&cbyte 16#05 eq {
          vg&token pop currentpoint 3 -1 roll recshow
          q 0 J vg&underline vg&uthick 2 mul w
          currentpoint 4 -2 roll vg&uoffset vg&uthick 2 div sub add moveto
          vg&uoffset vg&uthick 2 div sub add lineto internalstroke Q
          recshow} if

        % Gray thick underline.
        vg&cbyte 16#06 eq {
          vg&token pop currentpoint 3 -1 roll recshow
          q 0 J vg&underline vg&uthick 2 mul w 0.5 setgray
          currentpoint 4 -2 roll vg&uoffset vg&uthick 2 div sub add moveto
          vg&uoffset vg&uthick 2 div sub add lineto internalstroke Q
          recshow} if

        % Overbar.
        vg&cbyte 16#07 eq {
          vg&token pop dup stringsize relative 4 1 roll pop pop exch
          3 -1 roll recshow
          q 0 J vg&underline vg&uthick w
          vg&uoffset neg add dup currentpoint pop exch m l internalstroke Q
          recshow} if
      }
      {
        vg&fbyte vg&cbyte unicharshow recshow
      } ifelse
    } ifelse
  } if
} def

% Get the underline position and thickness from the current font.
/vg&underline {

currentfont dup /FontType get 0 eq {/FDepVector get 0 get} if
dup dup /FontInfo known {
  /FontInfo get dup
  dup /UnderlinePosition known {
    /UnderlinePosition get /vg&uoffset exch def
  }
  {
    pop /vg&uoffset 0 def
  } ifelse
  dup /UnderlineThickness known {
    /UnderlineThickness get /vg&uthick exch def
  }
  {
    pop /vg&uthick 0 def
  } ifelse
}
{
  pop /vg&uoffset 0 def /vg&uthick 0 def
} ifelse
/FontMatrix get
currentfont dup /FontType get 0 eq
{/FontMatrix get matrix concatmatrix}{pop} ifelse
dup 0 vg&uoffset 3 -1 roll transform /vg&uoffset exch def pop
0 vg&uthick 3 -1 roll transform /vg&uthick exch def pop
} def

% Make a frame with the coordinates on the stack.
% <llx> <lly> <urx> <ury> frame --
/frame {4 copy m 3 1 roll exch l 4 -2 roll l l h} def

% Resets the accumulated bounding box to a degenerate box at the
% current point.
% -- resetbbox --
/resetbbox {
  currentpoint 2 copy
  /bbury exch def
  /bburx exch def
  /bblly exch def
  /bbllx exch def
} def

% Update the accumulated bounding box.
% <llx'> <lly'> <urx'> <ury'> updatebbox --
/updatebbox {
  dup bbury gt {/bbury exch def} {pop} ifelse
  dup bburx gt {/bburx exch def} {pop} ifelse
  dup bblly lt {/bblly exch def} {pop} ifelse
  dup bbllx lt {/bbllx exch def} {pop} ifelse
} def

% Set the bounding box to the values on the stack.
% <llx'> <lly'> <urx'> <ury'> updatebbox --
/restorebbox {
  /bbury exch def /bburx exch def /bblly exch def /bbllx exch def
} def

% Push the accumulated bounding box onto the stack.
% -- pushbbox <llx> <lly> <urx> <ury>
/pushbbox {bbllx bblly bburx bbury} def

% Make the relative bounding box relative to the currentpoint.
% <llx'> <lly'> <urx'> <ury'> inflate <llx> <lly> <urx> <ury>
/inflate {
  2 {fontsize 0.2 mul add 4 1 roll} repeat
  2 {fontsize 0.2 mul sub 4 1 roll} repeat
} def

% Make the relative bounding box relative to the currentpoint.
% <llx'> <lly'> <urx'> <ury'> relative <llx> <lly> <urx> <ury>
/relative {
  currentpoint 3 -1 roll add 3 1 roll add exch 4 2 roll
  currentpoint 3 -1 roll add 3 1 roll add exch 4 2 roll
} def

% Returns the size of a string appropriate for recshow.
% <string> stringsize <llx> <lly> <urx> <ury>
/stringsize {
  pushbbox /internalshow load /internalstroke load 7 -1 roll
  q
  nulldevice 0 0 m
  nullinternalshow nullinternalstroke
  resetbbox
  recshow
  /internalstroke exch def /internalshow exch def
  pushbbox 8 -4 roll restorebbox
  Q
} def

% Calculate values for string positioning.
/calcval {4 copy
  3 -1 roll sub /widy exch def sub neg /widx exch def
  pop pop /dy exch def /dx exch def} def

% Utilities to position a string.
% First letter (U=upper, C=center, B=baseline, L=lower)
% Second letter (L=left, C=center, R=right)
/align [
{calcval dx neg widy dy add neg rmoveto} % UL
{calcval dx neg widy 2 div dy add neg rmoveto} % CL
{calcval dx neg 0 rmoveto} % BL
{calcval dx neg dy neg rmoveto} % LL
{calcval widx dx add neg widy dy add neg rmoveto} % UR
{calcval widx dx add neg widy 2 div dy add neg rmoveto} % CR
{calcval widx dx add neg 0 rmoveto} % BR
{calcval widx dx add neg dy neg rmoveto} % LR
{calcval widx 2 div dx add neg widy dy add neg rmoveto} % UC
{calcval widx 2 div dx add neg widy 2 div dy add neg rmoveto} % CC
{calcval widx 2 div dx add neg 0 rmoveto} % BC
{calcval widx 2 div dx add neg dy neg rmoveto} % LC
] def

/vg&str {m q 1 -1 scale dup stringsize 4 copy align 11 -1 roll get exec
         q inflate relative frame exch exec Q recshow Q} def

end /procDict exch def
%%EndProlog

%%BeginSetup
save
procDict begin
printColorMap begin
959 1111 setpagesize
0 0 0 0 setmargins
0 0 setorigin
959 1111 setsize
naturalsize
portrait
imagescale
cliptobounds
setbasematrix
/Helvetica 10 sf
defaultGraphicsState
%%EndSetup

0.00000 0.00000 0.00000 RG
[ 1.00000 0.00000 0.00000 1.00000 0.00000 0.00000 ] defaultmatrix matrix concatmatrix setmatrix
cliprestore
1.00000 1.00000 1.00000 RG
newpath
0.00000 0.00000 m
959.000 0.00000 l
959.000 1111.00 l
0.00000 1111.00 l
0.00000 0.00000 l
h
f
0.00000 0.00000 0.00000 RG
0.00000 0.00000 0.00000 RG
[ 1.00000 0.00000 0.00000 1.00000 0.00000 0.00000 ] defaultmatrix matrix concatmatrix setmatrix
cliprestore
1.00000 1.00000 1.00000 RG
newpath
0.00000 0.00000 m
959.000 0.00000 l
959.000 1111.00 l
0.00000 1111.00 l
0.00000 0.00000 l
h
f
0.00000 0.00000 0.00000 RG
0 0 959 1111 rc
q
[ 1.00000 0.00000 0.00000 1.00000 0.00000 0.00000 ] concat
[ 1.00000 0.00000 0.00000 1.00000 434.000 628.000 ] concat
1.00000 1.00000 1.00000 RG
newpath
-434.000 -628.000 m
525.000 -628.000 l
525.000 483.000 l
-434.000 483.000 l
-434.000 -628.000 l
h
f
0.00000 0.00000 0.00000 RG
[ 1.00000 0.00000 0.00000 1.00000 434.000 628.000 ] defaultmatrix matrix concatmatrix setmatrix
[ 1.00000 0.00000 0.00000 1.00000 434.000 628.000 ] defaultmatrix matrix concatmatrix setmatrix
[ 1.00000 0.00000 0.00000 1.00000 0.00000 0.00000 ] defaultmatrix matrix concatmatrix setmatrix
[ 1.00000 0.00000 0.00000 1.00000 434.000 628.000 ] defaultmatrix matrix concatmatrix setmatrix
<< /PatternType 2
   /Shading
   << /ShadingType 2
      /ColorSpace /DeviceRGB
      /Coords [-110.21060180664062 -494.650390625 505.8404541015625 -494.650390625]
      /Function
      << /FunctionType 2
         /Domain [0 1]
         /Range [0 1 0 1 0 1]
         /C0 [0.7529412 0.7529412 0.7529412]
         /C1 [1.0 1.0 1.0]
         /N 1
      >>
      /Extend [true true]
   >>
>>
matrix makepattern setpattern
newpath
-418.236 -490.650 m
-418.236 -427.157 l
-418.236 -424.948 -416.445 -423.157 -414.236 -423.157  c
501.840 -423.157 l
504.050 -423.157 505.840 -424.948 505.840 -427.157  c
505.840 -490.650 l
505.840 -492.860 504.050 -494.650 501.840 -494.650  c
-414.236 -494.650 l
-416.445 -494.650 -418.236 -492.860 -418.236 -490.650  c
h
f
0 J
1.45000 M
[ 6.00000 2.00000 ] 0.00000 d
0.00000 0.00000 0.00000 RG
newpath
-418.236 -490.650 m
-418.236 -427.157 l
-418.236 -424.948 -416.445 -423.157 -414.236 -423.157  c
501.840 -423.157 l
504.050 -423.157 505.840 -424.948 505.840 -427.157  c
505.840 -490.650 l
505.840 -492.860 504.050 -494.650 501.840 -494.650  c
-414.236 -494.650 l
-416.445 -494.650 -418.236 -492.860 -418.236 -490.650  c
h
S
2 J
10.0000 M
[ ] 0.00000 d
.752941 .752941 .752941 RG
newpath
110.577 -473.805 m
146.422 -473.805 l
146.422 -443.805 l
110.577 -443.805 l
110.577 -473.805 l
h
f
0 J
1.45000 M
0.00000 0.00000 0.00000 RG
newpath
110.577 -473.805 m
146.422 -473.805 l
146.422 -443.805 l
110.577 -443.805 l
110.577 -473.805 l
h
S
2 J
10.0000 M
0 J
1.45000 M
q
[ 1.00000 0.00000 0.00000 -1.00000 112.991 -451.735 ] concat
0.00000 0.00000 moveto
/Helvetica findfont 18 scalefont setfont 15.0000 cfontH
(\000Y\000e\000s) recshow
Q
2 J
10.0000 M
.752941 .752941 .752941 RG
newpath
271.858 -473.904 m
310.626 -473.904 l
310.626 -443.904 l
271.858 -443.904 l
271.858 -473.904 l
h
f
0 J
1.45000 M
0.00000 0.00000 0.00000 RG
newpath
271.858 -473.904 m
310.626 -473.904 l
310.626 -443.904 l
271.858 -443.904 l
271.858 -473.904 l
h
S
2 J
10.0000 M
0 J
1.45000 M
q
[ 1.00000 0.00000 0.00000 -1.00000 279.737 -451.833 ] concat
0.00000 0.00000 moveto
/Helvetica findfont 18 scalefont setfont 15.0000 cfontH
(\000N\000o) recshow
Q
2 J
10.0000 M
1.00000 1.00000 1.00000 RG
newpath
-403.236 -474.324 m
3.25486 -474.324 l
48.4205 -459.324 l
3.25486 -444.324 l
-403.236 -444.324 l
-358.070 -459.324 l
h
f*
0 J
1.45000 M
0.00000 0.00000 0.00000 RG
newpath
-403.236 -474.324 m
3.25486 -474.324 l
48.4205 -459.324 l
3.25486 -444.324 l
-403.236 -444.324 l
-358.070 -459.324 l
h
S
2 J
10.0000 M
0 J
1.45000 M
q
[ 1.00000 0.00000 0.00000 -1.00000 -322.999 -452.253 ] concat
0.00000 0.00000 moveto
/Helvetica findfont 18 scalefont setfont 15.0000 cfontH
(\000D\000e\000v\000e\000l\000o\000p\000m\000e\000n\000t\000 \000:\000 \000A\000c\000t\000i\000o\000n\000 \000o\000f\000 \000p\000h\000o\000t\000o\000p\000e\000r\000i\000o\000d) recshow
Q
2 J
10.0000 M
<< /PatternType 2
   /Shading
   << /ShadingType 2
      /ColorSpace /DeviceRGB
      /Coords [-108.4557113647461 -420.9985656738281 505.3948059082031 -420.9985656738281]
      /Function
      << /FunctionType 2
         /Domain [0 1]
         /Range [0 1 0 1 0 1]
         /C0 [0.7529412 0.7529412 0.7529412]
         /C1 [1.0 1.0 1.0]
         /N 1
      >>
      /Extend [true true]
   >>
>>
matrix makepattern setpattern
newpath
-415.381 -416.999 m
-415.381 -320.809 l
-415.381 -318.600 -413.590 -316.809 -411.381 -316.809  c
501.395 -316.809 l
503.604 -316.809 505.395 -318.600 505.395 -320.809  c
505.395 -416.999 l
505.395 -419.208 503.604 -420.999 501.395 -420.999  c
-411.381 -420.999 l
-413.590 -420.999 -415.381 -419.208 -415.381 -416.999  c
h
f
0 J
1.45000 M
[ 6.00000 2.00000 ] 0.00000 d
0.00000 0.00000 0.00000 RG
newpath
-415.381 -416.999 m
-415.381 -320.809 l
-415.381 -318.600 -413.590 -316.809 -411.381 -316.809  c
501.395 -316.809 l
503.604 -316.809 505.395 -318.600 505.395 -320.809  c
505.395 -416.999 l
505.395 -419.208 503.604 -420.999 501.395 -420.999  c
-411.381 -420.999 l
-413.590 -420.999 -415.381 -419.208 -415.381 -416.999  c
h
S
2 J
10.0000 M
[ ] 0.00000 d
.752941 .752941 .752941 RG
newpath
162.000 -396.677 m
318.000 -396.677 l
318.000 -347.677 l
162.000 -347.677 l
162.000 -396.677 l
h
f
0 J
1.45000 M
0.00000 0.00000 0.00000 RG
newpath
162.000 -396.677 m
318.000 -396.677 l
318.000 -347.677 l
162.000 -347.677 l
162.000 -396.677 l
h
S
2 J
10.0000 M
0 J
1.45000 M
q
[ 1.00000 0.00000 0.00000 -1.00000 185.468 -376.132 ] concat
0.00000 0.00000 moveto
/Helvetica findfont 18 scalefont setfont 15.0000 cfontH
(\000V\000e\000r\000n\000a\000l\000i\000s\000a\000t\000i\000o\000n\000 ) recshow
Q
q
[ 1.00000 0.00000 0.00000 -1.00000 187.477 -354.080 ] concat
0.00000 0.00000 moveto
/Helvetica findfont 18 scalefont setfont 15.0000 cfontH
(\000r\000e\000q\000u\000i\000r\000e\000m\000e\000n\000t\000s) recshow
Q
2 J
10.0000 M
.752941 .752941 .752941 RG
newpath
325.547 -398.398 m
483.214 -398.398 l
483.214 -347.398 l
325.547 -347.398 l
325.547 -398.398 l
h
f
0 J
1.45000 M
0.00000 0.00000 0.00000 RG
newpath
325.547 -398.398 m
483.214 -398.398 l
483.214 -347.398 l
325.547 -347.398 l
325.547 -398.398 l
h
S
2 J
10.0000 M
0 J
1.45000 M
q
[ 1.00000 0.00000 0.00000 -1.00000 360.870 -376.853 ] concat
0.00000 0.00000 moveto
/Helvetica findfont 18 scalefont setfont 15.0000 cfontH
(\000D\000o\000r\000m\000a\000n\000c\000y\000 ) recshow
Q
q
[ 1.00000 0.00000 0.00000 -1.00000 351.857 -354.801 ] concat
0.00000 0.00000 moveto
/Helvetica findfont 18 scalefont setfont 15.0000 cfontH
(\000r\000e\000q\000u\000i\000r\000e\000m\000e\000n\000t\000s) recshow
Q
2 J
10.0000 M
.752941 .752941 .752941 RG
newpath
9.03373 -396.585 m
146.990 -396.585 l
146.990 -348.585 l
9.03373 -348.585 l
9.03373 -396.585 l
h
f
0 J
1.45000 M
0.00000 0.00000 0.00000 RG
newpath
9.03373 -396.585 m
146.990 -396.585 l
146.990 -348.585 l
9.03373 -348.585 l
9.03373 -396.585 l
h
S
2 J
10.0000 M
0 J
1.45000 M
q
[ 1.00000 0.00000 0.00000 -1.00000 64.0063 -376.540 ] concat
0.00000 0.00000 moveto
/Helvetica findfont 18 scalefont setfont 15.0000 cfontH
(\000N\000o\000 ) recshow
Q
q
[ 1.00000 0.00000 0.00000 -1.00000 25.4882 -354.489 ] concat
0.00000 0.00000 moveto
/Helvetica findfont 18 scalefont setfont 15.0000 cfontH
(\000r\000e\000q\000u\000i\000r\000e\000m\000e\000n\000t\000s) recshow
Q
2 J
10.0000 M
1.00000 1.00000 1.00000 RG
newpath
-400.381 -388.944 m
-50.6124 -388.944 l
-11.7492 -373.944 l
-50.6124 -358.944 l
-400.381 -358.944 l
-361.518 -373.944 l
h
f*
0 J
1.45000 M
0.00000 0.00000 0.00000 RG
newpath
-400.381 -388.944 m
-50.6124 -388.944 l
-11.7492 -373.944 l
-50.6124 -358.944 l
-400.381 -358.944 l
-361.518 -373.944 l
h
S
2 J
10.0000 M
0 J
1.45000 M
q
[ 1.00000 0.00000 0.00000 -1.00000 -345.134 -366.873 ] concat
0.00000 0.00000 moveto
/Helvetica findfont 18 scalefont setfont 15.0000 cfontH
(\000D\000e\000v\000e\000l\000o\000p\000m\000e\000n\000t\000 \000:\000 \000C\000o\000l\000d\000 \000r\000e\000q\000u\000i\000e\000r\000e\000m\000e\000n\000t\000s) recshow
Q
2 J
10.0000 M
.600000 .800000 0.00000 RG
4.00000 w
0 J
1.45000 M
newpath
146.422 -444.881 m
208.466 -396.677 l
S
1.00000 w
2 J
10.0000 M
0.00000 0.00000 0.00000 RG
1.00000 1.00000 0.00000 RG
4.00000 w
0 J
1.45000 M
newpath
310.626 -446.746 m
387.697 -398.408 l
S
1.00000 w
2 J
10.0000 M
0.00000 0.00000 0.00000 RG
.800000 .600000 1.00000 RG
4.00000 w
0 J
1.45000 M
newpath
310.626 -444.168 m
370.836 -398.398 l
S
1.00000 w
2 J
10.0000 M
0.00000 0.00000 0.00000 RG
0.00000 1.00000 1.00000 RG
4.00000 w
0 J
1.45000 M
newpath
271.858 -451.057 m
137.298 -396.585 l
S
1.00000 w
2 J
10.0000 M
0.00000 0.00000 0.00000 RG
1.00000 .400000 0.00000 RG
4.00000 w
0 J
1.45000 M
newpath
271.858 -453.128 m
82.1117 -396.589 l
S
1.00000 w
2 J
10.0000 M
0.00000 0.00000 0.00000 RG
<< /PatternType 2
   /Shading
   << /ShadingType 2
      /ColorSpace /DeviceRGB
      /Coords [-107.1448974609375 -311.8487243652344 505.8349914550781 -311.8487243652344]
      /Function
      << /FunctionType 2
         /Domain [0 1]
         /Range [0 1 0 1 0 1]
         /C0 [0.7529412 0.7529412 0.7529412]
         /C1 [1.0 1.0 1.0]
         /N 1
      >>
      /Extend [true true]
   >>
>>
matrix makepattern setpattern
newpath
-413.635 -307.849 m
-413.635 -198.660 l
-413.635 -196.451 -411.844 -194.660 -409.635 -194.660  c
501.835 -194.660 l
504.044 -194.660 505.835 -196.451 505.835 -198.660  c
505.835 -307.849 l
505.835 -310.058 504.044 -311.849 501.835 -311.849  c
-409.635 -311.849 l
-411.844 -311.849 -413.635 -310.058 -413.635 -307.849  c
h
f
0 J
1.45000 M
[ 6.00000 2.00000 ] 0.00000 d
0.00000 0.00000 0.00000 RG
newpath
-413.635 -307.849 m
-413.635 -198.660 l
-413.635 -196.451 -411.844 -194.660 -409.635 -194.660  c
501.835 -194.660 l
504.044 -194.660 505.835 -196.451 505.835 -198.660  c
505.835 -307.849 l
505.835 -310.058 504.044 -311.849 501.835 -311.849  c
-409.635 -311.849 l
-411.844 -311.849 -413.635 -310.058 -413.635 -307.849  c
h
S
2 J
10.0000 M
[ ] 0.00000 d
1.00000 1.00000 1.00000 RG
newpath
-398.635 -276.849 m
-160.169 -276.849 l
-133.673 -261.849 l
-160.169 -246.849 l
-398.635 -246.849 l
-372.139 -261.849 l
h
f*
0 J
1.45000 M
0.00000 0.00000 0.00000 RG
newpath
-398.635 -276.849 m
-160.169 -276.849 l
-133.673 -261.849 l
-160.169 -246.849 l
-398.635 -246.849 l
-372.139 -261.849 l
h
S
2 J
10.0000 M
0 J
1.45000 M
q
[ 1.00000 0.00000 0.00000 -1.00000 -345.198 -254.778 ] concat
0.00000 0.00000 moveto
/Helvetica findfont 18 scalefont setfont 15.0000 cfontH
(\000L\000e\000a\000f\000 \000s\000u\000r\000f\000a\000c\000e\000 \000g\000r\000o\000w\000t\000h) recshow
Q
2 J
10.0000 M
.752941 .752941 .752941 RG
newpath
186.994 -296.849 m
225.728 -296.849 l
225.728 -266.849 l
186.994 -266.849 l
186.994 -296.849 l
h
f
0 J
1.45000 M
0.00000 0.00000 0.00000 RG
newpath
186.994 -296.849 m
225.728 -296.849 l
225.728 -266.849 l
186.994 -266.849 l
186.994 -296.849 l
h
S
2 J
10.0000 M
0 J
1.45000 M
q
[ 1.00000 0.00000 0.00000 -1.00000 192.852 -274.778 ] concat
0.00000 0.00000 moveto
/Helvetica findfont 18 scalefont setfont 15.0000 cfontH
(\000L\000A\000I) recshow
Q
2 J
10.0000 M
.752941 .752941 .752941 RG
newpath
-17.0059 -293.849 m
77.0059 -293.849 l
77.0059 -263.849 l
-17.0059 -263.849 l
-17.0059 -293.849 l
h
f
0 J
1.45000 M
0.00000 0.00000 0.00000 RG
newpath
-17.0059 -293.849 m
77.0059 -293.849 l
77.0059 -263.849 l
-17.0059 -263.849 l
-17.0059 -293.849 l
h
S
2 J
10.0000 M
0 J
1.45000 M
q
[ 1.00000 0.00000 0.00000 -1.00000 -9.51562 -271.778 ] concat
0.00000 0.00000 moveto
/Helvetica findfont 18 scalefont setfont 15.0000 cfontH
(\000S\000o\000i\000l\000 \000c\000o\000v\000e\000r) recshow
Q
2 J
10.0000 M
.752941 .752941 .752941 RG
newpath
-82.7529 -243.849 m
61.9941 -243.849 l
61.9941 -213.849 l
-82.7529 -213.849 l
-82.7529 -243.849 l
h
f
0 J
1.45000 M
0.00000 0.00000 0.00000 RG
newpath
-82.7529 -243.849 m
61.9941 -243.849 l
61.9941 -213.849 l
-82.7529 -213.849 l
-82.7529 -243.849 l
h
S
2 J
10.0000 M
0 J
1.45000 M
q
[ 1.00000 0.00000 0.00000 -1.00000 -60.4287 -221.778 ] concat
0.00000 0.00000 moveto
/Helvetica findfont 18 scalefont setfont 15.0000 cfontH
(\000I\000n\000d\000e\000p\000e\000n\000d\000e\000n\000t) recshow
Q
2 J
10.0000 M
.752941 .752941 .752941 RG
newpath
164.584 -239.660 m
478.191 -239.660 l
478.191 -209.660 l
164.584 -209.660 l
164.584 -239.660 l
h
f
0 J
1.45000 M
0.00000 0.00000 0.00000 RG
newpath
164.584 -239.660 m
478.191 -239.660 l
478.191 -209.660 l
164.584 -209.660 l
164.584 -239.660 l
h
S
2 J
10.0000 M
0 J
1.45000 M
q
[ 1.00000 0.00000 0.00000 -1.00000 196.820 -217.589 ] concat
0.00000 0.00000 moveto
/Helvetica findfont 18 scalefont setfont 15.0000 cfontH
(\000C\000o\000m\000p\000e\000t\000i\000t\000i\000o\000n\000 \000w\000i\000t\000h\000 \000s\000t\000o\000r\000a\000g\000e\000 \000o\000r\000g\000a\000n) recshow
Q
2 J
10.0000 M
.600000 .800000 0.00000 RG
4.00000 w
0 J
1.45000 M
newpath
230.876 -347.677 m
211.947 -296.849 l
S
1.00000 w
2 J
10.0000 M
0.00000 0.00000 0.00000 RG
0.00000 1.00000 1.00000 RG
4.00000 w
0 J
1.45000 M
newpath
111.960 -348.585 m
186.994 -295.540 l
S
1.00000 w
2 J
10.0000 M
0.00000 0.00000 0.00000 RG
.800000 .600000 1.00000 RG
4.00000 w
0 J
1.45000 M
newpath
348.921 -347.398 m
225.728 -290.754 l
S
1.00000 w
2 J
10.0000 M
0.00000 0.00000 0.00000 RG
1.00000 1.00000 0.00000 RG
4.00000 w
0 J
1.45000 M
newpath
390.811 -347.394 m
225.720 -276.477 l
S
1.00000 w
2 J
10.0000 M
0.00000 0.00000 0.00000 RG
1.00000 .400000 0.00000 RG
4.00000 w
0 J
1.45000 M
newpath
59.3385 -348.574 m
186.994 -290.638 l
S
1.00000 w
2 J
10.0000 M
0.00000 0.00000 0.00000 RG
.600000 .800000 0.00000 RG
4.00000 w
0 J
1.45000 M
newpath
186.994 -277.113 m
50.9622 -243.849 l
S
1.00000 w
2 J
10.0000 M
0.00000 0.00000 0.00000 RG
1.00000 1.00000 0.00000 RG
4.00000 w
0 J
1.45000 M
newpath
191.548 -266.841 m
62.0136 -224.972 l
S
1.00000 w
2 J
10.0000 M
0.00000 0.00000 0.00000 RG
1.00000 .400000 0.00000 RG
4.00000 w
0 J
1.45000 M
newpath
186.994 -278.664 m
-24.7396 -243.846 l
S
1.00000 w
2 J
10.0000 M
0.00000 0.00000 0.00000 RG
0.00000 1.00000 1.00000 RG
4.00000 w
0 J
1.45000 M
newpath
225.728 -272.220 m
291.217 -239.660 l
S
1.00000 w
2 J
10.0000 M
0.00000 0.00000 0.00000 RG
.800000 .600000 1.00000 RG
4.00000 w
0 J
1.45000 M
newpath
225.728 -275.928 m
344.333 -239.671 l
S
1.00000 w
2 J
10.0000 M
0.00000 0.00000 0.00000 RG
<< /PatternType 2
   /Shading
   << /ShadingType 2
      /ColorSpace /DeviceRGB
      /Coords [-106.97433471679688 -193.5183868408203 506.56817626953125 -193.5183868408203]
      /Function
      << /FunctionType 2
         /Domain [0 1]
         /Range [0 1 0 1 0 1]
         /C0 [0.7529412 0.7529412 0.7529412]
         /C1 [1.0 1.0 1.0]
         /N 1
      >>
      /Extend [true true]
   >>
>>
matrix makepattern setpattern
newpath
-413.746 -189.518 m
-413.746 -91.9168 l
-413.746 -89.7077 -411.955 -87.9168 -409.746 -87.9168  c
502.568 -87.9168 l
504.777 -87.9168 506.568 -89.7077 506.568 -91.9168  c
506.568 -189.518 l
506.568 -191.728 504.777 -193.518 502.568 -193.518  c
-409.746 -193.518 l
-411.955 -193.518 -413.746 -191.728 -413.746 -189.518  c
h
f
0 J
1.45000 M
[ 6.00000 2.00000 ] 0.00000 d
0.00000 0.00000 0.00000 RG
newpath
-413.746 -189.518 m
-413.746 -91.9168 l
-413.746 -89.7077 -411.955 -87.9168 -409.746 -87.9168  c
502.568 -87.9168 l
504.777 -87.9168 506.568 -89.7077 506.568 -91.9168  c
506.568 -189.518 l
506.568 -191.728 504.777 -193.518 502.568 -193.518  c
-409.746 -193.518 l
-411.955 -193.518 -413.746 -191.728 -413.746 -189.518  c
h
S
2 J
10.0000 M
[ ] 0.00000 d
1.00000 1.00000 1.00000 RG
newpath
-398.746 -162.417 m
-144.364 -162.417 l
-116.100 -147.417 l
-144.364 -132.417 l
-398.746 -132.417 l
-370.481 -147.417 l
h
f*
0 J
1.45000 M
0.00000 0.00000 0.00000 RG
newpath
-398.746 -162.417 m
-144.364 -162.417 l
-116.100 -147.417 l
-144.364 -132.417 l
-398.746 -132.417 l
-370.481 -147.417 l
h
S
2 J
10.0000 M
0 J
1.45000 M
q
[ 1.00000 0.00000 0.00000 -1.00000 -344.478 -140.346 ] concat
0.00000 0.00000 moveto
/Helvetica findfont 18 scalefont setfont 15.0000 cfontH
(\000R\000a\000d\000i\000a\000t\000i\000o\000n\000 \000i\000n\000t\000e\000r\000c\000e\000p\000t\000i\000o\000n) recshow
Q
2 J
10.0000 M
.752941 .752941 .752941 RG
newpath
-29.4331 -167.417 m
146.667 -167.417 l
146.667 -109.417 l
-29.4331 -109.417 l
-29.4331 -167.417 l
h
f
0 J
1.45000 M
0.00000 0.00000 0.00000 RG
newpath
-29.4331 -167.417 m
146.667 -167.417 l
146.667 -109.417 l
-29.4331 -109.417 l
-29.4331 -167.417 l
h
S
2 J
10.0000 M
0 J
1.45000 M
q
[ 1.00000 0.00000 0.00000 -1.00000 -14.9253 -142.372 ] concat
0.00000 0.00000 moveto
/Helvetica findfont 18 scalefont setfont 15.0000 cfontH
(\000H\000o\000m\000o\000g\000e\000n\000o\000u\000s\000 \000c\000r\000o\000p) recshow
Q
q
[ 1.00000 0.00000 0.00000 -1.00000 17.3833 -120.320 ] concat
0.00000 0.00000 moveto
/Helvetica findfont 18 scalefont setfont 15.0000 cfontH
(\000B\000e\000e\000r\000'\000s\000 \000l\000a\000w) recshow
Q
2 J
10.0000 M
.752941 .752941 .752941 RG
newpath
247.067 -164.917 m
412.824 -164.917 l
412.824 -106.917 l
247.067 -106.917 l
247.067 -164.917 l
h
f
0 J
1.45000 M
0.00000 0.00000 0.00000 RG
newpath
247.067 -164.917 m
412.824 -164.917 l
412.824 -106.917 l
247.067 -106.917 l
247.067 -164.917 l
h
S
2 J
10.0000 M
0 J
1.45000 M
q
[ 1.00000 0.00000 0.00000 -1.00000 283.930 -139.872 ] concat
0.00000 0.00000 moveto
/Helvetica findfont 18 scalefont setfont 15.0000 cfontH
(\000C\000r\000o\000p\000 \000i\000n\000 \000r\000o\000w) recshow
Q
q
[ 1.00000 0.00000 0.00000 -1.00000 262.916 -117.820 ] concat
0.00000 0.00000 moveto
/Helvetica findfont 18 scalefont setfont 15.0000 cfontH
(\000r\000a\000d\000i\000a\000t\000i\000v\000e\000 \000t\000r\000a\000n\000s\000f\000e\000r) recshow
Q
2 J
10.0000 M
.600000 .800000 0.00000 RG
4.00000 w
0 J
1.45000 M
newpath
1.06513 -213.849 m
36.4911 -167.417 l
S
1.00000 w
2 J
10.0000 M
0.00000 0.00000 0.00000 RG
0.00000 1.00000 1.00000 RG
4.00000 w
0 J
1.45000 M
newpath
275.685 -209.660 m
146.667 -167.316 l
S
1.00000 w
2 J
10.0000 M
0.00000 0.00000 0.00000 RG
.800000 .600000 1.00000 RG
4.00000 w
0 J
1.45000 M
newpath
322.834 -209.660 m
327.149 -164.917 l
S
1.00000 w
2 J
10.0000 M
0.00000 0.00000 0.00000 RG
1.00000 1.00000 0.00000 RG
4.00000 w
0 J
1.45000 M
newpath
44.5520 -213.849 m
247.067 -158.548 l
S
1.00000 w
2 J
10.0000 M
0.00000 0.00000 0.00000 RG
1.00000 .400000 0.00000 RG
4.00000 w
0 J
1.45000 M
newpath
31.3571 -213.849 m
247.062 -136.325 l
S
1.00000 w
2 J
10.0000 M
0.00000 0.00000 0.00000 RG
<< /PatternType 2
   /Shading
   << /ShadingType 2
      /ColorSpace /DeviceRGB
      /Coords [-105.62467956542969 -83.16114044189453 506.73907470703125 -83.16114044189453]
      /Function
      << /FunctionType 2
         /Domain [0 1]
         /Range [0 1 0 1 0 1]
         /C0 [0.7529412 0.7529412 0.7529412]
         /C1 [1.0 1.0 1.0]
         /N 1
      >>
      /Extend [true true]
   >>
>>
matrix makepattern setpattern
newpath
-411.807 -79.1611 m
-411.807 -8.40821 l
-411.807 -6.19907 -410.016 -4.40821 -407.807 -4.40821  c
502.739 -4.40821 l
504.948 -4.40821 506.739 -6.19907 506.739 -8.40821  c
506.739 -79.1611 l
506.739 -81.3703 504.948 -83.1611 502.739 -83.1611  c
-407.807 -83.1611 l
-410.016 -83.1611 -411.807 -81.3703 -411.807 -79.1611  c
h
f
0 J
1.45000 M
[ 6.00000 2.00000 ] 0.00000 d
0.00000 0.00000 0.00000 RG
newpath
-411.807 -79.1611 m
-411.807 -8.40821 l
-411.807 -6.19907 -410.016 -4.40821 -407.807 -4.40821  c
502.739 -4.40821 l
504.948 -4.40821 506.739 -6.19907 506.739 -8.40821  c
506.739 -79.1611 l
506.739 -81.3703 504.948 -83.1611 502.739 -83.1611  c
-407.807 -83.1611 l
-410.016 -83.1611 -411.807 -81.3703 -411.807 -79.1611  c
h
S
2 J
10.0000 M
[ ] 0.00000 d
1.00000 1.00000 1.00000 RG
newpath
-396.807 -49.4082 m
-162.043 -49.4082 l
-135.958 -34.4082 l
-162.043 -19.4082 l
-396.807 -19.4082 l
-370.722 -34.4082 l
h
f*
0 J
1.45000 M
0.00000 0.00000 0.00000 RG
newpath
-396.807 -49.4082 m
-162.043 -49.4082 l
-135.958 -34.4082 l
-162.043 -19.4082 l
-396.807 -19.4082 l
-370.722 -34.4082 l
h
S
2 J
10.0000 M
0 J
1.45000 M
q
[ 1.00000 0.00000 0.00000 -1.00000 -355.429 -27.3374 ] concat
0.00000 0.00000 moveto
/Helvetica findfont 18 scalefont setfont 15.0000 cfontH
(\000S\000h\000o\000o\000t\000 \000b\000i\000o\000m\000a\000s\000s\000 \000g\000r\000o\000w\000t\000h) recshow
Q
2 J
10.0000 M
.752941 .752941 .752941 RG
newpath
-31.2917 -52.4082 m
103.708 -52.4082 l
103.708 -22.4082 l
-31.2917 -22.4082 l
-31.2917 -52.4082 l
h
f
0 J
1.45000 M
0.00000 0.00000 0.00000 RG
newpath
-31.2917 -52.4082 m
103.708 -52.4082 l
103.708 -22.4082 l
-31.2917 -22.4082 l
-31.2917 -52.4082 l
h
S
2 J
10.0000 M
0 J
1.45000 M
q
[ 1.00000 0.00000 0.00000 -1.00000 8.18441 -30.3374 ] concat
0.00000 0.00000 moveto
/Helvetica findfont 18 scalefont setfont 15.0000 cfontH
(\000A\000n\000n\000u\000a\000l) recshow
Q
2 J
10.0000 M
.752941 .752941 .752941 RG
newpath
260.458 -55.1582 m
398.737 -55.1582 l
398.737 -25.1582 l
260.458 -25.1582 l
260.458 -55.1582 l
h
f
0 J
1.45000 M
0.00000 0.00000 0.00000 RG
newpath
260.458 -55.1582 m
398.737 -55.1582 l
398.737 -25.1582 l
260.458 -25.1582 l
260.458 -55.1582 l
h
S
2 J
10.0000 M
0 J
1.45000 M
q
[ 1.00000 0.00000 0.00000 -1.00000 291.572 -33.0874 ] concat
0.00000 0.00000 moveto
/Helvetica findfont 18 scalefont setfont 15.0000 cfontH
(\000P\000e\000r\000e\000n\000n\000i\000a\000l) recshow
Q
2 J
10.0000 M
.600000 .800000 0.00000 RG
4.00000 w
0 J
1.45000 M
newpath
39.9375 -109.417 m
21.8750 -81.3750 l
31.3183 -52.4082 l
S
1.00000 w
2 J
10.0000 M
0.00000 0.00000 0.00000 RG
0.00000 1.00000 1.00000 RG
4.00000 w
0 J
1.45000 M
newpath
60.3536 -109.417 m
63.7684 -52.3843 l
S
1.00000 w
2 J
10.0000 M
0.00000 0.00000 0.00000 RG
1.00000 .400000 0.00000 RG
4.00000 w
0 J
1.45000 M
newpath
247.067 -108.122 m
80.9360 -52.4082 l
S
1.00000 w
2 J
10.0000 M
0.00000 0.00000 0.00000 RG
.800000 .600000 1.00000 RG
4.00000 w
0 J
1.45000 M
newpath
329.840 -106.917 m
329.652 -55.1582 l
S
1.00000 w
2 J
10.0000 M
0.00000 0.00000 0.00000 RG
1.00000 1.00000 0.00000 RG
4.00000 w
0 J
1.45000 M
newpath
353.375 -106.894 m
334.942 -55.1582 l
S
1.00000 w
2 J
10.0000 M
0.00000 0.00000 0.00000 RG
<< /PatternType 2
   /Shading
   << /ShadingType 2
      /ColorSpace /DeviceRGB
      /Coords [-105.64556884765625 97.43965911865234 508.2908630371094 97.43965911865234]
      /Function
      << /FunctionType 2
         /Domain [0 1]
         /Range [0 1 0 1 0 1]
         /C0 [0.7529412 0.7529412 0.7529412]
         /C1 [1.0 1.0 1.0]
         /N 1
      >>
      /Extend [true true]
   >>
>>
matrix makepattern setpattern
newpath
-412.614 101.440 m
-412.614 180.291 l
-412.614 182.500 -410.823 184.291 -408.614 184.291  c
504.291 184.291 l
506.500 184.291 508.291 182.500 508.291 180.291  c
508.291 101.440 l
508.291 99.2305 506.500 97.4397 504.291 97.4397  c
-408.614 97.4397 l
-410.823 97.4397 -412.614 99.2305 -412.614 101.440  c
h
f
0 J
1.45000 M
[ 6.00000 2.00000 ] 0.00000 d
0.00000 0.00000 0.00000 RG
newpath
-412.614 101.440 m
-412.614 180.291 l
-412.614 182.500 -410.823 184.291 -408.614 184.291  c
504.291 184.291 l
506.500 184.291 508.291 182.500 508.291 180.291  c
508.291 101.440 l
508.291 99.2305 506.500 97.4397 504.291 97.4397  c
-408.614 97.4397 l
-410.823 97.4397 -412.614 99.2305 -412.614 101.440  c
h
S
2 J
10.0000 M
[ ] 0.00000 d
.752941 .752941 .752941 RG
newpath
251.126 120.291 m
455.291 120.291 l
455.291 169.291 l
251.126 169.291 l
251.126 120.291 l
h
f
0 J
1.45000 M
0.00000 0.00000 0.00000 RG
newpath
251.126 120.291 m
455.291 120.291 l
455.291 169.291 l
251.126 169.291 l
251.126 120.291 l
h
S
2 J
10.0000 M
0 J
1.45000 M
q
[ 1.00000 0.00000 0.00000 -1.00000 274.673 140.836 ] concat
0.00000 0.00000 moveto
/Helvetica findfont 18 scalefont setfont 15.0000 cfontH
(\000T\000r\000o\000p\000h\000i\000c\000 \000c\000o\000m\000p\000e\000t\000i\000t\000i\000o\000n) recshow
Q
q
[ 1.00000 0.00000 0.00000 -1.00000 290.678 162.888 ] concat
0.00000 0.00000 moveto
/Helvetica findfont 18 scalefont setfont 15.0000 cfontH
(\000w\000i\000t\000h\000 \000l\000e\000a\000f\000 \000g\000r\000o\000w\000t\000h) recshow
Q
2 J
10.0000 M
.752941 .752941 .752941 RG
newpath
-62.2130 123.041 m
106.376 123.041 l
106.376 153.041 l
-62.2130 153.041 l
-62.2130 123.041 l
h
f
0 J
1.45000 M
0.00000 0.00000 0.00000 RG
newpath
-62.2130 123.041 m
106.376 123.041 l
106.376 153.041 l
-62.2130 153.041 l
-62.2130 123.041 l
h
S
2 J
10.0000 M
0 J
1.45000 M
q
[ 1.00000 0.00000 0.00000 -1.00000 -37.9479 145.112 ] concat
0.00000 0.00000 moveto
/Helvetica findfont 18 scalefont setfont 15.0000 cfontH
(\000N\000o\000 \000c\000o\000m\000p\000e\000t\000i\000t\000i\000o\000n) recshow
Q
2 J
10.0000 M
1.00000 1.00000 1.00000 RG
newpath
-397.614 126.041 m
-158.823 126.041 l
-132.291 141.041 l
-158.823 156.041 l
-397.614 156.041 l
-371.081 141.041 l
h
f*
0 J
1.45000 M
0.00000 0.00000 0.00000 RG
newpath
-397.614 126.041 m
-158.823 126.041 l
-132.291 141.041 l
-158.823 156.041 l
-397.614 156.041 l
-371.081 141.041 l
h
S
2 J
10.0000 M
0 J
1.45000 M
q
[ 1.00000 0.00000 0.00000 -1.00000 -324.982 148.112 ] concat
0.00000 0.00000 moveto
/Helvetica findfont 18 scalefont setfont 15.0000 cfontH
(\000Y\000i\000e\000l\000d\000 \000f\000o\000r\000m\000a\000t\000i\000o\000n) recshow
Q
2 J
10.0000 M
<< /PatternType 2
   /Shading
   << /ShadingType 2
      /ColorSpace /DeviceRGB
      /Coords [-104.09109497070312 191.38856506347656 507.96771240234375 191.38856506347656]
      /Function
      << /FunctionType 2
         /Domain [0 1]
         /Range [0 1 0 1 0 1]
         /C0 [0.7529412 0.7529412 0.7529412]
         /C1 [1.0 1.0 1.0]
         /N 1
      >>
      /Extend [true true]
   >>
>>
matrix makepattern setpattern
newpath
-410.120 195.389 m
-410.120 313.262 l
-410.120 315.471 -408.330 317.262 -406.120 317.262  c
503.968 317.262 l
506.177 317.262 507.968 315.471 507.968 313.262  c
507.968 195.389 l
507.968 193.179 506.177 191.389 503.968 191.389  c
-406.120 191.389 l
-408.330 191.389 -410.120 193.179 -410.120 195.389  c
h
f
0 J
1.45000 M
[ 6.00000 2.00000 ] 0.00000 d
0.00000 0.00000 0.00000 RG
newpath
-410.120 195.389 m
-410.120 313.262 l
-410.120 315.471 -408.330 317.262 -406.120 317.262  c
503.968 317.262 l
506.177 317.262 507.968 315.471 507.968 313.262  c
507.968 195.389 l
507.968 193.179 506.177 191.389 503.968 191.389  c
-406.120 191.389 l
-408.330 191.389 -410.120 193.179 -410.120 195.389  c
h
S
2 J
10.0000 M
[ ] 0.00000 d
.752941 .752941 .752941 RG
newpath
230.144 206.389 m
375.309 206.389 l
375.309 236.389 l
230.144 236.389 l
230.144 206.389 l
h
f
0 J
1.45000 M
0.00000 0.00000 0.00000 RG
newpath
230.144 206.389 m
375.309 206.389 l
375.309 236.389 l
230.144 236.389 l
230.144 206.389 l
h
S
2 J
10.0000 M
0 J
1.45000 M
q
[ 1.00000 0.00000 0.00000 -1.00000 253.205 228.459 ] concat
0.00000 0.00000 moveto
/Helvetica findfont 18 scalefont setfont 15.0000 cfontH
(\000T\000r\000u\000e\000 \000d\000e\000n\000s\000i\000t\000y) recshow
Q
2 J
10.0000 M
.752941 .752941 .752941 RG
newpath
-77.0932 210.389 m
105.394 210.389 l
105.394 240.389 l
-77.0932 240.389 l
-77.0932 210.389 l
h
f
0 J
1.45000 M
0.00000 0.00000 0.00000 RG
newpath
-77.0932 210.389 m
105.394 210.389 l
105.394 240.389 l
-77.0932 240.389 l
-77.0932 210.389 l
h
S
2 J
10.0000 M
0 J
1.45000 M
q
[ 1.00000 0.00000 0.00000 -1.00000 -49.3899 232.459 ] concat
0.00000 0.00000 moveto
/Helvetica findfont 18 scalefont setfont 15.0000 cfontH
(\000S\000t\000a\000n\000d\000a\000r\000d\000 \000p\000r\000o\000f\000i\000l\000e) recshow
Q
2 J
10.0000 M
1.00000 1.00000 1.00000 RG
newpath
-395.120 213.389 m
-155.857 213.389 l
-129.272 228.389 l
-155.857 243.389 l
-395.120 243.389 l
-368.536 228.389 l
h
f*
0 J
1.45000 M
0.00000 0.00000 0.00000 RG
newpath
-395.120 213.389 m
-155.857 213.389 l
-129.272 228.389 l
-155.857 243.389 l
-395.120 243.389 l
-368.536 228.389 l
h
S
2 J
10.0000 M
0 J
1.45000 M
q
[ 1.00000 0.00000 0.00000 -1.00000 -310.721 235.459 ] concat
0.00000 0.00000 moveto
/Helvetica findfont 18 scalefont setfont 15.0000 cfontH
(\000R\000o\000o\000t\000 \000g\000r\000o\000w\000t\000h) recshow
Q
2 J
10.0000 M
.752941 .752941 .752941 RG
newpath
232.916 268.262 m
423.138 268.262 l
423.138 298.262 l
232.916 298.262 l
232.916 268.262 l
h
f
0 J
1.45000 M
0.00000 0.00000 0.00000 RG
newpath
232.916 268.262 m
423.138 268.262 l
423.138 298.262 l
232.916 298.262 l
232.916 268.262 l
h
S
2 J
10.0000 M
0 J
1.45000 M
q
[ 1.00000 0.00000 0.00000 -1.00000 249.985 290.333 ] concat
0.00000 0.00000 moveto
/Helvetica findfont 18 scalefont setfont 15.0000 cfontH
(\000F\000i\000n\000a\000l\000 \000d\000e\000a\000d\000 \000b\000i\000o\000m\000a\000s\000s) recshow
Q
2 J
10.0000 M
.752941 .752941 .752941 RG
newpath
-123.770 268.166 m
132.808 268.166 l
132.808 298.166 l
-123.770 298.166 l
-123.770 268.166 l
h
f
0 J
1.45000 M
0.00000 0.00000 0.00000 RG
newpath
-123.770 268.166 m
132.808 268.166 l
132.808 298.166 l
-123.770 298.166 l
-123.770 268.166 l
h
S
2 J
10.0000 M
0 J
1.45000 M
q
[ 1.00000 0.00000 0.00000 -1.00000 -92.0290 290.237 ] concat
0.00000 0.00000 moveto
/Helvetica findfont 18 scalefont setfont 15.0000 cfontH
(\000D\000a\000i\000l\000y\000 \000d\000e\000a\000d\000 \000r\000o\000o\000t\000 \000b\000i\000o\000m\000a\000s\000s) recshow
Q
2 J
10.0000 M
.600000 .800000 0.00000 RG
4.00000 w
0 J
1.45000 M
newpath
72.5891 153.041 m
252.219 206.389 l
S
1.00000 w
2 J
10.0000 M
0.00000 0.00000 0.00000 RG
.800000 .600000 1.00000 RG
4.00000 w
0 J
1.45000 M
newpath
362.995 169.280 m
320.076 206.389 l
S
1.00000 w
2 J
10.0000 M
0.00000 0.00000 0.00000 RG
1.00000 1.00000 0.00000 RG
4.00000 w
0 J
1.45000 M
newpath
99.5515 153.043 m
258.135 206.389 l
S
1.00000 w
2 J
10.0000 M
0.00000 0.00000 0.00000 RG
1.00000 .400000 0.00000 RG
4.00000 w
0 J
1.45000 M
newpath
106.384 149.860 m
303.714 206.395 l
S
1.00000 w
2 J
10.0000 M
0.00000 0.00000 0.00000 RG
0.00000 1.00000 1.00000 RG
4.00000 w
0 J
1.45000 M
newpath
251.126 169.057 m
77.2527 210.389 l
S
1.00000 w
2 J
10.0000 M
0.00000 0.00000 0.00000 RG
.600000 .800000 0.00000 RG
4.00000 w
0 J
1.45000 M
newpath
309.289 236.389 m
323.228 268.248 l
S
1.00000 w
2 J
10.0000 M
0.00000 0.00000 0.00000 RG
0.00000 1.00000 1.00000 RG
4.00000 w
0 J
1.45000 M
newpath
105.394 237.992 m
324.543 268.262 l
S
1.00000 w
2 J
10.0000 M
0.00000 0.00000 0.00000 RG
1.00000 .400000 0.00000 RG
4.00000 w
0 J
1.45000 M
newpath
331.529 236.383 m
352.310 268.248 l
S
1.00000 w
2 J
10.0000 M
0.00000 0.00000 0.00000 RG
.800000 .600000 1.00000 RG
4.00000 w
0 J
1.45000 M
newpath
308.860 236.389 m
321.893 268.262 l
S
1.00000 w
2 J
10.0000 M
0.00000 0.00000 0.00000 RG
.400000 1.00000 .400000 RG
4.00000 w
0 J
1.45000 M
newpath
320.226 236.417 m
335.839 268.243 l
S
1.00000 w
2 J
10.0000 M
0.00000 0.00000 0.00000 RG
1.00000 1.00000 0.00000 RG
4.00000 w
0 J
1.45000 M
newpath
230.319 236.389 m
76.9261 268.166 l
S
1.00000 w
2 J
10.0000 M
0.00000 0.00000 0.00000 RG
<< /PatternType 2
   /Shading
   << /ShadingType 2
      /ColorSpace /DeviceRGB
      /Coords [-102.83628845214844 326.5 509.1288757324219 326.5]
      /Function
      << /FunctionType 2
         /Domain [0 1]
         /Range [0 1 0 1 0 1]
         /C0 [0.7529412 0.7529412 0.7529412]
         /C1 [1.0 1.0 1.0]
         /N 1
      >>
      /Extend [true true]
   >>
>>
matrix makepattern setpattern
newpath
-408.819 330.500 m
-408.819 389.500 l
-408.819 391.709 -407.028 393.500 -404.819 393.500  c
505.129 393.500 l
507.338 393.500 509.129 391.709 509.129 389.500  c
509.129 330.500 l
509.129 328.291 507.338 326.500 505.129 326.500  c
-404.819 326.500 l
-407.028 326.500 -408.819 328.291 -408.819 330.500  c
h
f
0 J
1.45000 M
[ 6.00000 2.00000 ] 0.00000 d
0.00000 0.00000 0.00000 RG
newpath
-408.819 330.500 m
-408.819 389.500 l
-408.819 391.709 -407.028 393.500 -404.819 393.500  c
505.129 393.500 l
507.338 393.500 509.129 391.709 509.129 389.500  c
509.129 330.500 l
509.129 328.291 507.338 326.500 505.129 326.500  c
-404.819 326.500 l
-407.028 326.500 -408.819 328.291 -408.819 330.500  c
h
S
2 J
10.0000 M
[ ] 0.00000 d
.752941 .752941 .752941 RG
newpath
221.538 341.500 m
436.538 341.500 l
436.538 371.500 l
221.538 371.500 l
221.538 341.500 l
h
f
0 J
1.45000 M
0.00000 0.00000 0.00000 RG
newpath
221.538 341.500 m
436.538 341.500 l
436.538 371.500 l
221.538 371.500 l
221.538 341.500 l
h
S
2 J
10.0000 M
0 J
1.45000 M
q
[ 1.00000 0.00000 0.00000 -1.00000 252.498 363.571 ] concat
0.00000 0.00000 moveto
/Helvetica findfont 18 scalefont setfont 15.0000 cfontH
(\000R\000e\000s\000i\000s\000t\000i\000v\000e\000 \000a\000p\000p\000r\000o\000a\000c\000h) recshow
Q
2 J
10.0000 M
.752941 .752941 .752941 RG
newpath
-29.4622 345.500 m
105.538 345.500 l
105.538 375.500 l
-29.4622 375.500 l
-29.4622 345.500 l
h
f
0 J
1.45000 M
0.00000 0.00000 0.00000 RG
newpath
-29.4622 345.500 m
105.538 345.500 l
105.538 375.500 l
-29.4622 375.500 l
-29.4622 345.500 l
h
S
2 J
10.0000 M
0 J
1.45000 M
q
[ 1.00000 0.00000 0.00000 -1.00000 12.5319 367.571 ] concat
0.00000 0.00000 moveto
/Helvetica findfont 18 scalefont setfont 15.0000 cfontH
(\000k\000*\000P\000E\000T) recshow
Q
2 J
10.0000 M
1.00000 1.00000 1.00000 RG
newpath
-393.819 348.500 m
-160.098 348.500 l
-134.129 363.500 l
-160.098 378.500 l
-393.819 378.500 l
-367.850 363.500 l
h
f*
0 J
1.45000 M
0.00000 0.00000 0.00000 RG
newpath
-393.819 348.500 m
-160.098 348.500 l
-134.129 363.500 l
-160.098 378.500 l
-393.819 378.500 l
-367.850 363.500 l
h
S
2 J
10.0000 M
0 J
1.45000 M
q
[ 1.00000 0.00000 0.00000 -1.00000 -322.004 370.571 ] concat
0.00000 0.00000 moveto
/Helvetica findfont 18 scalefont setfont 15.0000 cfontH
(\000W\000a\000t\000e\000r\000 \000b\000a\000l\000a\000n\000c\000e) recshow
Q
2 J
10.0000 M
.800000 .600000 1.00000 RG
4.00000 w
0 J
1.45000 M
newpath
328.234 298.262 m
328.831 341.500 l
S
1.00000 w
2 J
10.0000 M
0.00000 0.00000 0.00000 RG
1.00000 .400000 0.00000 RG
4.00000 w
0 J
1.45000 M
newpath
356.989 298.243 m
356.989 341.467 l
S
1.00000 w
2 J
10.0000 M
0.00000 0.00000 0.00000 RG
1.00000 1.00000 0.00000 RG
4.00000 w
0 J
1.45000 M
newpath
4.85424 298.166 m
5.91285 345.509 l
S
1.00000 w
2 J
10.0000 M
0.00000 0.00000 0.00000 RG
0.00000 1.00000 1.00000 RG
4.00000 w
0 J
1.45000 M
newpath
271.710 298.262 m
94.3552 345.500 l
S
1.00000 w
2 J
10.0000 M
0.00000 0.00000 0.00000 RG
.600000 .800000 0.00000 RG
4.00000 w
0 J
1.45000 M
newpath
271.710 298.262 m
94.3552 345.500 l
S
1.00000 w
2 J
10.0000 M
0.00000 0.00000 0.00000 RG
0.00000 1.00000 1.00000 RG
4.00000 w
0 J
1.45000 M
newpath
242.215 298.258 m
56.8099 345.504 l
S
1.00000 w
2 J
10.0000 M
0.00000 0.00000 0.00000 RG
<< /PatternType 2
   /Shading
   << /ShadingType 2
      /ColorSpace /DeviceRGB
      /Coords [-103.04718017578125 400.4289245605469 509.7615661621094 400.4289245605469]
      /Function
      << /FunctionType 2
         /Domain [0 1]
         /Range [0 1 0 1 0 1]
         /C0 [0.7529412 0.7529412 0.7529412]
         /C1 [1.0 1.0 1.0]
         /N 1
      >>
      /Extend [true true]
   >>
>>
matrix makepattern setpattern
newpath
-409.452 404.429 m
-409.452 463.429 l
-409.452 465.638 -407.661 467.429 -405.452 467.429  c
505.762 467.429 l
507.971 467.429 509.762 465.638 509.762 463.429  c
509.762 404.429 l
509.762 402.220 507.971 400.429 505.762 400.429  c
-405.452 400.429 l
-407.661 400.429 -409.452 402.220 -409.452 404.429  c
h
f
0 J
1.45000 M
[ 6.00000 2.00000 ] 0.00000 d
0.00000 0.00000 0.00000 RG
newpath
-409.452 404.429 m
-409.452 463.429 l
-409.452 465.638 -407.661 467.429 -405.452 467.429  c
505.762 467.429 l
507.971 467.429 509.762 465.638 509.762 463.429  c
509.762 404.429 l
509.762 402.220 507.971 400.429 505.762 400.429  c
-405.452 400.429 l
-407.661 400.429 -409.452 402.220 -409.452 404.429  c
h
S
2 J
10.0000 M
[ ] 0.00000 d
.752941 .752941 .752941 RG
newpath
257.155 419.179 m
379.155 419.179 l
379.155 449.179 l
257.155 449.179 l
257.155 419.179 l
h
f
0 J
1.45000 M
0.00000 0.00000 0.00000 RG
newpath
257.155 419.179 m
379.155 419.179 l
379.155 449.179 l
257.155 449.179 l
257.155 419.179 l
h
S
2 J
10.0000 M
0 J
1.45000 M
q
[ 1.00000 0.00000 0.00000 -1.00000 269.121 441.250 ] concat
0.00000 0.00000 moveto
/Helvetica findfont 18 scalefont setfont 15.0000 cfontH
(\000L\000e\000g\000u\000m\000i\000n\000o\000u\000s) recshow
Q
2 J
10.0000 M
.752941 .752941 .752941 RG
newpath
-67.1584 419.429 m
104.905 419.429 l
104.905 449.429 l
-67.1584 449.429 l
-67.1584 419.429 l
h
f
0 J
1.45000 M
0.00000 0.00000 0.00000 RG
newpath
-67.1584 419.429 m
104.905 419.429 l
104.905 449.429 l
-67.1584 449.429 l
-67.1584 419.429 l
h
S
2 J
10.0000 M
0 J
1.45000 M
q
[ 1.00000 0.00000 0.00000 -1.00000 -41.1603 441.500 ] concat
0.00000 0.00000 moveto
/Helvetica findfont 18 scalefont setfont 15.0000 cfontH
(\000N\000o\000 \000l\000e\000g\000u\000m\000i\000n\000o\000u\000s) recshow
Q
2 J
10.0000 M
1.00000 1.00000 1.00000 RG
newpath
-394.452 422.429 m
-169.506 422.429 l
-144.512 437.429 l
-169.506 452.429 l
-394.452 452.429 l
-369.458 437.429 l
h
f*
0 J
1.45000 M
0.00000 0.00000 0.00000 RG
newpath
-394.452 422.429 m
-169.506 422.429 l
-144.512 437.429 l
-169.506 452.429 l
-394.452 452.429 l
-369.458 437.429 l
h
S
2 J
10.0000 M
0 J
1.45000 M
q
[ 1.00000 0.00000 0.00000 -1.00000 -337.526 444.500 ] concat
0.00000 0.00000 moveto
/Helvetica findfont 18 scalefont setfont 15.0000 cfontH
(\000N\000i\000t\000r\000o\000g\000e\000n\000 \000b\000a\000l\000a\000n\000c\000e) recshow
Q
2 J
10.0000 M
1.00000 .400000 0.00000 RG
4.00000 w
0 J
1.45000 M
newpath
353.311 371.521 m
326.571 419.179 l
S
1.00000 w
2 J
10.0000 M
0.00000 0.00000 0.00000 RG
.600000 .800000 0.00000 RG
4.00000 w
0 J
1.45000 M
newpath
34.1494 375.500 m
22.7595 419.438 l
S
1.00000 w
2 J
10.0000 M
0.00000 0.00000 0.00000 RG
0.00000 1.00000 1.00000 RG
4.00000 w
0 J
1.45000 M
newpath
44.5599 375.500 m
63.6684 419.447 l
S
1.00000 w
2 J
10.0000 M
0.00000 0.00000 0.00000 RG
.800000 .600000 1.00000 RG
4.00000 w
0 J
1.45000 M
newpath
269.336 371.500 m
78.5846 419.426 l
S
1.00000 w
2 J
10.0000 M
0.00000 0.00000 0.00000 RG
1.00000 1.00000 0.00000 RG
4.00000 w
0 J
1.45000 M
newpath
-3.19331 375.485 m
-18.5779 419.406 l
S
1.00000 w
2 J
10.0000 M
0.00000 0.00000 0.00000 RG
<< /PatternType 2
   /Shading
   << /ShadingType 2
      /ColorSpace /DeviceRGB
      /Coords [-104.8734130859375 3.6947245597839355 508.2908630371094 3.6947245597839355]
      /Function
      << /FunctionType 2
         /Domain [0 1]
         /Range [0 1 0 1 0 1]
         /C0 [0.7529412 0.7529412 0.7529412]
         /C1 [1.0 1.0 1.0]
         /N 1
      >>
      /Extend [true true]
   >>
>>
matrix makepattern setpattern
newpath
-411.456 7.69472 m
-411.456 86.5463 l
-411.456 88.7554 -409.665 90.5463 -407.456 90.5463  c
504.291 90.5463 l
506.500 90.5463 508.291 88.7554 508.291 86.5463  c
508.291 7.69472 l
508.291 5.48559 506.500 3.69472 504.291 3.69472  c
-407.456 3.69472 l
-409.665 3.69472 -411.456 5.48559 -411.456 7.69472  c
h
f
0 J
1.45000 M
[ 6.00000 2.00000 ] 0.00000 d
0.00000 0.00000 0.00000 RG
newpath
-411.456 7.69472 m
-411.456 86.5463 l
-411.456 88.7554 -409.665 90.5463 -407.456 90.5463  c
504.291 90.5463 l
506.500 90.5463 508.291 88.7554 508.291 86.5463  c
508.291 7.69472 l
508.291 5.48559 506.500 3.69472 504.291 3.69472  c
-407.456 3.69472 l
-409.665 3.69472 -411.456 5.48559 -411.456 7.69472  c
h
S
2 J
10.0000 M
[ ] 0.00000 d
.752941 .752941 .752941 RG
newpath
-1.07441 23.8633 m
95.4117 23.8633 l
95.4117 55.4239 l
-1.07441 55.4239 l
-1.07441 23.8633 l
h
f
0 J
1.45000 M
0.00000 0.00000 0.00000 RG
newpath
-1.07441 23.8633 m
95.4117 23.8633 l
95.4117 55.4239 l
-1.07441 55.4239 l
-1.07441 23.8633 l
h
S
2 J
10.0000 M
0 J
1.45000 M
q
[ 1.00000 0.00000 0.00000 -1.00000 35.6638 46.7144 ] concat
0.00000 0.00000 moveto
/Helvetica findfont 18 scalefont setfont 15.0000 cfontH
(\000N\000o) recshow
Q
2 J
10.0000 M
.752941 .752941 .752941 RG
newpath
271.870 29.2963 m
378.698 29.2963 l
378.698 59.2963 l
271.870 59.2963 l
271.870 29.2963 l
h
f
0 J
1.45000 M
0.00000 0.00000 0.00000 RG
newpath
271.870 29.2963 m
378.698 29.2963 l
378.698 59.2963 l
271.870 59.2963 l
271.870 29.2963 l
h
S
2 J
10.0000 M
0 J
1.45000 M
q
[ 1.00000 0.00000 0.00000 -1.00000 309.776 51.3671 ] concat
0.00000 0.00000 moveto
/Helvetica findfont 18 scalefont setfont 15.0000 cfontH
(\000Y\000e\000s) recshow
Q
2 J
10.0000 M
1.00000 1.00000 1.00000 RG
newpath
-396.456 32.2963 m
-88.0150 32.2963 l
-53.7438 47.2963 l
-88.0150 62.2963 l
-396.456 62.2963 l
-362.184 47.2963 l
h
f*
0 J
1.45000 M
0.00000 0.00000 0.00000 RG
newpath
-396.456 32.2963 m
-88.0150 32.2963 l
-53.7438 47.2963 l
-88.0150 62.2963 l
-396.456 62.2963 l
-362.184 47.2963 l
h
S
2 J
10.0000 M
0 J
1.45000 M
q
[ 1.00000 0.00000 0.00000 -1.00000 -346.165 54.3671 ] concat
0.00000 0.00000 moveto
/Helvetica findfont 18 scalefont setfont 15.0000 cfontH
(\000 \000N\000i\000t\000r\000o\000g\000e\000n\000 \000a\000n\000d\000 \000c\000a\000r\000b\000o\000n\000 \000r\000e\000s\000e\000r\000v\000e\000s) recshow
Q
2 J
10.0000 M
0.00000 1.00000 1.00000 RG
newpath
269.307 -522.414 m
269.307 -514.130 236.400 -507.414 195.807 -507.414  c
155.214 -507.414 122.307 -514.130 122.307 -522.414  c
122.307 -530.698 155.214 -537.414 195.807 -537.414  c
236.400 -537.414 269.307 -530.698 269.307 -522.414  c
h
f
0 J
1.45000 M
0.00000 0.00000 0.00000 RG
newpath
269.307 -522.414 m
269.307 -514.130 236.400 -507.414 195.807 -507.414  c
155.214 -507.414 122.307 -514.130 122.307 -522.414  c
122.307 -530.698 155.214 -537.414 195.807 -537.414  c
236.400 -537.414 269.307 -530.698 269.307 -522.414  c
h
S
2 J
10.0000 M
0 J
1.45000 M
q
[ 1.00000 0.00000 0.00000 -1.00000 137.795 -515.343 ] concat
0.00000 0.00000 moveto
/Helvetica findfont 18 scalefont setfont 15.0000 cfontH
(\000S\000U\000G\000A\000R\000 \000B\000E\000E\000T) recshow
Q
2 J
10.0000 M
.800000 .600000 1.00000 RG
newpath
500.982 -524.785 m
500.982 -516.500 468.075 -509.785 427.482 -509.785  c
386.889 -509.785 353.982 -516.500 353.982 -524.785  c
353.982 -533.069 386.889 -539.785 427.482 -539.785  c
468.075 -539.785 500.982 -533.069 500.982 -524.785  c
h
f
0 J
1.45000 M
0.00000 0.00000 0.00000 RG
newpath
500.982 -524.785 m
500.982 -516.500 468.075 -509.785 427.482 -509.785  c
386.889 -509.785 353.982 -516.500 353.982 -524.785  c
353.982 -533.069 386.889 -539.785 427.482 -539.785  c
468.075 -539.785 500.982 -533.069 500.982 -524.785  c
h
S
2 J
10.0000 M
0 J
1.45000 M
q
[ 1.00000 0.00000 0.00000 -1.00000 374.967 -517.714 ] concat
0.00000 0.00000 moveto
/Helvetica findfont 18 scalefont setfont 15.0000 cfontH
(\000G\000R\000A\000P\000E\000V\000I\000N\000E) recshow
Q
2 J
10.0000 M
.600000 .800000 0.00000 RG
newpath
96.9872 -537.882 m
96.9872 -529.597 64.0801 -522.882 23.4872 -522.882  c
-17.1058 -522.882 -50.0128 -529.597 -50.0128 -537.882  c
-50.0128 -546.166 -17.1058 -552.882 23.4872 -552.882  c
64.0801 -552.882 96.9872 -546.166 96.9872 -537.882  c
h
f
0 J
1.45000 M
0.00000 0.00000 0.00000 RG
newpath
96.9872 -537.882 m
96.9872 -529.597 64.0801 -522.882 23.4872 -522.882  c
-17.1058 -522.882 -50.0128 -529.597 -50.0128 -537.882  c
-50.0128 -546.166 -17.1058 -552.882 23.4872 -552.882  c
64.0801 -552.882 96.9872 -546.166 96.9872 -537.882  c
h
S
2 J
10.0000 M
0 J
1.45000 M
q
[ 1.00000 0.00000 0.00000 -1.00000 -9.01041 -530.811 ] concat
0.00000 0.00000 moveto
/Helvetica findfont 18 scalefont setfont 15.0000 cfontH
(\000W\000H\000E\000A\000T) recshow
Q
2 J
10.0000 M
1.00000 1.00000 0.00000 RG
newpath
485.552 -597.407 m
485.552 -589.123 452.645 -582.407 412.052 -582.407  c
371.459 -582.407 338.552 -589.123 338.552 -597.407  c
338.552 -605.691 371.459 -612.407 412.052 -612.407  c
452.645 -612.407 485.552 -605.691 485.552 -597.407  c
h
f
0 J
1.45000 M
0.00000 0.00000 0.00000 RG
newpath
485.552 -597.407 m
485.552 -589.123 452.645 -582.407 412.052 -582.407  c
371.459 -582.407 338.552 -589.123 338.552 -597.407  c
338.552 -605.691 371.459 -612.407 412.052 -612.407  c
452.645 -612.407 485.552 -605.691 485.552 -597.407  c
h
S
2 J
10.0000 M
0 J
1.45000 M
q
[ 1.00000 0.00000 0.00000 -1.00000 352.550 -590.336 ] concat
0.00000 0.00000 moveto
/Helvetica findfont 18 scalefont setfont 15.0000 cfontH
(\000M\000I\000S\000C\000A\000N\000T\000H\000U\000S) recshow
Q
2 J
10.0000 M
1.00000 .400000 0.00000 RG
newpath
358.797 -562.266 m
358.797 -551.561 322.291 -542.882 277.260 -542.882  c
232.228 -542.882 195.723 -551.561 195.723 -562.266  c
195.723 -572.971 232.228 -581.650 277.260 -581.650  c
322.291 -581.650 358.797 -572.971 358.797 -562.266  c
h
f
0 J
1.45000 M
0.00000 0.00000 0.00000 RG
newpath
358.797 -562.266 m
358.797 -551.561 322.291 -542.882 277.260 -542.882  c
232.228 -542.882 195.723 -551.561 195.723 -562.266  c
195.723 -572.971 232.228 -581.650 277.260 -581.650  c
322.291 -581.650 358.797 -572.971 358.797 -562.266  c
h
S
2 J
10.0000 M
0 J
1.45000 M
q
[ 1.00000 0.00000 0.00000 -1.00000 203.717 -555.195 ] concat
0.00000 0.00000 moveto
/Helvetica findfont 18 scalefont setfont 15.0000 cfontH
(\000I\000n\000t\000e\000r\000c\000r\000o\000p\000p\000e\000d\000 \000P\000E\000A\000 ) recshow
Q
2 J
10.0000 M
0.00000 1.00000 1.00000 RG
4.00000 w
0 J
1.45000 M
newpath
56.5133 -22.4136 m
60.0770 23.8655 l
S
1.00000 w
2 J
10.0000 M
0.00000 0.00000 0.00000 RG
.600000 .800000 0.00000 RG
4.00000 w
0 J
1.45000 M
newpath
38.3420 -22.4082 m
44.9240 23.8633 l
S
1.00000 w
2 J
10.0000 M
0.00000 0.00000 0.00000 RG
.800000 .600000 1.00000 RG
4.00000 w
0 J
1.45000 M
newpath
276.511 -25.1582 m
95.4117 26.0123 l
S
1.00000 w
2 J
10.0000 M
0.00000 0.00000 0.00000 RG
1.00000 .400000 0.00000 RG
4.00000 w
0 J
1.45000 M
newpath
84.5256 -22.3905 m
72.9647 23.8530 l
S
1.00000 w
2 J
10.0000 M
0.00000 0.00000 0.00000 RG
0.00000 1.00000 1.00000 RG
4.00000 w
0 J
1.45000 M
newpath
93.0984 55.4239 m
281.899 120.291 l
S
1.00000 w
2 J
10.0000 M
0.00000 0.00000 0.00000 RG
.600000 .800000 0.00000 RG
4.00000 w
0 J
1.45000 M
newpath
43.1453 55.4239 m
25.9058 123.041 l
S
1.00000 w
2 J
10.0000 M
0.00000 0.00000 0.00000 RG
.800000 .600000 1.00000 RG
4.00000 w
0 J
1.45000 M
newpath
95.4117 50.6652 m
400.149 120.285 l
S
1.00000 w
2 J
10.0000 M
0.00000 0.00000 0.00000 RG
1.00000 .400000 0.00000 RG
4.00000 w
0 J
1.45000 M
newpath
74.2775 55.4358 m
63.5520 123.010 l
S
1.00000 w
2 J
10.0000 M
0.00000 0.00000 0.00000 RG
1.00000 1.00000 0.00000 RG
4.00000 w
0 J
1.45000 M
newpath
70.5965 123.041 m
276.769 59.2963 l
S
1.00000 w
2 J
10.0000 M
0.00000 0.00000 0.00000 RG
1.00000 1.00000 0.00000 RG
4.00000 w
0 J
1.45000 M
newpath
322.071 29.3295 m
308.803 -25.1486 l
S
1.00000 w
2 J
10.0000 M
0.00000 0.00000 0.00000 RG
0.00000 1.00000 1.00000 RG
4.00000 w
0 J
1.45000 M
newpath
217.357 -508.073 m
271.858 -471.803 l
S
1.00000 w
2 J
10.0000 M
0.00000 0.00000 0.00000 RG
.800000 .600000 1.00000 RG
4.00000 w
0 J
1.45000 M
newpath
398.903 -510.965 m
310.626 -468.277 l
S
1.00000 w
2 J
10.0000 M
0.00000 0.00000 0.00000 RG
.600000 .800000 0.00000 RG
4.00000 w
0 J
1.45000 M
newpath
42.7134 -523.404 m
110.577 -472.301 l
S
1.00000 w
2 J
10.0000 M
0.00000 0.00000 0.00000 RG
1.00000 1.00000 0.00000 RG
4.00000 w
0 J
1.45000 M
newpath
399.171 -582.639 m
304.326 -473.904 l
S
1.00000 w
2 J
10.0000 M
0.00000 0.00000 0.00000 RG
1.00000 .400000 0.00000 RG
4.00000 w
0 J
1.45000 M
newpath
279.881 -542.892 m
289.213 -473.904 l
S
1.00000 w
2 J
10.0000 M
0.00000 0.00000 0.00000 RG
Q
[ 1.00000 0.00000 0.00000 1.00000 0.00000 0.00000 ] defaultmatrix matrix concatmatrix setmatrix
cliprestore

%%Trailer
%%EOF
