jul,stoprac sen,stoprac lax
270,0,0
271,0,0
272,0,0
273,0,0
274,0,0
275,0,0
276,0,0
277,0,0
278,0,0
279,0,0
280,0,0
281,0,0
282,0,0
283,0,0
284,0,0
285,0,0
286,0,0
287,0,0
288,0,0
289,0,0
290,0,0
291,0,0
292,0,0
293,0,0
294,0,0
295,0,0
296,0,0
297,1.7,1.7
298,1.1,1.1
299,1.2,1.2
300,1.1,1.1
301,1.5,1.5
302,1.4,1.4
303,2.3,2.3
304,2.6,2.6
305,1.8,1.8
306,0.4,0.4
307,1.2,1.2
308,1.5,1.5
309,0.6,0.6
310,1,1
311,1.1,1.1
312,0.2,0.2
313,0.3,0.3
314,0.8,0.8
315,0.4,0.4
316,0.9,0.9
317,0.5,0.5
318,0.1,0.1
319,0.6,0.6
320,0.3,0.3
321,0,0
322,0.1,0.1
323,0.1,0.1
324,0.1,0.1
325,0.2,0.2
326,0,0
327,0,0
328,0.1,0.1
329,0.1,0.1
330,0.3,0.3
331,0.3,0.3
332,0.4,0.4
333,0.3,0.3
334,0.2,0.2
335,0.1,0.1
336,0.4,0.4
337,0.2,0.2
338,0.3,0.3
339,0.4,0.4
340,0.1,0.1
341,0,0
342,0.1,0.1
343,0.2,0.2
344,0.2,0.2
345,0.1,0.1
346,0.1,0.1
347,0.3,0.3
348,0.2,0.2
349,0.1,0.1
350,0,0
351,0,0
352,0.1,0.1
353,0.2,0.2
354,0,0
355,0,0
356,0,0
357,0,0
358,0,0
359,0.2,0.2
360,0.2,0.2
361,0.1,0.1
362,0.1,0.1
363,0.2,0.2
364,0.1,0.1
365,0,0
366,0,0
367,0.1,0.1
368,0.1,0.1
369,0.1,0.1
370,0.2,0.2
371,0.2,0.2
372,0.2,0.2
373,0,0
374,0.2,0.2
375,0.2,0.2
376,0,0
377,0,0
378,0,0
379,0,0
380,0.1,0.1
381,0.1,0.1
382,0.1,0.1
383,0.1,0.1
384,0.1,0.1
385,0.1,0.1
386,0.1,0.1
387,0.1,0.1
388,0.1,0.1
389,0.3,0.3
390,0,0
391,0,0
392,0,0
393,0,0
394,0,0
395,0.1,0.1
396,0.2,0.2
397,0.1,0.1
398,0.1,0.1
399,0.2,0.2
400,0.2,0.2
401,0.4,0.4
402,0.1,0.1
403,0.2,0.2
404,0.1,0.1
405,0.3,0.3
406,0.1,0.1
407,0.4,0.4
408,0.2,0.2
409,0.1,0.1
410,0.1,0.1
411,0.1,0.1
412,0.2,0.2
413,0.2,0.2
414,0.1,0.1
415,0.2,0.2
416,0.3,0.3
417,0.2,0.2
418,0.1,0.1
419,0.2,0.2
420,0.1,0.1
421,0.2,0.2
422,0.4,0.4
423,0.3,0.3
424,0.1,0.1
425,0.1,0.1
426,0.3,0.3
427,0.4,0.4
428,0.1,0.1
429,0.6,0.6
430,0.3,0.3
431,0.4,0.4
432,0.3,0.3
433,0.3,0.3
434,0.2,0.2
435,0.5,0.5
436,0.4,0.4
437,0.7,0.7
438,0.7,0.7
439,0.4,0.4
440,0.8,0.8
441,0.5,0.5
442,0.6,0.6
443,0.5,0.5
444,1.1,1.1
445,0.6,0.6
446,0.9,0.9
447,1.1,1.1
448,0.6,0.6
449,0.3,0.3
450,0.6,0.6
451,0.9,0.9
452,0.5,0.5
453,0.5,0.5
454,0.3,0.3
455,0.3,0.3
456,0.8,0.8
457,0.8,0.8
458,1.3,1.3
459,3.2,3.2
460,3.3,3.3
461,0.4,0.4
462,3,3
463,3.3,3.3
464,3.8,3.8
465,2.3,2.3
466,4.9,4.9
467,3.3,3.3
468,2.1,2.1
469,1.8,1.8
470,1.7,1.7
471,2.1,2.1
472,3.5,3.5
473,3.4,3.4
474,4.8,4.8
475,2.5,2.5
476,4.2,4.2
477,5.9,5.9
478,1.9,1.9
479,1.6,1.6
480,3.9,3.9
481,5.6,5.6
482,4,4
483,2.4,2.4
484,1.8,1.8
485,5.5,5.5
486,6.2,6.2
487,6,6
488,5.2,5.2
489,2.6,2.6
490,4.7,4.7
491,7.7,7.7
492,6.5,6.5
493,3.9,3.9
494,6.1,6.1
495,7.7,7.7
496,4.9,4.9
497,7.6,7.6
498,2.7,2.7
499,8,8
500,8.3,8.3
501,8.2,0
502,7.9,0
503,5.4,0
504,5.9,0
505,4.4,0
506,6,0
507,4,0
508,3.8,0
509,6.1,0
510,4.1,0
511,6.1,0
512,5.6,0
513,6.9,0
514,5.6,0
515,5.1,0
516,1.9,0
517,6.9,0
518,5.4,0
519,6.5,0
520,5.3,0
521,4.7,0
522,1.4,0
523,4.7,0
524,7.9,0
525,6.7,0
526,6,0
527,3.9,0
528,6.1,0
529,5.9,0
530,5.2,0
531,3.3,0
532,3.8,0
533,5.8,0
534,5.5,0
535,5.2,0
536,4.9,0
537,4.6,0
538,2.6,0
539,3.5,0
540,2.6,0
541,2.3,0
542,2.1,0
543,0,0
544,0,0
545,0,0
546,0,0
547,0,0
548,0,0
549,0,0
550,0,0
551,0,0
552,0,0
553,0,0
554,0,0
555,0,0
556,0,0
557,0,0
558,0,0
559,0,0
560,0,0
561,0,0
562,0,0
563,0,0
564,0,0
565,0,0
566,0,0
567,0,0
568,0,0
569,0,0
570,0,0
571,0,0
572,0,0
573,0,0
574,0,0
575,0,0
576,0,0
577,0,0
578,0,0
579,0,0
580,0,0
581,0,0
582,0,0
583,0,0
584,0,0
585,0,0
586,0,0
587,0,0
588,0,0
589,0,0
590,0,0
591,0,0
592,0,0
593,0,0
594,0,0
595,0,0
596,0,0
597,0,0
598,0,0
599,0,0
600,0,0
601,0,0
602,0,0
603,0,0
604,0,0
605,0,0
606,0,0
607,0,0
608,0,0
609,0,0
610,0,0
611,0,0
612,0,0
613,0,0
614,0,0
615,0,0
616,0,0
617,0,0
618,0,0
619,0,0
620,0,0
621,0,0
622,0,0
623,0,0
624,0,0
625,0,0
626,0,0
627,0,0
628,0,0
629,0,0
630,0,0
631,0,0
632,0,0
633,0,0
634,0,0
635,0,0
636,0,0
637,0,0
638,0,0
639,0,0
640,0,0
641,0,0
642,0,0
643,0,0
644,0,0
