ian;mo;jo;jul;lai(n);fapar;net fapar;hauteur;lai(n);fapar;net fapar;hauteur
1999;3;8;67;0;0;0;0;0;0;0;0
1999;3;9;68;0;0;0;0;0;0;0;0
1999;3;10;69;0;0;0;0;0;0;0;0
1999;3;11;70;0;0;0;0;0;0;0;0
1999;3;12;71;0;0;0;0;0;0;0;0
1999;3;13;72;0;0;0;0;0;0;0;0
1999;3;14;73;0;0;0;0;0;0;0;0
1999;3;15;74;0;0;0;0;0;0;0;0
1999;3;16;75;0;0;0;0;0;0;0;0
1999;3;17;76;0;0;0;0;0;0;0;0
1999;3;18;77;0;0;0;0;0;0;0;0
1999;3;19;78;0;0;0;0;0;0;0;0
1999;3;20;79;0;0;0;0;0;0;0;0
1999;3;21;80;0;0;0;0;0;0;0;0
1999;3;22;81;0;0;0;0;0;0;0;0
1999;3;23;82;0;0;0;0;0;0;0;0
1999;3;24;83;0;0;0;0;0;0;0;0
1999;3;25;84;0;0;0;0;0;0;0;0
1999;3;26;85;0;0;0;0;0;0;0;0
1999;3;27;86;0;0;0;0;0;0;0;0
1999;3;28;87;0;0;0;0;0;0;0;0
1999;3;29;88;0;0;0;0;0;0;0;0
1999;3;30;89;0;0;0;0;0;0;0;0
1999;3;31;90;0;0;0;0;0;0.04;0.04;0.04
1999;4;1;91;0;0.04;0.0384;0;0.01;0.04;0.04;0.05
1999;4;2;92;0;0.04;0.0384;0.01;0.01;0.04;0.04;0.06
1999;4;3;93;0;0.04;0.0384;0.01;0.01;0.04;0.04;0.07
1999;4;4;94;0;0.04;0.038;0.02;0.02;0.05;0.05;0.08
1999;4;5;95;0.01;0.04;0.0376;0.02;0.03;0.06;0.06;0.11
1999;4;6;96;0.01;0.04;0.0372;0.03;0.05;0.07;0.07;0.14
1999;4;7;97;0.02;0.04;0.0364;0.04;0.06;0.09;0.09;0.16
1999;4;8;98;0.02;0.05;0.044;0.05;0.09;0.12;0.12;0.19
1999;4;9;99;0.03;0.05;0.043;0.06;0.12;0.14;0.14;0.22
1999;4;10;100;0.05;0.05;0.0415;0.07;0.15;0.17;0.17;0.25
1999;4;11;101;0.07;0.06;0.0468;0.08;0.2;0.22;0.22;0.29
1999;4;12;102;0.09;0.07;0.0518;0.09;0.24;0.26;0.26;0.31
1999;4;13;103;0.12;0.09;0.0612;0.11;0.3;0.32;0.32;0.35
1999;4;14;104;0.15;0.1;0.065;0.12;0.36;0.35;0.35;0.39
1999;4;15;105;0.18;0.12;0.0768;0.13;0.36;0.36;0.36;0.39
1999;4;16;106;0.21;0.14;0.091;0.14;0.36;0.35;0.35;0.39
1999;4;17;107;0.25;0.16;0.1024;0.16;0.37;0.36;0.36;0.4
1999;4;18;108;0.31;0.2;0.128;0.18;0.38;0.36;0.36;0.41
1999;4;19;109;0.38;0.23;0.1495;0.19;0.39;0.35;0.35;0.41
1999;4;20;110;0.45;0.28;0.1848;0.21;0.39;0.34;0.34;0.42
1999;4;21;111;0.58;0.35;0.2205;0.24;0.41;0.37;0.37;0.44
1999;4;22;112;0.64;0.37;0.2294;0.25;0.43;0.38;0.38;0.46
1999;4;23;113;0.78;0.42;0.2604;0.28;0.47;0.38;0.38;0.48
1999;4;24;114;0.83;0.44;0.2508;0.29;0.51;0.43;0.43;0.5
1999;4;25;115;0.96;0.47;0.2726;0.31;0.55;0.42;0.42;0.52
1999;4;26;116;1.04;0.49;0.2646;0.32;0.6;0.46;0.46;0.54
1999;4;27;117;1.19;0.52;0.2652;0.34;0.66;0.49;0.49;0.56
1999;4;28;118;1.35;0.55;0.275;0.37;0.72;0.5;0.5;0.58
1999;4;29;119;1.48;0.57;0.2793;0.38;0.77;0.51;0.51;0.6
1999;4;30;120;1.6;0.58;0.261;0.4;0.84;0.55;0.55;0.63
1999;5;1;121;1.76;0.6;0.252;0.42;0.9;0.58;0.58;0.65
1999;5;2;122;1.93;0.62;0.248;0.44;0.97;0.6;0.6;0.67
1999;5;3;123;2.11;0.63;0.2583;0.46;1.03;0.59;0.59;0.7
1999;5;4;124;2.23;0.64;0.256;0.47;1.1;0.6;0.6;0.72
1999;5;5;125;2.32;0.65;0.26;0.48;1.16;0.6;0.6;0.75
1999;5;6;126;2.35;0.65;0.234;0.48;1.17;0.64;0.64;0.76
1999;5;7;127;2.49;0.66;0.231;0.5;1.24;0.65;0.65;0.78
1999;5;8;128;2.58;0.66;0.2112;0.51;1.3;0.68;0.68;0.8
1999;5;9;129;2.7;0.67;0.201;0.52;1.35;0.7;0.7;0.82
1999;5;10;130;2.84;0.67;0.201;0.53;1.42;0.7;0.7;0.84
1999;5;11;131;2.93;0.67;0.2077;0.54;1.51;0.69;0.69;0.87
1999;5;12;132;2.96;0.68;0.1972;0.54;1.57;0.71;0.71;0.89
1999;5;13;133;3.01;0.68;0.1836;0.55;1.63;0.73;0.73;0.91
1999;5;14;134;3.06;0.68;0.1632;0.55;1.69;0.76;0.76;0.92
1999;5;15;135;3.16;0.68;0.1632;0.56;1.75;0.76;0.76;0.94
1999;5;16;136;3.23;0.68;0.1428;0.57;1.85;0.79;0.79;0.96
1999;5;17;137;3.33;0.69;0.1587;0.57;1.91;0.77;0.77;0.98
1999;5;18;138;3.36;0.69;0.1449;0.58;1.89;0.79;0.79;1
1999;5;19;139;3.46;0.69;0.1587;0.59;1.87;0.77;0.77;1
1999;5;20;140;3.52;0.69;0.1587;0.59;1.85;0.77;0.77;1
1999;5;21;141;3.52;0.69;0.1518;0.6;1.85;0.78;0.78;1
1999;5;22;142;3.52;0.69;0.1518;0.6;1.82;0.78;0.78;1
1999;5;23;143;3.52;0.69;0.1587;0.61;1.8;0.77;0.77;1
1999;5;24;144;3.52;0.69;0.1656;0.61;1.77;0.76;0.76;1
1999;5;25;145;3.52;0.69;0.1656;0.62;1.75;0.76;0.76;1
1999;5;26;146;3.52;0.69;0.1587;0.62;1.75;0.77;0.77;1
1999;5;27;147;3.52;0.69;0.1656;0.63;1.75;0.76;0.76;1
1999;5;28;148;3.52;0.69;0.1656;0.63;1.75;0.76;0.76;1
1999;5;29;149;3.52;0.69;0.1656;0.64;1.75;0.76;0.76;1
1999;5;30;150;3.52;0.69;0.1656;0.64;1.75;0.76;0.76;1
1999;5;31;151;3.52;0.69;0.1794;0.65;1.75;0.74;0.74;1
1999;6;1;152;3.52;0.69;0.1794;0.65;1.75;0.74;0.74;1
1999;6;2;153;3.51;0.69;0.1863;0.66;1.75;0.73;0.73;1
1999;6;3;154;3.51;0.69;0.1863;0.66;1.75;0.73;0.73;1
1999;6;4;155;3.51;0.69;0.1932;0.67;1.75;0.72;0.72;1
1999;6;5;156;3.5;0.69;0.1863;0.67;1.75;0.73;0.73;1
1999;6;6;157;3.49;0.69;0.1863;0.68;1.75;0.73;0.73;1
1999;6;7;158;3.47;0.69;0.1932;0.68;1.75;0.72;0.72;1
1999;6;8;159;3.46;0.69;0.1932;0.69;1.75;0.72;0.72;1
1999;6;9;160;3.44;0.69;0.1932;0.69;1.75;0.72;0.72;1
1999;6;10;161;3.43;0.69;0.2001;0.7;1.75;0.71;0.71;1
1999;6;11;162;3.43;0.69;0.2001;0.7;1.65;0.71;0.71;1
1999;6;12;163;3.22;0.68;0.204;0.7;1.56;0.7;0.7;1
1999;6;13;164;3.01;0.68;0.2108;0.7;1.45;0.69;0.69;1
1999;6;14;165;2.83;0.67;0.2077;0.7;1.37;0.69;0.69;1
1999;6;15;166;2.61;0.66;0.2112;0.7;1.26;0.68;0.68;1
1999;6;16;167;2.37;0.65;0.221;0.7;1.15;0.66;0.66;1
1999;6;17;168;2.09;0.63;0.2268;0.7;1.02;0.64;0.64;1
1999;6;18;169;1.81;0.6;0.228;0.7;0.89;0.62;0.62;1
1999;6;19;170;1.58;0.57;0.2337;0.7;0.78;0.59;0.59;1
1999;6;20;171;1.33;0.53;0.2438;0.7;0.66;0.54;0.54;1
1999;6;21;172;1.11;0.49;0.2401;0.7;0.56;0.51;0.51;1
1999;6;22;173;0.92;0.45;0.2385;0.7;0.47;0.47;0.47;1
1999;6;23;174;0.73;0.39;0.2262;0.7;0.38;0.42;0.42;1
1999;6;24;175;0.52;0.32;0.2112;0.7;0.28;0.34;0.34;1
1999;6;25;176;0.24;0.19;0.1463;0.7;0.15;0.23;0.23;1
1999;6;26;177;0;0.04;0.0372;0.7;0.02;0.07;0.07;1
1999;6;27;178;0;0.04;0.0384;0.7;0;0.04;0.04;1
1999;6;28;179;0;0.04;0.0384;0.7;0;0.04;0.04;1
1999;6;29;180;0;0.04;0.0384;0.7;0;0.04;0.04;1
1999;6;30;181;0;0.04;0.0384;0.7;0;0.04;0.04;1
1999;7;1;182;0;0.04;0.0384;0.7;0;0.04;0.04;1
1999;7;2;183;0;0.04;0.0384;0.7;0;0.04;0.04;1
1999;7;3;184;0;0.04;0.0384;0;0;0.04;0.0384;0
1999;7;4;185;0;0.04;0.0384;0;0;0.04;0.0384;0
1999;7;5;186;0;0.04;0.0384;0;0;0.04;0.0384;0
1999;7;6;187;0;0.04;0.0384;0;0;0.04;0.0384;0
1999;7;7;188;0;0.04;0.0384;0;0;0.04;0.0384;0
1999;7;8;189;0;0.04;0.0384;0;0;0.04;0.0384;0
1999;7;9;190;0;0.04;0.0384;0;0;0.04;0.0384;0
1999;7;10;191;0;0.04;0.0384;0;0;0.04;0.0384;0
1999;7;11;192;0;0.04;0.0384;0;0;0.04;0.0384;0
1999;7;12;193;0;0.04;0.0384;0;0;0.04;0.0384;0
1999;7;13;194;0;0.04;0.0384;0;0;0.04;0.0384;0
1999;7;14;195;0;0.04;0.0384;0;0;0.04;0.0384;0
1999;7;15;196;0;0.04;0.0384;0;0;0.04;0.0384;0
1999;7;16;197;0;0.04;0.0384;0;0;0.04;0.0384;0
1999;7;17;198;0;0.04;0.0384;0;0;0.04;0.0384;0
