lai(n)
masecnp
matigestruc
mafeuilverte
mafeuiljaune
mafeuiltombe
restemp
maperenne
resperenne
QNplantenp
QNtige
QNfeuille
QNfeuiltombe
QNrestemp
QNperenne
QNresperenne
QNabsoaer
QNabsorac
QNabsoper
QNabso
absoaer
absorac
absoper
absotot
LRACH(1)
LRACH(2)
LRACH(3)
LRACH(4)
LRACH(5)
