rnet Brutsaert pm=tvar(tmin);rnet Brunt
-0.7063218;-1.288305
-0.1347477;-6.79E-01
0.9780277;-2.01E-01
1.118525;2.18E-01
-0.482883;-1.256168
-0.3771242;-2.22351
-0.9955571;-2.226143
-1.122368;-2.043525
-1.406682;-2.010613
-2.05343;-2.114457
-2.014984;-1.562227
0.9529114;5.75E-01
1.299602;7.50E-01
1.274301;-3.23E-01
1.347991;4.38E-01
0.9288754;6.32E-02
1.119375;3.00E-02
1.414078;9.82E-01
1.246032;1.76E-01
-0.8214663;-2.81E-01
-0.6571031;-1.93E-01
1.718562;1.05E-01
1.471548;2.37E-01
-0.4812959;-4.63E-01
-0.5561613;-2.50E-01
-0.2406665;-2.12E-01
-0.5713686;-5.33E-01
-0.6815974;-1.26E-01
1.357311;1.063166
-1.334192;-3.06E-01
0.2370806;1.085512
0.3297263;2.12E-01
-1.602938;-2.75E-01
-1.682188;1.89E-01
-0.7889072;1.230098
-0.2697263;1.413142
1.073314;1.697435
-0.8997852;1.02384
1.959294;1.206079
1.384035;1.565271
2.252588;7.39E-01
0.9425918;-3.27E-01
-0.8006546;1.18E-02
0.2734082;1.217738
1.358257;1.41E-02
-0.01624937;3.19E-01
1.794844;3.96E-01
0.2275828;1.503737
0.4950022;1.65188
1.315138;1.403362
2.575038;1.852558
1.966798;1.624896
3.03971;1.44E-01
0.9593053;2.57E-01
-0.8135402;9.81E-01
-0.2219222;1.586639
2.835264;2.124715
1.013588;2.375049
2.093452;2.346555
4.631931;1.580783
1.108553;1.624581
-0.03348158;1.426125
1.151215;2.294774
1.025402;2.022718
1.970906;2.184563
1.398617;2.373914
3.505672;2.843923
5.229433;2.817087
5.903097;2.968053
6.232855;3.283451
6.185222;3.120244
4.293039;3.163125
5.891334;2.881019
6.730961;3.071633
6.046009;2.754494
5.523876;3.174442
4.432642;4.232711
5.317205;4.114551
5.515676;4.46981
5.467678;4.135292
5.013187;4.689265
6.053435;4.630724
8.469441;3.626553
7.391082;4.213688
4.945851;4.721376
3.081095;4.679126
3.439469;5.279412
5.871481;5.501744
7.729702;4.632615
7.674565;4.280574
8.796322;6.116886
6.354239;5.072987
4.885327;5.163052
4.779398;6.067731
4.227819;6.202108
5.562197;5.763632
10.0581;5.955306
7.825027;5.273571
5.03029;6.446754
8.223802;7.287851
10.50745;5.502763
3.665983;4.215751
5.641298;6.58407
2.975479;3.426059
14.9086;12.15442
12.21613;8.292015
11.46839;6.429072
8.187259;7.175488
5.963396;7.547224
5.613273;7.491319
6.807101;7.46526
9.763672;9.30225
11.05179;10.10049
13.81084;11.88385
13.5924;11.00697
9.771773;9.143279
7.010272;8.569444
7.968425;9.708511
7.359471;7.375557
7.099896;5.015221
11.82858;9.347947
11.09133;10.11306
12.34901;10.32632
5.949393;6.933512
9.316295;9.767537
6.271745;6.096308
5.747911;5.849886
6.769791;8.081645
9.386149;12.36919
8.170138;10.34875
6.777444;9.429792
7.617555;7.943179
10.54691;11.38075
8.785625;9.194924
3.629845;5.840149
9.074983;10.11454
10.65776;10.44967
8.428238;10.76433
6.163245;8.985378
2.376415;6.072615
8.915832;11.63397
8.910566;10.34275
14.75568;10.71404
10.52033;10.47809
10.47466;11.1774
10.19351;10.44457
11.26692;11.79918
4.112132;3.734591
8.273403;10.66293
7.964647;8.439789
4.759369;4.447089
13.55254;13.50177
11.65292;10.85016
13.90836;14.45514
13.13357;13.72452
11.27776;11.06089
12.82133;13.11304
12.33928;12.9584
10.36775;10.6309
8.174849;7.898821
16.26543;13.72799
12.48042;11.87103
12.78559;11.73526
16.76681;13.26453
12.21811;10.22154
14.39169;12.85972
4.802375;4.590937
12.03017;10.59301
14.0464;12.43463
14.84792;12.95925
12.43433;11.19514
3.89673;3.284962
14.06152;12.76568
5.445347;5.890045
14.48732;12.8984
13.29948;12.37181
15.29992;14.00986
5.29141;4.995175
7.581143;7.337588
9.920714;9.708545
12.37493;11.09269
17.02811;14.04283
17.75114;13.77789
16.51956;13.62612
14.47954;13.90707
13.044;12.45717
13.03248;12.11833
15.12173;13.55308
14.64297;14.03357
14.05198;13.5403
16.30824;13.46406
8.863531;8.079828
7.189064;7.062204
13.67514;11.46072
17.42376;13.7136
16.85881;13.11564
16.48472;12.57405
12.76148;11.64168
13.49489;12.193
9.777854;9.071019
12.94336;10.87126
16.14454;13.35876
15.53933;12.17132
14.95688;13.15442
13.1007;12.23158
14.05652;11.69407
13.00676;10.72412
15.81244;10.84964
15.09317;11.94391
14.06757;12.88117
12.07246;12.19863
5.267051;5.672458
9.026411;8.588355
12.70717;12.41093
12.76056;12.4512
12.22509;11.79897
11.74402;11.61747
3.065159;2.576885
14.64039;13.80192
14.96969;12.3611
14.648;11.78862
10.24994;10.02781
9.65959;8.888833
10.98729;10.23445
9.68128;9.334579
9.582693;9.734599
9.982229;9.904767
7.919486;7.679971
9.822353;9.448214
10.02106;8.975422
9.403503;9.011774
10.69546;9.236743
6.645852;5.974833
11.34594;10.89111
7.834766;6.125422
13.06971;9.316248
8.425564;8.452235
9.050854;8.488604
5.535756;5.180537
2.904062;2.653909
12.24953;10.44777
8.281408;10.73305
8.244234;9.570474
7.716587;8.826975
9.471245;7.041071
7.632563;5.344127
8.961939;5.991299
8.622874;5.553647
6.443517;6.208575
6.415084;5.890874
5.457084;4.658597
11.62741;7.468209
6.969121;6.7685
7.992599;7.337775
7.498806;5.447577
5.349085;4.453079
5.316593;4.822136
5.152989;4.995587
5.109613;4.722923
5.231462;4.496048
5.057366;4.435123
4.957655;4.280818
4.864815;3.668982
4.465318;3.824448
4.702057;4.123562
4.356884;4.195044
4.257744;3.907195
4.52552;3.454025
4.916594;2.359185
6.612004;2.232762
6.768493;9.28E-01
4.507207;1.98456
4.076651;3.206736
2.188263;1.96012
3.280646;3.028108
5.818841;5.006569
5.763408;4.312554
1.430184;1.63E-01
