codeplante
bet
codemonocot
2
alphaco2
1.20000
tdmin
3.00000
tdmax
25.00000
codetemp
1
codegdh
1
coeflevamf
-999
coefamflax
-999
coeflaxsen
-999
coefsenlan
-999
coeflevdrp
-999
coefdrpmat
-999
coefflodrp
-999
codephot
2
codephot_part
2
coderetflo
2
stressdev
-999
codebfroid
1
jvcmini
-999
julvernal
-999
tfroid
-999
ampfroid
-999
tdmindeb
-999
tdmaxdeb
-999
codedormance
3
ifindorm
-999
q10
-999
idebdorm
-999
codegdhdeb
2
code_WangEngel
2
tdoptdeb
-999
tgmin
3.00000
codeperenne
1
codegermin
1
stpltger
45.00000
potgermi
-1.60000
nbjgerlim
50
propjgermin
1.00000
codehypo
1
belong
0.01150
celong
4.57010
elmax
7.21000
nlevlim1
10
nlevlim2
50
vigueurbat
1.00000
laiplantule
-999
nbfeuilplant
-999
masecplantule
-999
zracplantule
-999
phyllotherme
120.00000
laicomp
0.75000
tcmin
3.00000
tcmax
30.00000
tcxstop
100.00000
codelaitr
1
vlaimax
2.20000
pentlaimax
5.50000
udlaimax
3.00000
ratiodurvieI
1.00000
ratiosen
0.87000
abscission
0.56000
parazofmorte
20.00000
innturgmin
0.30000
dlaimin
0.00000
codlainet
2
tustressmin
-999
durviesupmax
0.00000
codestrphot
2
phobasesen
-999
dltamsmaxsen
-999
dltamsminsen
-999
alphaphot
-999
tauxrecouvmax
-999
tauxrecouvkmax
-999
pentrecouv
-999
infrecouv
-999
codetransrad
1
forme
-999
rapforme
-999
adfol
-999
dfolbas
-999
dfolhaut
-999
temax
30.00000
teoptbis
30.00000
efcroijuv
2.3
efcroiveg
5.4
efcroirepro
3.98000
remobres
0.29000
coefmshaut
0.00000
slamin
70.000
envfruit
0.00000
sea
0.00000
code_acti_reserve
2
propresP
-999
PropresPN
-999
Efremobil
-999
Propres
-999
tauxmortresP
-999
Parazoper
-999
ParazoTmorte
-999
inilai
-999
resplmax
0.66
codemontaison
2
codedyntalle
2
codetranspitalle
1
SurfApex
-999
SeuilMorTalle
-999
SigmaDisTalle
-999
VitReconsPeupl
-999
SeuilReconsPeupl
-999
MaxTalle
-999
SeuilLAIapex
-999
tigefeuilcoupe
-999
irazomax
0.507
codeindetermin
2
cgrain
-999
cgrainv0
-999
codeir
1
irmax
-999
nboite
50
allocfrmax
0.90000
afpf
0.50000
bfpf
1.00000
cfpf
0.00000
dfpf
0.20000
spfrmin
0.00001
spfrmax
0.00002
splaimin
-0.84000
splaimax
1.07900
codcalinflo
1
codetremp
2
tminremp
-999
tmaxremp
-999
sensanox
0.00000
stoprac
sen
sensrsec
0.50000
contrdamax
0.30000
rayon
0.02
codetemprac
2
codemortalracine
2
coefracoupe
-999
coderacine
1
zlabour
102.00000
zpente
119.00000
zprlim
150.00000
draclong
-999
debsenrac
-999
lvfront
-999
longsperac
-999
codedisrac
2
kdisrac
-999
alloperirac
-999
codazorac
2
minefnra
-999
minazorac
-999
maxazorac
-999
codtrophrac
3
repracpermax
-999
repracpermin
-999
krepracperm
-999
repracseumax
-999
repracseumin
-999
krepracseu
-999
code_stress_root
2
code_rootdeposition
2
parazorac
-999
code_diff_root
2
lvmax
-999
rapdia
-999
RTD
-999
propracfmax
-999
tletale
-25.00000
tdebgel
-4.00000
codgellev
1
nbfgellev
-999
tgellev90
-999
codgeljuv
1
tgeljuv90
-999
codgelveg
1
tgelveg90
-999
codgelflo
1
tgelflo10
-999
tgelflo90
-999
h2ofeuilverte
0.90000
h2ofeuiljaune
0.15000
h2otigestruc
0.60000
h2oreserve
0.7500
h2ofrvert
0.80000
tempdeshyd
0.00000
codebeso
1
kmax
1.40000
rsmin
-999
codeintercept
2
mouillabil
-999
stemflowmax
-999
kstemflow
-999
Vmax1
0.00180
Kmabs1
50.000
Vmax2
0.05000
Kmabs2
25000.000
adil
5.21000
bdil
0.56000
masecNmax
1.00000
INNmin
0.30000
INNimin
-0.50000
inngrain1
2.00000
inngrain2
2.00000
bdilmax
0.56000
codeplisoleN
2
adilmax
-999
Nmeta
6.47
masecmeta
0.04
Nreserve
1.5
codeINN
1
codelegume
1
stlevdno
-999
stdnofno
-999
stfnofvino
-999
vitno
-999
profnod
-999
concNnodseuil
-999
concNrac0
-999
concNrac100
-999
tempnod1
-999
tempnod2
-999
tempnod3
-999
tempnod4
-999
codefixpot
1
fixmax
-999
fixmaxveg
-999
fixmaxgr
-999
codazofruit
1
stadebbchplt
00
stadebbchger
05
stadebbchlev
09
stadebbchamf
-99
stadebbchlax
-99
stadebbchsen
-99
stadebbchflo
-99
stadebbchdrp
49
stadebbchnou
-99
stadebbchdebdes
-99
stadebbchmat
-99
stadebbchrec
99
stadebbchfindorm
-99
codevar
betterave
stlevamf
500
stamflax
5715
stlevdrp
1847
stflodrp
0
stdrpdes
700
jvc
0
stdordebour
-999
sensiphot
-999
phobase
-999
phosat
-999
adens
-0.47
bdens
7
hautbase
0
hautmax
0.6
khaut
0.7
durvieF
95
stlaxsen
-999
stsenlan
-999
dlaimax
-999
dlaimaxbrut
0.00144
innsen
0.3
rapsenturg
0.5
extin
0.58
ktrou
-999
temin
3
teopt
13
slamax
250
tigefeuil
0.58
pgrainmaxi
1057
vitpropsucre
8e-04
vitprophuile
-999
vitirazo
0.013
deshydbase
0
nbjgrain
-999
nbgrmin
-999
nbgrmax
-999
stdrpmat
-999
vitircarb
0.015
vitircarbT
-999
afruitpot
0.00476
dureefruit
9850
stdrpnou
210
nbinflo
1
inflomax
-999
pentinflores
-999
croirac
0.14
tgellev10
-999
tgeljuv10
-999
tgelveg10
-999
psisto
10
psiturg
10
swfacmin
0.1
