HR(1)
TS(1)
AZnit(1)
azomes
AZamm(1)
ammomes
SMNmes
SMN
DSMN
QCapp
QNapp
totapN
Qles
QNdenit
Qem_N2O
Qem_N2Onit
Qem_N2Oden
couvermulch
qmulch
Nmulch
Cmulch
Cbmulch
Nbmulch
Cr
Nr
Cb
Nb
Qminh
Qminr
Qmin
QCprimed
QNprimed
CO2hum
CO2mul
CO2res
CO2sol
QCO2hum
QCO2mul
QCO2res
QCO2sol
SOC
SON
Chumt
Nhumt
DSOC
DSON
DSTN