1
1
2
4
flo
lev
mat
fin
masec(n)
mafruit
iflos
imats
irecs
laimax
cprecip
cet
QNplante
Qles
lai(n)
azomes
resmes
hauteur
cumraint
cumrg
fapar
tcult
ilevs
cep
inn
swfac
turfac
densite
densiteequiv
Qminh
Qminr
Qdrain
zrac