;Code name: option name;Option choice;Comments;Sub-option code name: sub-option name;Option choice
Strategy and simulation options;codeinnact (*): Nitrogen stress activation (yes/no);;The stress is always calculated but has no effect if 'no' is chosen;;
Strategy and simulation options;codeh2oact (*): Water stress activation (yes/no);;The stress is always calculated but has no effect if 'no' is chosen;;
Strategy and simulation options;codeminopt: Optimum mineralisation in bare soil (yes/no);;;;
Strategy and simulation options;iniprofil (*): Smoothing of initial profiles (yes/no);;;;
Strategy and simulation options;codeprofmes: Depth for mineral N and water stocks calculation;profmes;;;
Strategy and simulation options;codeprofmes: Depth for mineral N and water stocks calculation;profsol;;;
Strategy and simulation options;codeinitprec (*): Climatic series;reset;;;
Strategy and simulation options;codeinitprec (*): Climatic series;succession;Mandatory for rotation simulation;;
Strategy and simulation options;codemsfinal: Biomass and yield conservation after harvest (yes/no);;;;
Strategy and simulation options;codeactimulch: Take account of mulch (yes/no);;;;
Strategy and simulation options;codefrmur: Fruit load;all fruits (including ripe ones);;;
Strategy and simulation options;codefrmur: Fruit load;growing fruits only;;;
Strategy and simulation options;codemicheur: Hourly microclimate (yes/no);;;;
Strategy and simulation options;codeoutscient: Scientific writing in st2 and report (yes/no);;;;
Strategy and simulation options;codeseprapport: Separator spaces in report (yes/no);;;;
Strategy and simulation options;codesensibilite: Activation of model sensitivity analysis (yes/no);;;;
