:nbplantes:
1
:plante:
snu
0.0000
0.0000
0.0000
code_acti_reserve
2
0
0
0
0
0.0000
0.0000
0.0000
:densinitial:
0.0000 0.0000 0.0000 0.0000 0.0000 
:plante:




code_acti_reserve
2
0
0
0
0



:densinitial:
     
:Hinitf:
12.4186606970716 14.3406696514642 11 11.9 14.7 
:NO3initf:
7.5 15.1 10.9 4.2 2.6 
:NH4initf:
0.3 0.6 0.3 1.1 1.1 
:snow:
Sdepth0
0.0
Sdry0
0.0
Swet0
0.0
ps0
0.0
