%!PS-Adobe-3.0 EPSF-3.0
%%BoundingBox: 0 0 367 737
%%Creator: yExport 1.5
%%Producer: org.freehep.graphicsio.ps.EPSGraphics2D Revision: 12753 
%%For: 
%%Title: 
%%CreationDate: Wednesday, June 22, 2022 at 5:42:55 PM Central European Summer Time
%%LanguageLevel: 3
%%EndComments
%%BeginProlog
100 dict dup begin

%
% File: org/freehep/graphicsio.ps/PSProlog.txt
% Author: Charles Loomis
%

% Redefinitions which save some space in the output file.  These are also
% the same as the PDF operators.
/q {gsave} def
/Q {grestore} def

/n {newpath} def
/m {moveto} def
/l {lineto} def
/c {curveto} def
/h {closepath} def

/re {4 -2 roll moveto
     dup 0 exch rlineto exch 0 rlineto
     neg 0 exch rlineto closepath} def

/f {fill} def
/f* {eofill} def
/F {gsave vg&FC fill grestore} def
/F* {gsave vg&FC eofill grestore} def

/s {closepath stroke} def
/S {stroke} def

/b {closepath gsave vg&FC fill grestore
    gsave stroke grestore newpath} def
/B {gsave vg&FC fill grestore gsave stroke grestore newpath} def
/b* {closepath gsave vg&FC eofill grestore
    gsave stroke grestore newpath} def
/B* {gsave vg&FC eofill grestore gsave stroke grestore newpath} def

/g {1 array astore /vg&fcolor exch def} def
/G {setgray} def
/k {4 array astore /vg&fcolor exch def} def
/K {setcmykcolor} def
/rg {3 array astore /vg&fcolor exch def} def
/RG {setrgbcolor} def

% Initialize the fill color.
0 0 0 rg

/vg&FC {mark vg&fcolor aload pop
        counttomark 1 eq {G} if
        counttomark 3 eq {RG} if
        counttomark 4 eq {K} if
        cleartomark } def

/vg&DFC {/vg&fcolor exch def} def

/vg&C {mark exch aload pop
       counttomark 1 eq {G} if
       counttomark 3 eq {RG} if
       counttomark 4 eq {K} if
       cleartomark } def

/w {setlinewidth} def
/j {setlinejoin} def
/J {setlinecap} def
/M {setmiterlimit} def
/d {setdash} def
/i {setflat} def

/W {clip} def
/W* {eoclip} def

% Setup the default graphics state.
% (black; 1 pt. linewidth; miter join; butt-ends; solid)
/defaultGraphicsState {0 g 1 w 0 j 0 J [] 0 d} def

% Emulation of the rectangle operators for PostScript implementations
% which do not implement all Level 2 features.  This is an INCOMPLETE
% emulation; only the "x y width height rect..." form is emulated.
/*rf {gsave newpath re fill grestore} def
/*rs {gsave newpath re stroke grestore} def
/*rc {newpath re clip} def
/rf  /rectfill where {pop /rectfill}{/*rf} ifelse load def
/rs  /rectstroke where {pop /rectstroke}{/*rs} ifelse load def
/rc  /rectclip where {pop /rectclip}{/*rc} ifelse load def

% Emulation of the selectfont operator.  This includes a 20% increase in
% the fontsize which is necessary to get sizes similar to the Java fonts.
/*sf {exch findfont exch
      dup type /arraytype eq {makefont}{scalefont} ifelse setfont} bind def
/sf /selectfont where {pop {1.2 mul selectfont}}{{1.2 mul *sf}} ifelse def

% Special version of stroke which allows the dash pattern to continue
% across path segments.  (This may be needed for PostScript although
% modern printers seem to do this correctly.)
/vg&stroke {
  currentdash pop length 0 eq
  {stroke}
  {
    currentdash /vg&doffset exch def pop
    flattenpath
    {m vg&resetdash}
    {2 copy
     currentpoint
     3 -1 roll sub dup mul
     3 1 roll sub dup mul
     add sqrt
     3 1 roll l
     currentdash 3 -1 roll add setdash}
     {}
     {h vg&resetdash}
     pathforall
     stroke
     vg&resetdash
  } ifelse
} def
/vg&resetdash {currentdash pop vg&doffset setdash} def

% Initialize variables for safety.
/delta 0 def
/xv 0 def  /yv 0 def  /width 0 def  /height 0 def

% Initialize to portrait INTERNATIONAL (Letter-height, A4-width) page.
/pw 595 def  /ph 791  def  /po true def /ftp false def

% Initialize margins to 20 points.
/ml 20 def  /mr 20 def  /mt 20 def  /mb 20 def

% Temporary matrices.
/smatrix 0 def  /nmatrix 0 def

% set page size (usage: <page width><page height> setpagesize)
/setpagesize {/ph exch def /pw exch def} def

% set page orientation (usage: portrait or landscape)
/portrait {/po true def} def
/landscape {/po false def} def

% force natural size for image (usage: naturalsize)
/naturalsize {/ftp false def} def

% resize image to fill page (usage: fittopage)
/fittopage {/ftp true def} def

% set margins of the page (usage: <left><bottom><top><right> setmargins)
/setmargins {/mr exch def /mt exch def /mb exch def /ml exch def} def

% set the graphic's size (usage: <width><height> setsize)
/setsize {/gh exch def /gw exch def} def

% set the graphic's origin (usage: <x0><y0> setorigin)
/setorigin {/gy exch def /gx exch def} def

% calculate image center
/imagecenter {pw ml sub mr sub 2 div ml add
              ph mt sub mb sub 2 div mb add} def

% calculate the necessary scaling
/imagescale {po {gw}{gh} ifelse pw ml sub mr sub div
             po {gh}{gw} ifelse ph mt sub mb sub div
             2 copy lt {exch} if pop
             ftp not {1 2 copy lt {exch} if pop} if
             1 exch div /sfactor exch def
             /gw gw sfactor mul def /gh gh sfactor mul def} def

% calculate image origin
/imageorigin {pw ml sub mr sub 2 div ml add
              po {gw}{gh} ifelse 2 div sub
              ph mt sub mb sub 2 div mb add
              po {gh}{gw} ifelse 2 div po {add}{sub} ifelse} def

% calculate the clipping origin
/cliporigin  {pw ml sub mr sub 2 div ml add
              po {gw}{gh} ifelse 2 div sub floor
              ph mt sub mb sub 2 div mb add
              po {gh}{gw} ifelse 2 div sub floor} def

% Set the clipping region to the bounding box.
/cliptobounds {cliporigin po {gw}{gh} ifelse 1 add
                          po {gh}{gw} ifelse 1 add rc} def

% set the base transformation matrix (usage: setbasematrix)
/setbasematrix {imageorigin translate
                po {0}{90} ifelse rotate
                sfactor sfactor neg scale
                /defaultmatrix matrix currentmatrix def} def

% The lower-right bias in drawing 1 pt. wide lines.
/bias  {q 0.5 0.5 translate} def
/unbias {Q} def

% Define the composite fonts used to print Unicode strings.
% Undefine particular values in an encoding array.
/vg&undef { {exch dup 3 -1 roll /.notdef put} forall } def
/vg&redef { {3 -1 roll dup 4 2 roll put} forall } def

% usage: key encoding basefontname vg&newbasefont font
/vg&newbasefont {
findfont dup length dict copy
  begin
    currentdict /FID undef
    /Encoding exch def
    dup /FontName exch def
    currentdict
  end
definefont
} def

% usage: key encoding basefontname vg&newskewedbasefont font
/vg&newskewedbasefont {
findfont dup length dict copy
  begin
    currentdict /FID undef
    /Encoding exch def
    dup /FontName exch def
    exch FontMatrix exch matrix concatmatrix /FontMatrix exch def
    currentdict
  end
definefont
} def

% usage: basekey suffix vg&nconcat name
/vg&nconcat {
  2 {dup length string cvs exch} repeat
  dup length 3 -1 roll dup length 3 -1 roll add string
  dup 0 4 -1 roll dup length 5 1 roll putinterval
  dup 4 -2 roll exch putinterval cvn
} def

%usage: fontname vg&skewmatrix matrix
/vg&skewmatrix {
findfont dup /FontInfo known
  {
    /FontInfo get dup /ItalicAngle known
    {
      [ 1 0 4 -1 roll /ItalicAngle get neg dup sin exch cos div 1 0 0 ]
    }
    {pop matrix} ifelse
  }
  {pop matrix} ifelse
} def

% usage: newfontname basefontname vg&newcompositefont --
/vg&newcompositefont {
/vg&fstyle exch def
/vg&bfont exch def
/vg&fname exch def
<<
/FontStyleBits vg&fstyle
/FontType 0
/FontMatrix matrix
/FontName vg&fname
/FMapType 2
/Encoding [ 0 1 255 {pop 6} for ]
          dup 16#00 0 put % Latin
          dup 16#03 1 put % Greek
          dup 16#20 2 put % Punctuation
          dup 16#21 3 put % Arrows
          dup 16#22 4 put % MathOps
          dup 16#27 5 put % Dingbats

/FDepVector [
vg&bfont /-UC-Latin vg&nconcat UCLatinEncoding
vg&bfont vg&newbasefont

vg&bfont vg&skewmatrix
vg&bfont /-UC-Greek vg&nconcat UCGreekEncoding
/Symbol vg&newskewedbasefont

vg&bfont /-UC-Punctuation vg&nconcat UCPunctuationEncoding
vg&bfont vg&newbasefont

/Arrows-UC findfont
/MathOps-UC findfont
/Dingbats-UC findfont
/Undefined-UC findfont ]
>>
vg&fname exch definefont pop
} def

% Null encoding vector (all elements set to .notdef)
/NullEncoding [ 256 {/.notdef} repeat ] def

% Unicode Latin encoding (unicode codes \u0000-\u00ff)
/UCLatinEncoding
  ISOLatin1Encoding dup length array copy
  dup 16#60 /grave put
  [ 16#90 16#91 16#92 16#93 16#94 16#95 16#96
    16#97 16#98 16#9a 16#9b 16#9d 16#9e 16#9f
  ] vg&undef
  def

% Unicode Greek encoding (unicode codes \u0370-\u03ff)
/UCGreekEncoding
  NullEncoding dup length array copy
  << 16#91 /Alpha    16#92 /Beta      16#93 /Gamma    16#94 /Delta
     16#95 /Epsilon  16#96 /Zeta      16#97 /Eta      16#98 /Theta
     16#99 /Iota     16#9a /Kappa     16#9b /Lambda   16#9c /Mu
     16#9d /Nu       16#9e /Xi        16#9f /Omicron  16#a0 /Pi
     16#a1 /Rho      16#a3 /Sigma     16#a4 /Tau      16#a5 /Upsilon
     16#a6 /Phi      16#a7 /Chi       16#a8 /Psi      16#a9 /Omega
     16#b1 /alpha    16#b2 /beta      16#b3 /gamma    16#b4 /delta
     16#b5 /epsilon  16#b6 /zeta      16#b7 /eta      16#b8 /theta
     16#b9 /iota     16#ba /kappa     16#bb /lambda   16#bc /mu
     16#bd /nu       16#be /xi        16#bf /omicron  16#c0 /pi
     16#c1 /rho      16#c2 /sigma1    16#c3 /sigma    16#c4 /tau
     16#c5 /upsilon  16#c6 /phi1      16#c7 /chi      16#c8 /psi
     16#c9 /omega    16#7e /semicolon 16#87 /dotmath  16#d1 /theta1
     16#d2 /Upsilon1 16#d5 /phi       16#d6 /omega1
  >> vg&redef
  def

% Unicode punctuation encoding (unicode codes \u2000-\u206f)
/UCPunctuationEncoding
  NullEncoding dup length array copy
  << 16#10 /hyphen          16#11 /hyphen              16#12 /endash
     16#13 /emdash          16#18 /quoteleft           16#19 /quoteright
     16#1a /quotesinglbase  16#1b /quotesingle         16#1c /quotedblleft
     16#1d /quotedblright   16#1e /quotedblbase        16#1f /quotedbl
     16#20 /dagger          16#21 /daggerdbl           16#22 /bullet
     16#24 /period          16#26 /ellipsis            16#27 /periodcentered
     16#30 /perthousand     16#44 /fraction
     16#70 /zerosuperior    16#74 /foursuperior        16#75 /fivesuperior
     16#76 /sixsuperior     16#77 /sevensuperior       16#78 /eightsuperior
     16#79 /ninesuperior    16#7b /hyphensuperior      16#7d /parenleftsuperior
     16#7e /parenrightsuperior
     16#80 /zeroinferior    16#84 /fourinferior        16#85 /fiveinferior
     16#81 /oneinferior     16#82 /twoinferior         16#83 /threeinferior
     16#86 /sixinferior     16#87 /seveninferior       16#88 /eightinferior
     16#89 /nineinferior    16#8b /hypheninferior      16#8d /parenleftinferior
     16#8e /parenrightinferior
  >> vg&redef
  def

% Unicode mathematical operators encoding (unicode codes \u2200-\u22ff)
/UCMathOpsEncoding
  NullEncoding dup length array copy
  << 16#00 /universal       16#02 /partialdiff         16#03 /existential
     16#05 /emptyset        16#06 /Delta               16#07 /gradient
     16#08 /element         16#09 /notelement          16#0b /suchthat
     16#0f /product         16#11 /summation           16#12 /minus
     16#15 /fraction        16#17 /asteriskmath        16#19 /bullet
     16#1a /radical         16#1d /proportional        16#1e /infinity
     16#20 /angle           16#23 /bar                 16#27 /logicaland
     16#28 /logicalor       16#29 /intersection        16#2a /union
     16#2b /integral        16#34 /therefore           16#36 /colon
     16#3c /similar         16#45 /congruent           16#48 /approxequal
     16#60 /notequal        16#61 /equivalence         16#64 /lessequal
     16#65 /greaterequal    16#82 /propersubset        16#83 /propersuperset
     16#86 /reflexsubset    16#87 /reflexsuperset      16#95 /circleplus
     16#97 /circlemultiply  16#a5 /perpendicular       16#03 /existential
     16#c0 /logicaland      16#c1 /logicalor           16#c2 /intersection
     16#c3 /union           16#c4 /diamond             16#c5 /dotmath
  >> vg&redef
  def

% Unicode arrows encoding (unicode codes \u2190-\u21ff)
% Also includes those "Letterlike" unicode characters
% which are available in the symbol font. (unicode codes \u2100-\u214f)
/UCArrowsEncoding
  NullEncoding dup length array copy
  << 16#11 /Ifraktur        16#1c /Rfraktur            16#22 /trademarkserif
     16#35 /aleph
     16#90 /arrowleft       16#91 /arrowup             16#92 /arrowright
     16#93 /arrowdown       16#94 /arrowboth           16#d0 /arrowdblleft
     16#d1 /arrowdblup      16#d2 /arrowdblright       16#d3 /arrowdbldown
     16#d4 /arrowdblboth
  >> vg&redef
  def

/ZapfDingbats findfont /Encoding get
dup length array copy /UCDingbatsEncoding exch def
16#20 1 16#7f {
  dup 16#20 sub exch
  UCDingbatsEncoding exch get
  UCDingbatsEncoding 3 1 roll put
} for
16#a0 1 16#ff {
  dup 16#40 sub exch
  UCDingbatsEncoding exch get
  UCDingbatsEncoding 3 1 roll put
} for
UCDingbatsEncoding [ 16#c0 1 16#ff {} for ] vg&undef
[ 16#00  16#05 16#0a 16#0b  16#28 16#4c 16#4e  16#53 16#54 16#55  16#57 16#5f
  16#60  16#68 16#69 16#6a  16#6b 16#6c 16#6d  16#6e 16#6f 16#70  16#71 16#72
  16#73  16#74 16#75 16#95  16#96 16#97 16#b0  16#bf
] vg&undef pop

% Define the base fonts which don't change.
/Undefined-UC NullEncoding       /Helvetica    vg&newbasefont pop
/MathOps-UC   UCMathOpsEncoding  /Symbol       vg&newbasefont pop
/Arrows-UC    UCArrowsEncoding   /Symbol       vg&newbasefont pop
/Dingbats-UC  UCDingbatsEncoding /ZapfDingbats vg&newbasefont pop

% Make the SansSerif composite fonts.
/SansSerif /Helvetica 16#00 vg&newcompositefont
/SansSerif-Bold /Helvetica-Bold 16#01 vg&newcompositefont
/SansSerif-Italic /Helvetica-Oblique 16#02 vg&newcompositefont
/SansSerif-BoldItalic /Helvetica-BoldOblique 16#03 vg&newcompositefont

% Make the Serif composite fonts.
/Serif /Times-Roman 16#00 vg&newcompositefont
/Serif-Bold /Times-Bold 16#01 vg&newcompositefont
/Serif-Italic /Times-Italic 16#02 vg&newcompositefont
/Serif-BoldItalic /Times-BoldItalic 16#03 vg&newcompositefont

% Make the Monospaced composite fonts.
/Monospaced /Courier 16#00 vg&newcompositefont
/Monospaced-Bold /Courier-Bold 16#01 vg&newcompositefont
/Monospaced-Italic /Courier-Oblique 16#02 vg&newcompositefont
/Monospaced-BoldItalic /Courier-BoldOblique 16#03 vg&newcompositefont

% Make the Dialog composite fonts.
/Dialog /Helvetica 16#00 vg&newcompositefont
/Dialog-Bold /Helvetica-Bold 16#01 vg&newcompositefont
/Dialog-Italic /Helvetica-Oblique 16#02 vg&newcompositefont
/Dialog-BoldItalic /Helvetica-BoldOblique 16#03 vg&newcompositefont

% Make the DialogInput composite fonts.
/DialogInput /Courier 16#00 vg&newcompositefont
/DialogInput-Bold /Courier-Bold 16#01 vg&newcompositefont
/DialogInput-Italic /Courier-Oblique 16#02 vg&newcompositefont
/DialogInput-BoldItalic /Courier-BoldOblique 16#03 vg&newcompositefont

% Make the Typewriter composite fonts (JDK 1.1 only).
/Typewriter /Courier 16#00 vg&newcompositefont
/Typewriter-Bold /Courier-Bold 16#01 vg&newcompositefont
/Typewriter-Italic /Courier-Oblique 16#02 vg&newcompositefont
/Typewriter-BoldItalic /Courier-BoldOblique 16#03 vg&newcompositefont


/cfontH {
 dup /fontsize exch def /SansSerif exch sf
 /vg&fontstyles [{cfontH} {cfontHB} {cfontHI} {cfontHBI}] def
} def
/cfontHB {
  dup /fontsize exch def /SansSerif-Bold exch sf
 /vg&fontstyles [{cfontH} {cfontHB} {cfontHI} {cfontHBI}] def
} def
/cfontHI {
 dup /fontsize exch def /SansSerif-Italic exch sf
 /vg&fontstyles [{cfontH} {cfontHB} {cfontHI} {cfontHBI}] def
} def
/cfontHBI {
 dup /fontsize exch def /SansSerif-BoldItalic exch sf
 /vg&fontstyles [{cfontH} {cfontHB} {cfontHI} {cfontHBI}] def
} def

/cfontT {
 dup /fontsize exch def /Serif exch sf
 /vg&fontstyles [{cfontT} {cfontTB} {cfontTI} {cfontTBI}] def
} def
/cfontTB {
 dup /fontsize exch def /Serif-Bold exch sf
 /vg&fontstyles [{cfontT} {cfontTB} {cfontTI} {cfontTBI}] def
} def
/cfontTI {
 dup /fontsize exch def /Serif-Italic exch sf
 /vg&fontstyles [{cfontT} {cfontTB} {cfontTI} {cfontTBI}] def
} def
/cfontTBI {
 dup /fontsize exch def /Serif-BoldItalic exch sf
 /vg&fontstyles [{cfontT} {cfontTB} {cfontTI} {cfontTBI}] def
} def

/cfontC {
 dup /fontsize exch def /Typewriter exch sf
 /vg&fontstyles [{cfontC} {cfontCB} {cfontCI} {cfontCBI}] def
} def
/cfontCB {
 dup /fontsize exch def /Typewriter-Bold exch sf
 /vg&fontstyles [{cfontC} {cfontCB} {cfontCI} {cfontCBI}] def
} def
/cfontCI {
 dup /fontsize exch def /Typewriter-Italic exch sf
 /vg&fontstyles [{cfontC} {cfontCB} {cfontCI} {cfontCBI}] def
} def
/cfontCBI {
 dup /fontsize exch def /Typewriter-BoldItalic exch sf
 /vg&fontstyles [{cfontC} {cfontCB} {cfontCI} {cfontCBI}] def
} def

% Darken or lighten the current color.
/darken {0.7 exch exp 3 copy
         q 4 -1 roll vg&C
         currentrgbcolor 3 {4 -2 roll mul} repeat
         3 array astore Q} def

/displayColorMap
<< /Cr   [1.00 0.00 0.00]       /Cg     [0.00 1.00 0.00]
   /Cb   [0.00 0.00 1.00]       /Cc     [1.00 0.00 0.00 0.00]
   /Cm   [0.00 1.00 0.00 0.00]  /Cy     [0.00 0.00 1.00 0.00]
   /Co   [1.00 0.78 0.00]       /Cp     [1.00 0.67 0.67]
   /Cw   [1   ]                 /Cgrl   [0.75]
   /Cgr  [0.50]                 /Cgrd   [0.25]
   /Ck   [0   ]
   /CGr  [1.00 0.00 0.00]       /CGg    [0.00 1.00 0.00]
   /CGb  [0.00 0.00 1.00]       /CGc    [1.00 0.00 0.00 0.00]
   /CGm  [0.00 1.00 0.00 0.00]  /CGy    [0.00 0.00 1.00 0.00]
   /CGo  [1.00 0.78 0.00]       /CGp    [1.00 0.67 0.67]
   /CGw  [1   ]                 /CGgrl  [0.75]
   /CGgr [0.50]                 /CGgrd  [0.25]
   /CGk  [0   ]
   /CIr  [1.00 0.00 0.00]       /CIg    [0.00 1.00 0.00]
   /CIb  [0.00 0.00 1.00]       /CIc    [1.00 0.00 0.00 0.00]
   /CIm  [0.00 1.00 0.00 0.00]  /CIy    [0.00 0.00 1.00 0.00]
   /CIo  [1.00 0.78 0.00]       /CIp    [1.00 0.67 0.67]
   /CIw  [1   ]                 /CIgrl  [0.75]
   /CIgr [0.50]                 /CIgrd  [0.25]
   /CIk  [0   ]
>> def

/printColorMap
<< /Cr   [1.00 0.33 0.33]       /Cg     [0.33 1.00 0.33]
   /Cb   [0.33 0.33 1.00]       /Cc     [1.00 0.00 0.00 0.00]
   /Cm   [0.00 1.00 0.00 0.00]  /Cy     [0.00 0.00 1.00 0.00]
   /Co   [1.00 0.78 0.00]       /Cp     [1.00 0.67 0.67]
   /Cw   [1   ]                 /Cgrl   [0.75]
   /Cgr  [0.50]                 /Cgrd   [0.25]
   /Ck   [0   ]
   /CGr  [1.00 0.33 0.33]       /CGg    [0.33 1.00 0.33]
   /CGb  [0.33 0.33 1.00]       /CGc    [1.00 0.00 0.00 0.00]
   /CGm  [0.00 1.00 0.00 0.00]  /CGy    [0.00 0.00 1.00 0.00]
   /CGo  [1.00 0.78 0.00]       /CGp    [1.00 0.67 0.67]
   /CGw  [1   ]                 /CGgrl  [0.75]
   /CGgr [0.50]                 /CGgrd  [0.25]
   /CGk  [0   ]
   /CIr  [1.00 0.33 0.33]       /CIg    [0.33 1.00 0.33]
   /CIb  [0.33 0.33 1.00]       /CIc    [1.00 0.00 0.00 0.00]
   /CIm  [0.00 1.00 0.00 0.00]  /CIy    [0.00 0.00 1.00 0.00]
   /CIo  [1.00 0.78 0.00]       /CIp    [1.00 0.67 0.67]
   /CIw  [1   ]                 /CIgrl  [0.75]
   /CIgr [0.50]                 /CIgrd  [0.25]
   /CIk  [0   ]
>> def

/grayColorMap
<< /Cr   [0   ]                 /Cg     [0   ]
   /Cb   [0   ]                 /Cc     [0   ]
   /Cm   [0   ]                 /Cy     [0   ]
   /Co   [0   ]                 /Cp     [0   ]
   /Cw   [0   ]                 /Cgrl   [0   ]
   /Cgr  [0   ]                 /Cgrd   [0   ]
   /Ck   [0   ]
   /CGr  [0.75]                 /CGg    [1   ]
   /CGb  [0.50]                 /CGc    [0.75]
   /CGm  [0.50]                 /CGy    [1   ]
   /CGo  [0.75]                 /CGp    [1   ]
   /CGw  [0   ]                 /CGgrl  [0.25]
   /CGgr [0.50]                 /CGgrd  [0.75]
   /CGk  [1   ]
   /CIr  [1   ]                 /CIg    [1   ]
   /CIb  [1   ]                 /CIc    [1   ]
   /CIm  [1   ]                 /CIy    [1   ]
   /CIo  [1   ]                 /CIp    [1   ]
   /CIw  [1   ]                 /CIgrl  [1   ]
   /CIgr [1   ]                 /CIgrd  [1   ]
   /CIk  [1   ]
>> def

/bwColorMap
<< /Cr   [0   ]                 /Cg     [0   ]
   /Cb   [0   ]                 /Cc     [0   ]
   /Cm   [0   ]                 /Cy     [0   ]
   /Co   [0   ]                 /Cp     [0   ]
   /Cw   [0   ]                 /Cgrl   [0   ]
   /Cgr  [0   ]                 /Cgrd   [0   ]
   /Ck   [0   ]
   /CGr  [1   ]                 /CGg    [1   ]
   /CGb  [1   ]                 /CGc    [1   ]
   /CGm  [1   ]                 /CGy    [1   ]
   /CGo  [1   ]                 /CGp    [1   ]
   /CGw  [0   ]                 /CGgrl  [1   ]
   /CGgr [1   ]                 /CGgrd  [1   ]
   /CGk  [1   ]
   /CIr  [1   ]                 /CIg    [1   ]
   /CIb  [1   ]                 /CIc    [1   ]
   /CIm  [1   ]                 /CIy    [1   ]
   /CIo  [1   ]                 /CIp    [1   ]
   /CIw  [1   ]                 /CIgrl  [1   ]
   /CIgr [1   ]                 /CIgrd  [1   ]
   /CIk  [1   ]
>> def

%
% The following routines handle the alignment of and printing of
% tagged strings.
%

% Predefine the bounding box values.
/bbllx 0 def /bblly 0 def /bburx 0 def /bbury 0 def

% This routine pops the first unicode character off of a string and returns
% the remainder of the string, the character code of first character,
% and a "true" if the string was non-zero length.
% <string>      popfirst <remaining string> <true>
% <null string> popfirst <false>
/popfirst {
  dup length 1 gt
    {dup 0 get /vg&fbyte exch def
     dup 1 get /vg&cbyte exch def
     dup length 2 sub 2 exch getinterval true}
    {pop false} ifelse
} def

% This routine shows a single unicode character given the font and
% character codes.
% <font code> <char code> unicharshow --
/unicharshow {
  2 string
  dup 0 5 -1 roll put
  dup 1 4 -1 roll put
  internalshow
} def

% This is an internal routine to alternate between determining the
% bounding box for stringsize and showing the string for recshow.
% <string> internalshow --
/internalshow {show} def

% This is an internal routine to alternate between determining the
% bounding box for stringsize and stroking various ornaments.
% <string> internalstroke --
/internalstroke {S} def

% Sets up internalshow to use the null device to determine string size.
% -- nullinternalshow --
/nullinternalshow {/internalshow {false charpath flattenpath
                                  pathbbox updatebbox} def} def

% Sets up internalstroke to use the null device to determine string size.
% -- nullinternalstroke --
/nullinternalstroke {
 /internalstroke {flattenpath pathbbox updatebbox} def} def

% This routine tests to see if the character code matches the first
% character of a string.
% <char code> <string> testchar <char code> <true or false>
/testchar {exch dup 3 -1 roll 0 get eq} def

% Raise the text baseline for superscripts.
% -- raise --
/raise {
  0 fontsize 2 div rmoveto
  /fontsize fontsize 2 mul 3 div def
  currentfont /FontName get fontsize sf
} def

% Un-raise the text baseline for superscripts.
% -- unraise --
/unraise {
  /fontsize fontsize 1.5 mul def
  0 fontsize 2 div neg rmoveto
} def

% Lower the text baseline for subscripts.
% -- lower --
/lower {
  0 fontsize 3 div neg rmoveto
  /fontsize fontsize 2 mul 3 div def
  currentfont /FontName get fontsize sf
} def

% Un-lower the text baseline for subscripts.
% -- unlower --
/unlower {
  /fontsize fontsize 1.5 mul def
  0 fontsize 3 div rmoveto
} def

% Compare the top two elements on the stack and leave only the
% larger one.
/maxval {2 copy gt {pop} {exch pop} ifelse} def

% Tokenize a string.  Do not use the usual PostScript token because
% parentheses will not be interpreted correctly because of rescanning
% of the string.
/vg&token {/vg&string exch def /vg&index -1 def /vg&level 0 def
0 2 vg&string length 2 sub {
  dup dup 1 add exch vg&string exch get 8 bitshift vg&string 3 -1 roll get or
  dup 16#f0fe eq {pop 1}{16#f0ff eq {-1}{0} ifelse} ifelse
  /vg&level exch vg&level add def
  vg&level 0 eq {/vg&index exch def exit} if pop
} for
vg&index 0 ge {
  vg&string vg&index 2 add dup vg&string length exch sub getinterval
  vg&index 2 gt {vg&string 2 vg&index 2 sub getinterval}{()} ifelse
  true}
{false} ifelse
} bind def

% Recursively show an unicode string.
% <string> recshow --
/recshow {
  popfirst
  {
    % Test to see if this is a string attribute.
    vg&fbyte 16#f0 and 16#e0 eq
    {
      q

      % Font style.
      currentfont dup /FontStyleBits known {/FontStyleBits get}{pop 0} ifelse
      vg&cbyte or vg&fontstyles exch get fontsize exch exec

      vg&token pop recshow currentpoint Q m recshow
    }
    {
      vg&fbyte 16#F8 and 16#F0 eq {

        % Superscript and/or subscript.
        vg&cbyte 16#00 eq {
          vg&token pop exch vg&token pop 3 -1 roll
          q raise recshow unraise currentpoint pop Q exch
          q lower recshow unlower currentpoint pop Q
          maxval currentpoint exch pop m recshow } if

        % Strikeout.
        vg&cbyte 16#01 eq {
          vg&token pop currentpoint 3 -1 roll recshow
          q 0 J vg&underline vg&uthick w
          currentpoint 4 -2 roll fontsize 3 div add moveto
          fontsize 3 div add lineto internalstroke Q
          recshow} if

        % Underline.
        vg&cbyte 16#02 eq {
          vg&token pop currentpoint 3 -1 roll recshow
          q 0 J vg&underline vg&uthick w
          currentpoint 4 -2 roll vg&uoffset add moveto
          vg&uoffset add lineto internalstroke Q
          recshow} if

        % Dashed underline.
        vg&cbyte 16#03 eq {
          vg&token pop currentpoint 3 -1 roll recshow
          q 0 J [ vg&uthick 5 mul vg&uthick 2 mul] 0 d
          vg&underline vg&uthick w
          currentpoint 4 -2 roll vg&uoffset add moveto
          vg&uoffset add lineto internalstroke Q
          recshow} if

        % Dotted underline.
        vg&cbyte 16#04 eq {
          vg&token pop currentpoint 3 -1 roll recshow
          q 1 J [ 0 vg&uthick 3 mul] 0 d
          vg&underline vg&uthick w
          currentpoint 4 -2 roll vg&uoffset add moveto
          vg&uoffset add lineto internalstroke Q
          recshow} if

        % Thick underline.
        vg&cbyte 16#05 eq {
          vg&token pop currentpoint 3 -1 roll recshow
          q 0 J vg&underline vg&uthick 2 mul w
          currentpoint 4 -2 roll vg&uoffset vg&uthick 2 div sub add moveto
          vg&uoffset vg&uthick 2 div sub add lineto internalstroke Q
          recshow} if

        % Gray thick underline.
        vg&cbyte 16#06 eq {
          vg&token pop currentpoint 3 -1 roll recshow
          q 0 J vg&underline vg&uthick 2 mul w 0.5 setgray
          currentpoint 4 -2 roll vg&uoffset vg&uthick 2 div sub add moveto
          vg&uoffset vg&uthick 2 div sub add lineto internalstroke Q
          recshow} if

        % Overbar.
        vg&cbyte 16#07 eq {
          vg&token pop dup stringsize relative 4 1 roll pop pop exch
          3 -1 roll recshow
          q 0 J vg&underline vg&uthick w
          vg&uoffset neg add dup currentpoint pop exch m l internalstroke Q
          recshow} if
      }
      {
        vg&fbyte vg&cbyte unicharshow recshow
      } ifelse
    } ifelse
  } if
} def

% Get the underline position and thickness from the current font.
/vg&underline {

currentfont dup /FontType get 0 eq {/FDepVector get 0 get} if
dup dup /FontInfo known {
  /FontInfo get dup
  dup /UnderlinePosition known {
    /UnderlinePosition get /vg&uoffset exch def
  }
  {
    pop /vg&uoffset 0 def
  } ifelse
  dup /UnderlineThickness known {
    /UnderlineThickness get /vg&uthick exch def
  }
  {
    pop /vg&uthick 0 def
  } ifelse
}
{
  pop /vg&uoffset 0 def /vg&uthick 0 def
} ifelse
/FontMatrix get
currentfont dup /FontType get 0 eq
{/FontMatrix get matrix concatmatrix}{pop} ifelse
dup 0 vg&uoffset 3 -1 roll transform /vg&uoffset exch def pop
0 vg&uthick 3 -1 roll transform /vg&uthick exch def pop
} def

% Make a frame with the coordinates on the stack.
% <llx> <lly> <urx> <ury> frame --
/frame {4 copy m 3 1 roll exch l 4 -2 roll l l h} def

% Resets the accumulated bounding box to a degenerate box at the
% current point.
% -- resetbbox --
/resetbbox {
  currentpoint 2 copy
  /bbury exch def
  /bburx exch def
  /bblly exch def
  /bbllx exch def
} def

% Update the accumulated bounding box.
% <llx'> <lly'> <urx'> <ury'> updatebbox --
/updatebbox {
  dup bbury gt {/bbury exch def} {pop} ifelse
  dup bburx gt {/bburx exch def} {pop} ifelse
  dup bblly lt {/bblly exch def} {pop} ifelse
  dup bbllx lt {/bbllx exch def} {pop} ifelse
} def

% Set the bounding box to the values on the stack.
% <llx'> <lly'> <urx'> <ury'> updatebbox --
/restorebbox {
  /bbury exch def /bburx exch def /bblly exch def /bbllx exch def
} def

% Push the accumulated bounding box onto the stack.
% -- pushbbox <llx> <lly> <urx> <ury>
/pushbbox {bbllx bblly bburx bbury} def

% Make the relative bounding box relative to the currentpoint.
% <llx'> <lly'> <urx'> <ury'> inflate <llx> <lly> <urx> <ury>
/inflate {
  2 {fontsize 0.2 mul add 4 1 roll} repeat
  2 {fontsize 0.2 mul sub 4 1 roll} repeat
} def

% Make the relative bounding box relative to the currentpoint.
% <llx'> <lly'> <urx'> <ury'> relative <llx> <lly> <urx> <ury>
/relative {
  currentpoint 3 -1 roll add 3 1 roll add exch 4 2 roll
  currentpoint 3 -1 roll add 3 1 roll add exch 4 2 roll
} def

% Returns the size of a string appropriate for recshow.
% <string> stringsize <llx> <lly> <urx> <ury>
/stringsize {
  pushbbox /internalshow load /internalstroke load 7 -1 roll
  q
  nulldevice 0 0 m
  nullinternalshow nullinternalstroke
  resetbbox
  recshow
  /internalstroke exch def /internalshow exch def
  pushbbox 8 -4 roll restorebbox
  Q
} def

% Calculate values for string positioning.
/calcval {4 copy
  3 -1 roll sub /widy exch def sub neg /widx exch def
  pop pop /dy exch def /dx exch def} def

% Utilities to position a string.
% First letter (U=upper, C=center, B=baseline, L=lower)
% Second letter (L=left, C=center, R=right)
/align [
{calcval dx neg widy dy add neg rmoveto} % UL
{calcval dx neg widy 2 div dy add neg rmoveto} % CL
{calcval dx neg 0 rmoveto} % BL
{calcval dx neg dy neg rmoveto} % LL
{calcval widx dx add neg widy dy add neg rmoveto} % UR
{calcval widx dx add neg widy 2 div dy add neg rmoveto} % CR
{calcval widx dx add neg 0 rmoveto} % BR
{calcval widx dx add neg dy neg rmoveto} % LR
{calcval widx 2 div dx add neg widy dy add neg rmoveto} % UC
{calcval widx 2 div dx add neg widy 2 div dy add neg rmoveto} % CC
{calcval widx 2 div dx add neg 0 rmoveto} % BC
{calcval widx 2 div dx add neg dy neg rmoveto} % LC
] def

/vg&str {m q 1 -1 scale dup stringsize 4 copy align 11 -1 roll get exec
         q inflate relative frame exch exec Q recshow Q} def

end /procDict exch def
%%EndProlog

%%BeginSetup
save
procDict begin
printColorMap begin
367 737 setpagesize
0 0 0 0 setmargins
0 0 setorigin
367 737 setsize
naturalsize
portrait
imagescale
cliptobounds
setbasematrix
/Helvetica 10 sf
defaultGraphicsState
%%EndSetup

0.00000 0.00000 0.00000 RG
[ 1.00000 0.00000 0.00000 1.00000 0.00000 0.00000 ] defaultmatrix matrix concatmatrix setmatrix
cliprestore
1.00000 1.00000 1.00000 RG
newpath
0.00000 0.00000 m
367.000 0.00000 l
367.000 737.000 l
0.00000 737.000 l
0.00000 0.00000 l
h
f
0.00000 0.00000 0.00000 RG
0.00000 0.00000 0.00000 RG
[ 1.00000 0.00000 0.00000 1.00000 0.00000 0.00000 ] defaultmatrix matrix concatmatrix setmatrix
cliprestore
1.00000 1.00000 1.00000 RG
newpath
0.00000 0.00000 m
367.000 0.00000 l
367.000 737.000 l
0.00000 737.000 l
0.00000 0.00000 l
h
f
0.00000 0.00000 0.00000 RG
0 0 367 737 rc
q
[ 1.00000 0.00000 0.00000 1.00000 0.00000 0.00000 ] concat
[ 1.00000 0.00000 0.00000 1.00000 -212.000 -99.0000 ] concat
1.00000 1.00000 1.00000 RG
newpath
212.000 99.0000 m
579.000 99.0000 l
579.000 836.000 l
212.000 836.000 l
212.000 99.0000 l
h
f
0.00000 0.00000 0.00000 RG
[ 1.00000 0.00000 0.00000 1.00000 -212.000 -99.0000 ] defaultmatrix matrix concatmatrix setmatrix
[ 1.00000 0.00000 0.00000 1.00000 -212.000 -99.0000 ] defaultmatrix matrix concatmatrix setmatrix
[ 1.00000 0.00000 0.00000 1.00000 0.00000 0.00000 ] defaultmatrix matrix concatmatrix setmatrix
[ 1.00000 0.00000 0.00000 1.00000 -212.000 -99.0000 ] defaultmatrix matrix concatmatrix setmatrix
.823529 .823529 .823529 RG
[ 1.00000 0.00000 0.00000 1.00000 4.00000 4.00000 ] concat
newpath
286.500 722.436 m
487.500 722.436 l
487.500 816.436 l
286.500 816.436 l
286.500 722.436 l
h
f
0.00000 0.00000 0.00000 RG
[ 1.00000 0.00000 0.00000 1.00000 -212.000 -99.0000 ] defaultmatrix matrix concatmatrix setmatrix
.949020 .941176 .847059 RG
newpath
286.500 722.436 m
487.500 722.436 l
487.500 816.436 l
286.500 816.436 l
286.500 722.436 l
h
f
.717647 .713725 .619608 RG
newpath
286.500 722.436 m
487.500 722.436 l
487.500 744.812 l
286.500 744.812 l
286.500 722.436 l
h
f
.949020 .941176 .847059 RG
0.00000 0.00000 0.00000 RG
0 J
1.45000 M
q
[ 1.00000 0.00000 0.00000 -1.00000 374.604 739.517 ] concat
0.00000 0.00000 moveto
/Helvetica findfont 15 scalefont setfont 12.5000 cfontH
(\000f\000i\000n\000a\000l\000i\000z\000a\000t\000i\000o\000n\000 \000s\000t\000e\000p\000s) recshow
Q
2 J
10.0000 M
.949020 .941176 .847059 RG
0 J
1.45000 M
0.00000 0.00000 0.00000 RG
newpath
286.500 722.436 m
487.500 722.436 l
487.500 816.436 l
286.500 816.436 l
286.500 722.436 l
h
S
2 J
10.0000 M
.823529 .823529 .823529 RG
[ 1.00000 0.00000 0.00000 1.00000 4.00000 4.00000 ] concat
newpath
227.448 502.500 m
559.008 502.500 l
559.008 692.436 l
227.448 692.436 l
227.448 502.500 l
h
f
0.00000 0.00000 0.00000 RG
[ 1.00000 0.00000 0.00000 1.00000 -212.000 -99.0000 ] defaultmatrix matrix concatmatrix setmatrix
.949020 .941176 .847059 RG
newpath
227.448 502.500 m
559.008 502.500 l
559.008 692.436 l
227.448 692.436 l
227.448 502.500 l
h
f
.717647 .713725 .619608 RG
newpath
227.448 502.500 m
559.008 502.500 l
559.008 524.876 l
227.448 524.876 l
227.448 502.500 l
h
f
.949020 .941176 .847059 RG
0.00000 0.00000 0.00000 RG
0 J
1.45000 M
q
[ 1.00000 0.00000 0.00000 -1.00000 442.765 519.581 ] concat
0.00000 0.00000 moveto
/Helvetica findfont 15 scalefont setfont 12.5000 cfontH
(\000c\000o\000m\000p\000u\000t\000a\000t\000i\000o\000n\000 \000l\000o\000o\000p) recshow
Q
2 J
10.0000 M
.949020 .941176 .847059 RG
0 J
1.45000 M
0.00000 0.00000 0.00000 RG
newpath
227.448 502.500 m
559.008 502.500 l
559.008 692.436 l
227.448 692.436 l
227.448 502.500 l
h
S
2 J
10.0000 M
.823529 .823529 .823529 RG
[ 1.00000 0.00000 0.00000 1.00000 4.00000 4.00000 ] concat
newpath
294.000 114.500 m
495.000 114.500 l
495.000 472.500 l
294.000 472.500 l
294.000 114.500 l
h
f
0.00000 0.00000 0.00000 RG
[ 1.00000 0.00000 0.00000 1.00000 -212.000 -99.0000 ] defaultmatrix matrix concatmatrix setmatrix
.949020 .941176 .847059 RG
newpath
294.000 114.500 m
495.000 114.500 l
495.000 472.500 l
294.000 472.500 l
294.000 114.500 l
h
f
.717647 .713725 .619608 RG
newpath
294.000 114.500 m
495.000 114.500 l
495.000 136.876 l
294.000 136.876 l
294.000 114.500 l
h
f
.949020 .941176 .847059 RG
0.00000 0.00000 0.00000 RG
0 J
1.45000 M
q
[ 1.00000 0.00000 0.00000 -1.00000 375.439 131.581 ] concat
0.00000 0.00000 moveto
/Helvetica findfont 15 scalefont setfont 12.5000 cfontH
(\000i\000n\000i\000t\000i\000a\000l\000i\000z\000a\000t\000i\000o\000n\000 \000s\000t\000e\000p\000s) recshow
Q
2 J
10.0000 M
.949020 .941176 .847059 RG
0 J
1.45000 M
0.00000 0.00000 0.00000 RG
newpath
294.000 114.500 m
495.000 114.500 l
495.000 472.500 l
294.000 472.500 l
294.000 114.500 l
h
S
2 J
10.0000 M
1.00000 1.00000 1.00000 RG
newpath
323.928 623.628 m
485.928 623.628 l
485.928 676.628 l
323.928 676.628 l
323.928 623.628 l
h
f
2.00000 w
0 J
1.45000 M
0.00000 0.00000 0.00000 RG
newpath
323.928 623.628 m
485.928 623.628 l
485.928 676.628 l
323.928 676.628 l
323.928 623.628 l
h
S
1.00000 w
2 J
10.0000 M
0 J
1.45000 M
q
[ 1.00000 0.00000 0.00000 -1.00000 330.889 654.288 ] concat
0.00000 0.00000 moveto
/Arial findfont 12 scalefont setfont 10.0000 cfontH
(\000m\000o\000d\000u\000l\000e\000s\000 \000d\000a\000i\000l\000y\000 \000c\000o\000m\000p\000u\000t\000a\000t\000i\000o\000n\000s) recshow
Q
2 J
10.0000 M
1.00000 1.00000 1.00000 RG
newpath
316.000 615.844 m
478.000 615.844 l
478.000 668.844 l
316.000 668.844 l
316.000 615.844 l
h
f
2.00000 w
0 J
1.45000 M
0.00000 0.00000 0.00000 RG
newpath
316.000 615.844 m
478.000 615.844 l
478.000 668.844 l
316.000 668.844 l
316.000 615.844 l
h
S
1.00000 w
2 J
10.0000 M
0 J
1.45000 M
q
[ 1.00000 0.00000 0.00000 -1.00000 322.961 646.504 ] concat
0.00000 0.00000 moveto
/Arial findfont 12 scalefont setfont 10.0000 cfontH
(\000m\000o\000d\000u\000l\000e\000s\000 \000d\000a\000i\000l\000y\000 \000c\000o\000m\000p\000u\000t\000a\000t\000i\000o\000n\000s) recshow
Q
2 J
10.0000 M
1.00000 1.00000 1.00000 RG
newpath
326.000 152.500 m
488.000 152.500 l
488.000 205.500 l
326.000 205.500 l
326.000 152.500 l
h
f
2.00000 w
0 J
1.45000 M
0.00000 0.00000 0.00000 RG
newpath
326.000 152.500 m
488.000 152.500 l
488.000 205.500 l
326.000 205.500 l
326.000 152.500 l
h
S
1.00000 w
2 J
10.0000 M
0 J
1.45000 M
q
[ 1.00000 0.00000 0.00000 -1.00000 351.638 183.160 ] concat
0.00000 0.00000 moveto
/Arial findfont 12 scalefont setfont 10.0000 cfontH
(\000m\000o\000d\000u\000l\000e\000s\000 \000i\000n\000i\000t\000i\000a\000l\000i\000z\000a\000t\000i\000o\000n) recshow
Q
2 J
10.0000 M
1.00000 1.00000 1.00000 RG
newpath
326.000 245.000 m
488.000 245.000 l
488.000 298.000 l
326.000 298.000 l
326.000 245.000 l
h
f
2.00000 w
0 J
1.45000 M
0.00000 0.00000 0.00000 RG
newpath
326.000 245.000 m
488.000 245.000 l
488.000 298.000 l
326.000 298.000 l
326.000 245.000 l
h
S
1.00000 w
2 J
10.0000 M
0 J
1.45000 M
q
[ 1.00000 0.00000 0.00000 -1.00000 362.970 275.660 ] concat
0.00000 0.00000 moveto
/Arial findfont 12 scalefont setfont 10.0000 cfontH
(\000i\000n\000p\000u\000t\000 \000f\000i\000l\000e\000 \000r\000e\000a\000d\000i\000n\000g) recshow
Q
2 J
10.0000 M
1.00000 1.00000 1.00000 RG
newpath
316.000 144.000 m
478.000 144.000 l
478.000 197.000 l
316.000 197.000 l
316.000 144.000 l
h
f
2.00000 w
0 J
1.45000 M
0.00000 0.00000 0.00000 RG
newpath
316.000 144.000 m
478.000 144.000 l
478.000 197.000 l
316.000 197.000 l
316.000 144.000 l
h
S
1.00000 w
2 J
10.0000 M
0 J
1.45000 M
q
[ 1.00000 0.00000 0.00000 -1.00000 341.638 174.660 ] concat
0.00000 0.00000 moveto
/Arial findfont 12 scalefont setfont 10.0000 cfontH
(\000m\000o\000d\000u\000l\000e\000s\000 \000i\000n\000i\000t\000i\000a\000l\000i\000z\000a\000t\000i\000o\000n) recshow
Q
2 J
10.0000 M
1.00000 1.00000 1.00000 RG
newpath
306.000 135.500 m
468.000 135.500 l
468.000 188.500 l
306.000 188.500 l
306.000 135.500 l
h
f
2.00000 w
0 J
1.45000 M
0.00000 0.00000 0.00000 RG
newpath
306.000 135.500 m
468.000 135.500 l
468.000 188.500 l
306.000 188.500 l
306.000 135.500 l
h
S
1.00000 w
2 J
10.0000 M
0 J
1.45000 M
q
[ 1.00000 0.00000 0.00000 -1.00000 320.968 166.160 ] concat
0.00000 0.00000 moveto
/Arial findfont 12 scalefont setfont 10.0000 cfontH
(\000m\000o\000d\000u\000l\000e\000s\000 \000p\000r\000e\000-\000i\000n\000i\000t\000i\000a\000l\000i\000z\000a\000t\000i\000o\000n) recshow
Q
2 J
10.0000 M
1.00000 1.00000 1.00000 RG
newpath
316.000 235.500 m
478.000 235.500 l
478.000 288.500 l
316.000 288.500 l
316.000 235.500 l
h
f
2.00000 w
0 J
1.45000 M
0.00000 0.00000 0.00000 RG
newpath
316.000 235.500 m
478.000 235.500 l
478.000 288.500 l
316.000 288.500 l
316.000 235.500 l
h
S
1.00000 w
2 J
10.0000 M
0 J
1.45000 M
q
[ 1.00000 0.00000 0.00000 -1.00000 352.970 266.160 ] concat
0.00000 0.00000 moveto
/Arial findfont 12 scalefont setfont 10.0000 cfontH
(\000i\000n\000p\000u\000t\000 \000f\000i\000l\000e\000 \000r\000e\000a\000d\000i\000n\000g) recshow
Q
2 J
10.0000 M
1.00000 1.00000 1.00000 RG
newpath
306.000 227.000 m
468.000 227.000 l
468.000 280.000 l
306.000 280.000 l
306.000 227.000 l
h
f
2.00000 w
0 J
1.45000 M
0.00000 0.00000 0.00000 RG
newpath
306.000 227.000 m
468.000 227.000 l
468.000 280.000 l
306.000 280.000 l
306.000 227.000 l
h
S
1.00000 w
2 J
10.0000 M
0 J
1.45000 M
q
[ 1.00000 0.00000 0.00000 -1.00000 342.970 257.660 ] concat
0.00000 0.00000 moveto
/Arial findfont 12 scalefont setfont 10.0000 cfontH
(\000i\000n\000p\000u\000t\000 \000f\000i\000l\000e\000 \000r\000e\000a\000d\000i\000n\000g) recshow
Q
2 J
10.0000 M
1.00000 1.00000 1.00000 RG
newpath
306.000 320.250 m
468.000 320.250 l
468.000 373.250 l
306.000 373.250 l
306.000 320.250 l
h
f
2.00000 w
0 J
1.45000 M
0.00000 0.00000 0.00000 RG
newpath
306.000 320.250 m
468.000 320.250 l
468.000 373.250 l
306.000 373.250 l
306.000 320.250 l
h
S
1.00000 w
2 J
10.0000 M
0 J
1.45000 M
q
[ 1.00000 0.00000 0.00000 -1.00000 345.642 350.910 ] concat
0.00000 0.00000 moveto
/Arial findfont 12 scalefont setfont 10.0000 cfontH
(\000i\000n\000p\000u\000t\000s\000 \000c\000h\000e\000c\000k\000i\000n\000g) recshow
Q
2 J
10.0000 M
1.00000 1.00000 1.00000 RG
newpath
307.928 535.390 m
469.928 535.390 l
469.928 588.390 l
307.928 588.390 l
307.928 535.390 l
h
f
2.00000 w
0 J
1.45000 M
0.00000 0.00000 0.00000 RG
newpath
307.928 535.390 m
469.928 535.390 l
469.928 588.390 l
307.928 588.390 l
307.928 535.390 l
h
S
1.00000 w
2 J
10.0000 M
0 J
1.45000 M
q
[ 1.00000 0.00000 0.00000 -1.00000 343.568 566.050 ] concat
0.00000 0.00000 moveto
/Arial findfont 12 scalefont setfont 10.0000 cfontH
(\000y\000e\000a\000r\000l\000y\000 \000l\000o\000o\000p\000 \000s\000e\000t\000u\000p) recshow
Q
2 J
10.0000 M
1.00000 1.00000 1.00000 RG
newpath
307.928 607.140 m
469.928 607.140 l
469.928 660.140 l
307.928 660.140 l
307.928 607.140 l
h
f
2.00000 w
0 J
1.45000 M
0.00000 0.00000 0.00000 RG
newpath
307.928 607.140 m
469.928 607.140 l
469.928 660.140 l
307.928 660.140 l
307.928 607.140 l
h
S
1.00000 w
2 J
10.0000 M
0 J
1.45000 M
q
[ 1.00000 0.00000 0.00000 -1.00000 314.889 637.800 ] concat
0.00000 0.00000 moveto
/Arial findfont 12 scalefont setfont 10.0000 cfontH
(\000m\000o\000d\000u\000l\000e\000s\000 \000d\000a\000i\000l\000y\000 \000c\000o\000m\000p\000u\000t\000a\000t\000i\000o\000n\000s) recshow
Q
2 J
10.0000 M
1.00000 1.00000 1.00000 RG
newpath
306.000 752.578 m
468.000 752.578 l
468.000 805.578 l
306.000 805.578 l
306.000 752.578 l
h
f
2.00000 w
0 J
1.45000 M
0.00000 0.00000 0.00000 RG
newpath
306.000 752.578 m
468.000 752.578 l
468.000 805.578 l
306.000 805.578 l
306.000 752.578 l
h
S
1.00000 w
2 J
10.0000 M
0 J
1.45000 M
q
[ 1.00000 0.00000 0.00000 -1.00000 343.646 783.238 ] concat
0.00000 0.00000 moveto
/Arial findfont 12 scalefont setfont 10.0000 cfontH
(\000w\000r\000i\000t\000e\000 \000o\000u\000t\000p\000u\000t\000 \000f\000i\000l\000e\000s) recshow
Q
2 J
10.0000 M
1.00000 1.00000 1.00000 RG
newpath
326.000 412.500 m
488.000 412.500 l
488.000 465.500 l
326.000 465.500 l
326.000 412.500 l
h
f
2.00000 w
0 J
1.45000 M
0.00000 0.00000 0.00000 RG
newpath
326.000 412.500 m
488.000 412.500 l
488.000 465.500 l
326.000 465.500 l
326.000 412.500 l
h
S
1.00000 w
2 J
10.0000 M
0 J
1.45000 M
q
[ 1.00000 0.00000 0.00000 -1.00000 351.638 443.160 ] concat
0.00000 0.00000 moveto
/Arial findfont 12 scalefont setfont 10.0000 cfontH
(\000m\000o\000d\000u\000l\000e\000s\000 \000i\000n\000i\000t\000i\000a\000l\000i\000z\000a\000t\000i\000o\000n) recshow
Q
2 J
10.0000 M
1.00000 1.00000 1.00000 RG
newpath
316.000 404.000 m
478.000 404.000 l
478.000 457.000 l
316.000 457.000 l
316.000 404.000 l
h
f
2.00000 w
0 J
1.45000 M
0.00000 0.00000 0.00000 RG
newpath
316.000 404.000 m
478.000 404.000 l
478.000 457.000 l
316.000 457.000 l
316.000 404.000 l
h
S
1.00000 w
2 J
10.0000 M
0 J
1.45000 M
q
[ 1.00000 0.00000 0.00000 -1.00000 341.638 434.660 ] concat
0.00000 0.00000 moveto
/Arial findfont 12 scalefont setfont 10.0000 cfontH
(\000m\000o\000d\000u\000l\000e\000s\000 \000i\000n\000i\000t\000i\000a\000l\000i\000z\000a\000t\000i\000o\000n) recshow
Q
2 J
10.0000 M
1.00000 1.00000 1.00000 RG
newpath
306.000 395.500 m
468.000 395.500 l
468.000 448.500 l
306.000 448.500 l
306.000 395.500 l
h
f
2.00000 w
0 J
1.45000 M
0.00000 0.00000 0.00000 RG
newpath
306.000 395.500 m
468.000 395.500 l
468.000 448.500 l
306.000 448.500 l
306.000 395.500 l
h
S
1.00000 w
2 J
10.0000 M
0 J
1.45000 M
q
[ 1.00000 0.00000 0.00000 -1.00000 331.638 426.160 ] concat
0.00000 0.00000 moveto
/Arial findfont 12 scalefont setfont 10.0000 cfontH
(\000m\000o\000d\000u\000l\000e\000s\000 \000i\000n\000i\000t\000i\000a\000l\000i\000z\000a\000t\000i\000o\000n) recshow
Q
2 J
10.0000 M
0 J
1.45000 M
newpath
389.789 692.436 m
388.992 714.441 l
S
newpath
388.702 722.436 m
394.133 710.625 l
389.028 713.442 l
384.140 710.263 l
h
f
2 J
10.0000 M
0 J
1.45000 M
newpath
393.751 472.500 m
393.659 494.500 l
S
newpath
393.625 502.500 m
398.676 490.521 l
393.663 493.500 l
388.676 490.479 l
h
f
2 J
10.0000 M
0 J
1.45000 M
newpath
387.000 188.500 m
387.000 219.000 l
S
newpath
387.000 227.000 m
392.000 215.000 l
387.000 218.000 l
382.000 215.000 l
h
f
2 J
10.0000 M
0 J
1.45000 M
newpath
387.000 280.000 m
387.000 312.250 l
S
newpath
387.000 320.250 m
392.000 308.250 l
387.000 311.250 l
382.000 308.250 l
h
f
2 J
10.0000 M
2.00000 w
0 J
1.45000 M
[ 12.0000 4.00000 ] 0.00000 d
newpath
323.927 665.755 m
315.441 658.353 l
297.731 641.567 l
283.252 626.260 l
272.002 612.432 l
263.982 600.084 l
259.192 589.216 l
257.631 579.826 l
259.301 571.916 l
264.200 565.485 l
272.329 560.534 l
283.688 557.061 l
298.276 555.068 l
298.920 555.050 l
S
newpath
307.916 554.791 m
294.260 549.557 l
297.795 555.082 l
294.584 560.802 l
h
f
1.00000 w
[ ] 0.00000 d
q
[ 1.00000 0.00000 0.00000 -1.00000 235.944 647.698 ] concat
0.00000 0.00000 moveto
/Helvetica findfont 12 scalefont setfont 10.0000 cfontH
(\000y\000e\000a\000r\000l\000y\000 \000l\000o\000o\000p) recshow
Q
2.00000 w
[ 12.0000 4.00000 ] 0.00000 d
1.00000 w
2 J
10.0000 M
[ ] 0.00000 d
0 J
1.45000 M
newpath
388.928 588.390 m
388.928 599.140 l
S
newpath
388.928 607.140 m
393.928 595.140 l
388.928 598.140 l
383.928 595.140 l
h
f
2 J
10.0000 M
0 J
1.45000 M
newpath
469.244 660.161 m
472.102 662.350 l
476.999 664.761 l
482.229 666.179 l
487.633 666.578 l
493.053 665.932 l
498.331 664.211 l
503.308 661.391 l
507.622 657.633 l
510.998 653.227 l
513.409 648.329 l
514.827 643.099 l
515.227 637.695 l
514.580 632.275 l
512.859 626.997 l
510.039 622.020 l
506.281 617.706 l
501.875 614.331 l
496.977 611.920 l
491.747 610.501 l
486.343 610.102 l
480.923 610.749 l
476.964 612.039 l
476.878 612.091 l
S
newpath
469.873 615.955 m
482.796 614.538 l
477.754 611.608 l
477.966 605.781 l
h
f
q
[ 1.00000 0.00000 0.00000 -1.00000 492.888 678.898 ] concat
0.00000 0.00000 moveto
/Helvetica findfont 12 scalefont setfont 10.0000 cfontH
(\000d\000a\000i\000l\000y\000 \000l\000o\000o\000p) recshow
Q
2 J
10.0000 M
0 J
1.45000 M
newpath
387.000 373.250 m
387.000 387.500 l
S
newpath
387.000 395.500 m
392.000 383.500 l
387.000 386.500 l
382.000 383.500 l
h
f
2 J
10.0000 M
Q
[ 1.00000 0.00000 0.00000 1.00000 0.00000 0.00000 ] defaultmatrix matrix concatmatrix setmatrix
cliprestore

%%Trailer
%%EOF
