Technique;Possible decision rules
Sowing;**Date** based on soil water status and temperature 
Irrigation;Calendar **dates** or **phenological stages** and **amounts** based on water stress
Fertilisation;Calendar **dates** or **phenological stages** and **amounts** based on nitrogen stress and soil surface water status
Harvesting;**Date** based on plant physiology and soil water status
Forage cutting;Calendar **dates** or **phenological stages** with a minimum level of biomass
Tactical shape control;**Dates** and **amounts** based on expected shape
Leaf removal;**Dates** and **amounts** based on the leaf quantity to remove
Crop destruction;Calendar **dates**
