is_dominant
lai(n)
masec(n)
mafruit
HR(1)
HR(2)
HR(3)
HR(4)
HR(5)
resmes
drain
esol
et
zrac
tcult
AZnit(1)
AZnit(2)
AZnit(3)
AZnit(4)
AZnit(5)
Qles
QNplante
azomes
chargefruit
AZamm(1)
AZamm(2)
AZamm(3)
AZamm(4)
AZamm(5)
CNgrain
concNO3les
drat
raint
fapar
hauteur
Hmax
humidite
LRACH(1)
LRACH(2)
LRACH(3)
LRACH(4)
LRACH(5)
mafrais
pdsfruitfrais
Qdrain
rnet
QNgrain
psibase
mabois
H2Orec
mafeuiljaune
mafeuilverte
humirac_mean
tempeff
deltai(n)
ulai(n)
tustress
efdensite
densite
exolai
dltams(n)
remobilj
exofac
exobiom
inn
innlai
inns
turfac
swfac
Qminh
Qminr
