tool;launch the model;manage the files;visualize;evaluate;optimize;starting with the model;multi-simulation;calibration;pre-requiries
"""JavaStics interface """;*;*;*;*;*;**;*;*;no
"""JavaStics in command line""";*;;;;;*;**;;no
"""Record platform""";*;;;;**;;**;;record install
"""batch user's""";*;;;;;;;;no
"""SticsRfiles""";;*;;**;;;;;Rstudio install
"""SticsOnR""";*;;;;;;**;;Rstudio install
"""CroptimizR""";;;;;*;;;**;Rstudio install
"""CropPlotR""";;;**;;;;;;Rstudio install
