:nbplantes:
1
:plante:
snu
0.0000
0.0000
0.0000
code_acti_reserve
2
0
0
0
0
0.0000
0.0000
0.0000
:densinitial:
0.0000 0.0000 0.0000 0.0000 0.0000 
:plante:




code_acti_reserve
2
0
0
0
0



:densinitial:
     
:Hinitf:
11.8371338316273 13.5814330841864 12 16 18.5 
:NO3initf:
4.9 9.9 17.2 9.5 2.2 
:NH4initf:
1.6 2.8 4.4 3.2 14 
:snow:
Sdepth0
0.0
Sdry0
0.0
Swet0
0.0
ps0
0.0
