Mean prediction;;;soil type;soil type;
;                       ;deep loam; shallow sandy loam on limestone;shallow loamy clay on marl and rock;shallow loamy sand on sand.
reset simulations ;;;;;
Residue biomass;Mg ha-1 y-1;8;7.3;5.6;5.7
Residue N content;%;0.8;0.9;0.8;1.3
Residue mineralization;kg ha-1 y-1;-5;-9;-5;-8
continuous simulations;;;;;
Residue biomass;Mg ha-1 y-1;7.7;6.6;5.2;5.6
Residue N content;%;0.8;0.8;0.8;1.3
Residue mineralization;kg ha-1 y-1;-21;-22;-17;-6
