Chapter;Sub-Chapter;Formalisation;Code name: option name;Option choice;Comments;Sub-option code name: sub-option name;Option choice
"Soil-crop 
management
effects";Crop management;Harvest policy;codcueille: method of harvest;cutting; - ;;
"Soil-crop 
management
effects";Crop management;Harvest policy;codcueille: method of harvest;picking;  -  ;nbcueille: number of pickings;one at the end
"Soil-crop 
management
effects";Crop management;Harvest policy;codcueille: method of harvest;picking;  -  ;nbcueille: number of pickings;many during the cycle
"Soil-crop 
management
effects";Crop management;Harvest policy;codefauche: cut crop (particular case of forage crop);yes; - ;codemodfauche: method of cutting;automatic
"Soil-crop 
management
effects";Crop management;Harvest policy;codefauche: cut crop (particular case of forage crop);yes; - ;codemodfauche: method of cutting;calendar in days
"Soil-crop 
management
effects";Crop management;Harvest policy;codefauche: cut crop (particular case of forage crop);yes; - ;codemodfauche: method of cutting;calendar in degree days (physiological calendar)
"Soil-crop 
management
effects";Crop management;Harvest policy;codefauche: cut crop (particular case of forage crop);no;  -  ;  -  ;  -  
"Soil-crop 
management
effects";Crop management;Decision of harvest;codrecolte: harvest decision;physiological maturity; - ; - ; - 
"Soil-crop 
management
effects";Crop management;Decision of harvest;codrecolte: harvest decision;water content (in harvested organs);  -  ;codeaumin: minimum or maximum;minimum
"Soil-crop 
management
effects";Crop management;Decision of harvest;codrecolte: harvest decision;water content (in harvested organs);  -  ;codeaumin: minimum or maximum;maximum
"Soil-crop 
management
effects";Crop management;Decision of harvest;codrecolte: harvest decision;sugar content (in harvested organs); - ; - ; - 
"Soil-crop 
management
effects";Crop management;Decision of harvest;codrecolte: harvest decision;nitrogen content (in harvested organs);  -  ;  -  ;  -  
"Soil-crop 
management
effects";Crop management;Decision of harvest;codrecolte: harvest decision;oil content (in harvested organs); - ; - ; - 
"Soil-crop 
management
effects";Crop management;Decision of harvest;codrecolte: harvest decision;buffer date of harvest;  -  ;  -  ;  -  
"Soil-crop 
management
effects";Crop management;Decision of harvest;codedecirecolte: rules of harvest/moisture status of the soil harvest delay (depending on the soil physical conditions);yes/no; - ; - ; - 
"Soil-crop 
management
effects";Crop management;Decision of harvest;coderecolteassoc: decision of harvest for associated crops;maturity of the earliest crop;Has to be chosen for the Intercrop simulation;  -  ;  -  
"Soil-crop 
management
effects";Crop management;Decision of harvest;coderecolteassoc: decision of harvest for associated crops;maturity of both (2 dates);Has to be chosen for the Intercrop simulation; - ; - 
;Crop management;;codejourdes: date of plant destruction;;Only for perennial crops;  -  ;  -  
