jul;msracf;msracg;msracmortf;msracmortg
270;0.00;0.00;0.00;0.00
271;0.00;0.00;0.00;0.00
272;0.00;0.00;0.00;0.00
273;0.00;0.00;0.00;0.00
274;0.00;0.00;0.00;0.00
275;0.00;0.00;0.00;0.00
276;0.00;0.00;0.00;0.00
277;0.00;0.00;0.00;0.00
278;0.00;0.00;0.00;0.00
279;0.00;0.00;0.00;0.00
280;0.00;0.00;0.00;0.00
281;0.00;0.00;0.00;0.00
282;0.00;0.00;0.00;0.00
283;0.00;0.00;0.00;0.00
284;0.00;0.00;0.00;0.00
285;0.00;0.00;0.00;0.00
286;0.00;0.00;0.00;0.00
287;0.00;0.00;0.00;0.00
288;0.00;0.00;0.00;0.00
289;0.00;0.00;0.00;0.00
290;0.00;0.00;0.00;0.00
291;0.00;0.00;0.00;0.00
292;0.00;0.00;0.00;0.00
293;0.00;0.00;0.00;0.00
294;0.00;0.00;0.00;0.00
295;0.00;0.00;0.00;0.00
296;0.00;0.00;0.00;0.00
297;0.01;0.00;0.00;0.00
298;0.01;0.00;0.00;0.00
299;0.01;0.01;0.00;0.00
300;0.02;0.01;0.00;0.00
301;0.02;0.01;0.00;0.00
302;0.03;0.02;0.00;0.00
303;0.04;0.02;0.00;0.00
304;0.05;0.02;0.00;0.00
305;0.05;0.03;0.00;0.00
306;0.05;0.03;0.00;0.00
307;0.06;0.03;0.00;0.00
308;0.06;0.04;0.00;0.00
309;0.07;0.04;0.00;0.00
310;0.07;0.04;0.00;0.00
311;0.07;0.04;0.00;0.00
312;0.07;0.05;0.00;0.00
313;0.08;0.05;0.00;0.00
314;0.08;0.05;0.00;0.00
315;0.08;0.05;0.00;0.00
316;0.08;0.05;0.00;0.00
317;0.09;0.05;0.00;0.00
318;0.09;0.05;0.00;0.00
319;0.09;0.06;0.00;0.00
320;0.09;0.06;0.00;0.00
321;0.09;0.06;0.00;0.00
322;0.09;0.06;0.00;0.00
323;0.09;0.06;0.00;0.00
324;0.09;0.06;0.00;0.00
325;0.09;0.06;0.00;0.00
326;0.09;0.06;0.00;0.00
327;0.09;0.06;0.00;0.00
328;0.09;0.06;0.00;0.00
329;0.09;0.06;0.00;0.00
330;0.09;0.06;0.00;0.00
331;0.09;0.06;0.00;0.00
332;0.09;0.06;0.00;0.00
333;0.10;0.06;0.00;0.00
334;0.10;0.06;0.00;0.00
335;0.10;0.06;0.00;0.00
336;0.10;0.06;0.00;0.00
337;0.10;0.06;0.00;0.00
338;0.10;0.06;0.00;0.00
339;0.10;0.07;0.00;0.00
340;0.10;0.07;0.00;0.00
341;0.10;0.07;0.00;0.00
342;0.10;0.07;0.00;0.00
343;0.10;0.07;0.00;0.00
344;0.10;0.07;0.00;0.00
345;0.10;0.07;0.00;0.00
346;0.10;0.07;0.00;0.00
347;0.11;0.07;0.00;0.00
348;0.11;0.07;0.00;0.00
349;0.11;0.07;0.00;0.00
350;0.11;0.07;0.00;0.00
351;0.11;0.07;0.00;0.00
352;0.11;0.07;0.00;0.00
353;0.11;0.07;0.00;0.00
354;0.11;0.07;0.00;0.00
355;0.11;0.07;0.00;0.00
356;0.11;0.07;0.00;0.00
357;0.11;0.07;0.00;0.00
358;0.11;0.07;0.00;0.00
359;0.11;0.07;0.00;0.00
360;0.11;0.07;0.00;0.00
361;0.11;0.07;0.00;0.00
362;0.11;0.07;0.00;0.00
363;0.11;0.07;0.00;0.00
364;0.11;0.07;0.00;0.00
365;0.11;0.07;0.00;0.00
366;0.11;0.07;0.00;0.00
367;0.11;0.07;0.00;0.00
368;0.11;0.07;0.00;0.00
369;0.11;0.07;0.00;0.00
370;0.11;0.07;0.00;0.00
371;0.11;0.07;0.00;0.00
372;0.11;0.07;0.00;0.00
373;0.11;0.07;0.00;0.00
374;0.11;0.07;0.00;0.00
375;0.12;0.08;0.00;0.00
376;0.12;0.08;0.00;0.00
377;0.12;0.08;0.00;0.00
378;0.12;0.08;0.00;0.00
379;0.12;0.08;0.00;0.00
380;0.12;0.08;0.00;0.00
381;0.12;0.08;0.00;0.00
382;0.12;0.08;0.00;0.00
383;0.12;0.08;0.00;0.00
384;0.12;0.08;0.00;0.00
385;0.12;0.08;0.00;0.00
386;0.12;0.08;0.00;0.00
387;0.12;0.08;0.00;0.00
388;0.12;0.08;0.00;0.00
389;0.12;0.08;0.00;0.00
390;0.12;0.08;0.00;0.00
391;0.12;0.08;0.00;0.00
392;0.12;0.08;0.00;0.00
393;0.12;0.08;0.00;0.00
394;0.12;0.08;0.00;0.00
395;0.12;0.08;0.00;0.00
396;0.12;0.08;0.00;0.00
397;0.12;0.08;0.00;0.00
398;0.12;0.08;0.00;0.00
399;0.12;0.08;0.00;0.00
400;0.12;0.08;0.00;0.00
401;0.12;0.08;0.00;0.00
402;0.12;0.08;0.00;0.00
403;0.12;0.08;0.01;0.00
404;0.11;0.08;0.01;0.00
405;0.12;0.08;0.01;0.00
406;0.11;0.08;0.01;0.00
407;0.11;0.08;0.02;0.00
408;0.11;0.08;0.02;0.00
409;0.11;0.08;0.02;0.00
410;0.11;0.08;0.02;0.00
411;0.10;0.08;0.02;0.00
412;0.10;0.08;0.03;0.00
413;0.10;0.08;0.03;0.00
414;0.09;0.08;0.04;0.00
415;0.09;0.09;0.04;0.00
416;0.09;0.09;0.05;0.00
417;0.09;0.09;0.05;0.00
418;0.09;0.09;0.05;0.00
419;0.08;0.09;0.05;0.00
420;0.08;0.09;0.05;0.00
421;0.08;0.09;0.05;0.00
422;0.08;0.09;0.05;0.00
423;0.08;0.09;0.06;0.00
424;0.08;0.09;0.06;0.00
425;0.07;0.09;0.06;0.00
426;0.07;0.09;0.07;0.00
427;0.07;0.09;0.07;0.00
428;0.07;0.09;0.07;0.00
429;0.07;0.09;0.07;0.00
430;0.07;0.09;0.08;0.00
431;0.07;0.09;0.08;0.00
432;0.07;0.09;0.08;0.00
433;0.07;0.09;0.08;0.00
434;0.07;0.09;0.08;0.00
435;0.06;0.09;0.09;0.00
436;0.06;0.09;0.09;0.00
437;0.07;0.09;0.09;0.00
438;0.07;0.09;0.09;0.00
439;0.07;0.09;0.09;0.00
440;0.07;0.09;0.09;0.00
441;0.07;0.09;0.10;0.00
442;0.07;0.09;0.10;0.00
443;0.07;0.09;0.10;0.00
444;0.08;0.10;0.10;0.00
445;0.08;0.10;0.10;0.00
446;0.08;0.10;0.10;0.00
447;0.08;0.10;0.10;0.00
448;0.08;0.10;0.10;0.00
449;0.09;0.10;0.10;0.00
450;0.09;0.10;0.10;0.00
451;0.09;0.10;0.10;0.00
452;0.09;0.10;0.11;0.00
453;0.09;0.10;0.11;0.00
454;0.09;0.10;0.11;0.00
455;0.09;0.10;0.11;0.00
456;0.10;0.10;0.11;0.00
457;0.10;0.10;0.11;0.00
458;0.10;0.10;0.11;0.00
459;0.11;0.11;0.11;0.00
460;0.13;0.11;0.11;0.00
461;0.13;0.11;0.11;0.00
462;0.14;0.11;0.11;0.00
463;0.15;0.12;0.11;0.00
464;0.16;0.12;0.11;0.00
465;0.17;0.13;0.11;0.00
466;0.19;0.13;0.11;0.00
467;0.20;0.14;0.11;0.00
468;0.21;0.14;0.12;0.00
469;0.22;0.15;0.12;0.00
470;0.22;0.15;0.12;0.00
471;0.23;0.15;0.12;0.00
472;0.24;0.16;0.12;0.00
473;0.25;0.17;0.12;0.00
474;0.27;0.17;0.12;0.00
475;0.28;0.19;0.12;0.00
476;0.29;0.19;0.12;0.00
477;0.31;0.20;0.12;0.00
478;0.32;0.21;0.12;0.00
479;0.32;0.21;0.12;0.00
480;0.33;0.21;0.13;0.01
481;0.35;0.22;0.13;0.01
482;0.36;0.23;0.13;0.01
483;0.37;0.24;0.13;0.01
484;0.38;0.24;0.13;0.02
485;0.40;0.24;0.13;0.02
486;0.42;0.25;0.13;0.03
487;0.44;0.26;0.14;0.03
488;0.45;0.27;0.14;0.03
489;0.46;0.28;0.14;0.04
490;0.47;0.28;0.14;0.04
491;0.50;0.29;0.15;0.05
492;0.52;0.31;0.15;0.05
493;0.53;0.32;0.15;0.05
494;0.55;0.32;0.15;0.06
495;0.57;0.33;0.16;0.06
496;0.58;0.35;0.17;0.06
497;0.60;0.36;0.17;0.06
498;0.60;0.37;0.18;0.06
499;0.62;0.38;0.19;0.07
500;0.65;0.40;0.19;0.07
501;0.67;0.41;0.20;0.07
502;0.70;0.43;0.20;0.07
503;0.71;0.45;0.21;0.07
504;0.70;0.46;0.24;0.07
505;0.72;0.47;0.24;0.07
506;0.70;0.48;0.28;0.07
507;0.71;0.49;0.29;0.07
508;0.70;0.49;0.30;0.07
509;0.71;0.50;0.32;0.07
510;0.71;0.50;0.34;0.08
511;0.72;0.50;0.36;0.08
512;0.71;0.51;0.39;0.08
513;0.73;0.51;0.40;0.08
514;0.73;0.51;0.41;0.08
515;0.73;0.52;0.43;0.08
516;0.73;0.52;0.44;0.08
517;0.76;0.52;0.44;0.08
518;0.76;0.52;0.46;0.08
519;0.77;0.54;0.48;0.08
520;0.77;0.55;0.49;0.08
521;0.78;0.55;0.51;0.08
522;0.76;0.55;0.53;0.09
523;0.74;0.55;0.57;0.09
524;0.77;0.55;0.57;0.09
525;0.78;0.55;0.59;0.09
526;0.80;0.55;0.60;0.09
527;0.79;0.56;0.62;0.09
528;0.77;0.56;0.67;0.09
529;0.78;0.57;0.68;0.09
530;0.80;0.56;0.68;0.09
531;0.79;0.56;0.70;0.09
532;0.78;0.57;0.73;0.09
533;0.79;0.57;0.75;0.09
534;0.78;0.57;0.77;0.09
535;0.80;0.57;0.78;0.10
536;0.79;0.57;0.81;0.10
537;0.78;0.57;0.84;0.10
538;0.76;0.57;0.87;0.10
539;0.75;0.57;0.90;0.10
540;0.74;0.56;0.92;0.10
541;0.73;0.56;0.94;0.11
542;0.72;0.55;0.96;0.11
543;0.70;0.55;0.98;0.12
544;0.67;0.54;1.01;0.13
545;0.64;0.52;1.03;0.14
546;0.63;0.52;1.05;0.15
547;0.60;0.51;1.07;0.15
548;0.60;0.50;1.07;0.17
549;0.55;0.49;1.12;0.17
550;0.53;0.48;1.14;0.19
551;0.50;0.45;1.17;0.21
552;0.45;0.45;1.22;0.22
553;0.43;0.44;1.24;0.23
554;0.41;0.42;1.27;0.25
555;0.39;0.41;1.28;0.26
556;0.39;0.40;1.28;0.26
557;0.38;0.39;1.29;0.28
558;0.37;0.38;1.31;0.29
559;0.33;0.36;1.34;0.31
560;0.30;0.35;1.37;0.32
561;0.28;0.34;1.39;0.32
562;0.27;0.33;1.41;0.34
563;0.24;0.31;1.43;0.35
564;0.24;0.30;1.43;0.37
565;0.00;0.29;1.68;0.38
566;0.00;0.00;1.68;0.67
567;0.00;0.00;1.68;0.67
568;0.00;0.00;1.68;0.67
569;0.00;0.00;1.68;0.67
570;0.00;0.00;1.68;0.67
571;0.00;0.00;1.68;0.67
572;0.00;0.00;1.68;0.67
573;0.00;0.00;1.68;0.67
574;0.00;0.00;1.68;0.67
575;0.00;0.00;1.68;0.67
576;0.00;0.00;1.68;0.67
577;0.00;0.00;1.68;0.67
578;0.00;0.00;1.68;0.67
579;0.00;0.00;1.68;0.67
580;0.00;0.00;1.68;0.67
581;0.00;0.00;1.68;0.67
582;0.00;0.00;1.68;0.67
583;0.00;0.00;1.68;0.67
584;0.00;0.00;1.68;0.67
585;0.00;0.00;1.68;0.67
586;0.00;0.00;1.68;0.67
587;0.00;0.00;1.68;0.67
588;0.00;0.00;1.68;0.67
589;0.00;0.00;1.68;0.67
590;0.00;0.00;1.68;0.67
591;0.00;0.00;1.68;0.67
592;0.00;0.00;1.68;0.67
593;0.00;0.00;1.68;0.67
594;0.00;0.00;1.68;0.67
595;0.00;0.00;1.68;0.67
596;0.00;0.00;1.68;0.67
597;0.00;0.00;1.68;0.67
598;0.00;0.00;1.68;0.67
599;0.00;0.00;1.68;0.67
600;0.00;0.00;1.68;0.67
601;0.00;0.00;1.68;0.67
602;0.00;0.00;1.68;0.67
603;0.00;0.00;1.68;0.67
604;0.00;0.00;1.68;0.67
605;0.00;0.00;1.68;0.67
606;0.00;0.00;1.68;0.67
607;0.00;0.00;1.68;0.67
608;0.00;0.00;1.68;0.67
609;0.00;0.00;1.68;0.67
610;0.00;0.00;1.68;0.67
611;0.00;0.00;1.68;0.67
612;0.00;0.00;1.68;0.67
613;0.00;0.00;1.68;0.67
614;0.00;0.00;1.68;0.67
615;0.00;0.00;1.68;0.67
616;0.00;0.00;1.68;0.67
617;0.00;0.00;1.68;0.67
618;0.00;0.00;1.68;0.67
619;0.00;0.00;1.68;0.67
620;0.00;0.00;1.68;0.67
621;0.00;0.00;1.68;0.67
622;0.00;0.00;1.68;0.67
623;0.00;0.00;1.68;0.67
624;0.00;0.00;1.68;0.67
625;0.00;0.00;1.68;0.67
626;0.00;0.00;1.68;0.67
627;0.00;0.00;1.68;0.67
628;0.00;0.00;1.68;0.67
629;0.00;0.00;1.68;0.67
630;0.00;0.00;1.68;0.67
631;0.00;0.00;1.68;0.67
632;0.00;0.00;1.68;0.67
633;0.00;0.00;1.68;0.67
634;0.00;0.00;1.68;0.67
635;0.00;0.00;1.68;0.67
636;0.00;0.00;1.68;0.67
637;0.00;0.00;1.68;0.67
638;0.00;0.00;1.68;0.67
639;0.00;0.00;1.68;0.67
640;0.00;0.00;1.68;0.67
641;0.00;0.00;1.68;0.67
642;0.00;0.00;1.68;0.67
643;0.00;0.00;1.68;0.67
644;0.00;0.00;1.68;0.67
