SIMULATION;DAYJUL;SUMESOL
q0=0;215;2.09
q0=0;216;4.01
q0=0;217;5.28
q0=0;218;6.51
q0=0;219;7.13
q0=0;220;7.6
q0=0;221;8.2
q0=0;222;8.67
q0=0;223;9.12
q0=0;224;9.56
q0=0;225;10.15
q0=0;226;10.69
q0=0;227;11.26
q0=0;228;11.84
q0=0;229;12.37
q0=0;230;12.8
q0=0;231;13.26
q0=0;232;13.63
q0=0;233;14.7
q0=0;234;15.72
q0=0;235;15.94
q0=0;236;17.65
q0=0;237;17.91
q0=0;238;18.2
q0=0;239;18.43
q0=0;240;18.68
q0=0;241;18.91
q0=0;242;19.06
q0=0;243;19.31
q0=0;244;21.15
q0=0;245;22.28
q0=0;246;23.18
q0=0;247;24.2
q0=0;248;25.68
q0=0;249;27.35
q0=0;250;28.25
q0=0;251;29.32
q0=0;252;31.03
q0=0;253;33
q0=0;254;34.23
q0=0;255;35.71
q0=0;256;36.55
q0=0;257;37.94
q0=0;258;39.52
q0=0;259;41.14
q0=0;260;41.83
q0=0;261;42.38
q0=0;262;42.86
q0=0;263;43.39
q0=0;264;43.99
q0=0;265;44.51
q0=0;266;44.94
q0=0;267;45.35
q0=0;268;45.82
q0=0;269;46.95
q0=0;270;48.24
q0=0;271;49.31
q0=0;272;50.38
q0=0;273;51.91
q0=0;274;52.77
q0=0;275;53.15
q0=0;276;53.43
q0=0;277;54.07
q0=0;278;54.35
q0=0;279;55.06
q0=0;280;55.77
q0=0;281;56.41
q0=0;282;56.84
q0=0;283;57.68
q0=0;284;58.46
q0=0;285;59.59
q0=0;286;60.49
q0=0;287;61.56
q0=0;288;62.2
q0=0;289;62.91
q0=0;290;63.87
q0=0;291;64.51
q0=0;292;65.09
q0=0;293;65.46
q0=0;294;65.97
q0=0;295;67.04
q0=0;296;68.17
q0=0;297;69.13
q0=0;298;70.36
q0=0;299;71
q0=0;300;72.39
q0=0;301;72.66
q0=0;302;73.24
q0=0;303;73.51
q0=0;304;73.78
q0=0;305;74.21
q0=0;306;74.48
q0=0;307;75.06
q0=0;308;75.33
q0=0;309;76.13
q0=0;310;76.71
q0=0;311;76.98
q0=0;312;77.48
q0=0;313;78.32
q0=0;314;78.82
q0=0;315;78.87
q0=0;316;79.14
q0=0;317;79.34
q0=0;318;79.69
q0=0;319;80.19
q0=0;320;80.4
q0=0;321;80.45
q0=0;322;80.5
q0=0;323;80.55
q0=0;324;80.6
q0=0;325;80.65
q0=0;326;80.69
q0=0;327;80.73
q0=0;328;80.81
q0=0;329;81.16
q0=0;330;81.35
q0=0;331;81.55
q0=0;332;81.65
q0=0;333;81.84
q0=0;334;82.11
q0=0;335;82.61
q0=0;336;82.85
q0=0;337;82.99
q0=0;338;83.26
q0=0;339;83.53
q0=0;340;83.69
q0=0;341;83.74
q0=0;342;83.93
q0=0;343;83.98
q0=0;344;84.03
q0=0;345;84.08
q0=0;346;84.13
q0=0;347;84.18
q0=0;348;84.23
q0=0;349;84.28
q0=0;350;84.33
q0=0;351;84.37
q0=0;352;84.42
q0=0;353;84.69
q0=0;354;84.96
q0=0;355;84.92
q0=0;356;85.19
q0=0;357;85.24
q0=0;358;85.29
q0=0;359;85.39
q0=0;360;86.17
q0=0;361;87.24
q0=0;362;87.82
q0=0;363;87.87
q0=0;364;88.05
q0=0;365;88.62
q0=10;215;3.7
q0=10;216;7
q0=10;217;10.7
q0=10;218;14.03
q0=10;219;15.03
q0=10;220;15.7
q0=10;221;16.51
q0=10;222;17.11
q0=10;223;17.66
q0=10;224;18.19
q0=10;225;18.88
q0=10;226;19.5
q0=10;227;20.14
q0=10;228;20.79
q0=10;229;21.38
q0=10;230;21.85
q0=10;231;22.35
q0=10;232;22.75
q0=10;233;23.82
q0=10;234;24.84
q0=10;235;25.08
q0=10;236;26.79
q0=10;237;27.07
q0=10;238;27.37
q0=10;239;27.62
q0=10;240;27.88
q0=10;241;28.12
q0=10;242;28.28
q0=10;243;28.54
q0=10;244;30.38
q0=10;245;31.98
q0=10;246;33.18
q0=10;247;34.58
q0=10;248;36.88
q0=10;249;39.58
q0=10;250;40.78
q0=10;251;42.28
q0=10;252;45.08
q0=10;253;48.48
q0=10;254;50.28
q0=10;255;52.58
q0=10;256;53.68
q0=10;257;55.78
q0=10;258;58.28
q0=10;259;60.88
q0=10;260;63.58
q0=10;261;65.93
q0=10;262;67.24
q0=10;263;68.27
q0=10;264;69.25
q0=10;265;70.02
q0=10;266;70.62
q0=10;267;71.16
q0=10;268;71.77
q0=10;269;73.32
q0=10;270;75.22
q0=10;271;76.72
q0=10;272;78.22
q0=10;273;80.62
q0=10;274;82.72
q0=10;275;83.82
q0=10;276;84.72
q0=10;277;85.52
q0=10;278;86.52
q0=10;279;87.42
q0=10;280;88.32
q0=10;281;89.12
q0=10;282;89.82
q0=10;283;90.92
q0=10;284;91.92
q0=10;285;93.52
q0=10;286;94.72
q0=10;287;96.22
q0=10;288;97.52
q0=10;289;98.42
q0=10;290;99.72
q0=10;291;100.52
q0=10;292;101.22
q0=10;293;102.12
q0=10;294;103.52
q0=10;295;105.02
q0=10;296;106.62
q0=10;297;107.92
q0=10;298;109.72
q0=10;299;110.52
q0=10;300;112.62
q0=10;301;112.92
q0=10;302;113.62
q0=10;303;113.92
q0=10;304;114.22
q0=10;305;114.72
q0=10;306;115.02
q0=10;307;115.72
q0=10;308;116.02
q0=10;309;117.62
q0=10;310;118.32
q0=10;311;118.62
q0=10;312;119.22
q0=10;313;120.32
q0=10;314;120.92
q0=10;315;120.97
q0=10;316;121.27
q0=10;317;121.77
q0=10;318;122.17
q0=10;319;122.77
q0=10;320;123.07
q0=10;321;123.12
q0=10;322;123.17
q0=10;323;123.22
q0=10;324;123.27
q0=10;325;123.32
q0=10;326;123.37
q0=10;327;123.42
q0=10;328;123.52
q0=10;329;123.92
q0=10;330;124.12
q0=10;331;124.22
q0=10;332;124.32
q0=10;333;124.52
q0=10;334;124.82
q0=10;335;125.52
q0=10;336;126.02
q0=10;337;126.32
q0=10;338;126.62
q0=10;339;126.92
q0=10;340;127.12
q0=10;341;127.17
q0=10;342;127.37
q0=10;343;127.42
q0=10;344;127.47
q0=10;345;127.52
q0=10;346;127.57
q0=10;347;127.62
q0=10;348;127.67
q0=10;349;127.72
q0=10;350;127.77
q0=10;351;127.82
q0=10;352;127.87
q0=10;353;128.17
q0=10;354;128.47
q0=10;355;128.52
q0=10;356;128.82
q0=10;357;128.87
q0=10;358;128.92
q0=10;359;129.02
q0=10;360;130.02
q0=10;361;131.52
q0=10;362;132.22
q0=10;363;132.27
q0=10;364;132.47
q0=10;365;133.47
q0=20;215;3.7
q0=20;216;7
q0=20;217;10.7
q0=20;218;15.4
q0=20;219;18.2
q0=20;220;20.5
q0=20;221;23.23
q0=20;222;24.42
q0=20;223;25.31
q0=20;224;26.07
q0=20;225;27
q0=20;226;27.79
q0=20;227;28.57
q0=20;228;29.34
q0=20;229;30.02
q0=20;230;30.56
q0=20;231;31.12
q0=20;232;31.57
q0=20;233;32.64
q0=20;234;33.66
q0=20;235;33.92
q0=20;236;35.63
q0=20;237;35.94
q0=20;238;36.27
q0=20;239;36.54
q0=20;240;36.82
q0=20;241;37.08
q0=20;242;37.25
q0=20;243;37.53
q0=20;244;39.37
q0=20;245;40.92
q0=20;246;42.12
q0=20;247;43.52
q0=20;248;45.82
q0=20;249;48.52
q0=20;250;49.72
q0=20;251;51.22
q0=20;252;54.02
q0=20;253;57.42
q0=20;254;59.22
q0=20;255;61.52
q0=20;256;62.62
q0=20;257;64.72
q0=20;258;67.22
q0=20;259;69.82
q0=20;260;72.52
q0=20;261;74.92
q0=20;262;77.22
q0=20;263;79.92
q0=20;264;83.22
q0=20;265;85.75
q0=20;266;86.9
q0=20;267;87.77
q0=20;268;88.65
q0=20;269;90.25
q0=20;270;92.15
q0=20;271;93.65
q0=20;272;95.15
q0=20;273;97.55
q0=20;274;99.65
q0=20;275;100.75
q0=20;276;101.65
q0=20;277;102.45
q0=20;278;103.45
q0=20;279;104.35
q0=20;280;105.25
q0=20;281;106.05
q0=20;282;106.75
q0=20;283;107.85
q0=20;284;108.85
q0=20;285;110.45
q0=20;286;111.65
q0=20;287;113.15
q0=20;288;114.45
q0=20;289;115.35
q0=20;290;116.65
q0=20;291;117.45
q0=20;292;118.15
q0=20;293;119.05
q0=20;294;120.45
q0=20;295;121.95
q0=20;296;123.55
q0=20;297;124.85
q0=20;298;126.65
q0=20;299;127.45
q0=20;300;129.55
q0=20;301;129.85
q0=20;302;130.55
q0=20;303;130.85
q0=20;304;131.15
q0=20;305;131.65
q0=20;306;131.95
q0=20;307;132.65
q0=20;308;132.95
q0=20;309;134.55
q0=20;310;135.25
q0=20;311;135.55
q0=20;312;136.15
q0=20;313;137.25
q0=20;314;137.85
q0=20;315;137.9
q0=20;316;138.2
q0=20;317;138.7
q0=20;318;139.1
q0=20;319;139.7
q0=20;320;140
q0=20;321;140.05
q0=20;322;140.1
q0=20;323;140.15
q0=20;324;140.2
q0=20;325;140.25
q0=20;326;140.3
q0=20;327;140.35
q0=20;328;140.45
q0=20;329;140.85
q0=20;330;141.05
q0=20;331;141.15
q0=20;332;141.25
q0=20;333;141.45
q0=20;334;141.75
q0=20;335;142.45
q0=20;336;142.95
q0=20;337;143.25
q0=20;338;143.55
q0=20;339;143.85
q0=20;340;144.05
q0=20;341;144.1
q0=20;342;144.3
q0=20;343;144.35
q0=20;344;144.4
q0=20;345;144.45
q0=20;346;144.5
q0=20;347;144.55
q0=20;348;144.6
q0=20;349;144.65
q0=20;350;144.7
q0=20;351;144.75
q0=20;352;144.8
q0=20;353;145.1
q0=20;354;145.4
q0=20;355;145.45
q0=20;356;145.75
q0=20;357;145.8
q0=20;358;145.85
q0=20;359;145.95
q0=20;360;146.95
q0=20;361;148.45
q0=20;362;149.15
q0=20;363;149.2
q0=20;364;149.4
q0=20;365;150.4
