Qmulch	ruisolnu=0.5 and qmulchruis0=1	ruisolnu=0.2 and qmulchruis0=1	ruisolnu=0.5 and qmulchruis0=3
0	0.5	0.2	0.5
0.05	0.5	0.2	0.5
0.1	0.5	0.2	0.5
0.15	0.2805	0.2	0.5
0.2	0.264	0.2	0.5
0.25	0.2475	0.2	0.5
0.3	0.231	0.2	0.5
0.35	0.2145	0.2	0.5
0.4	0.198	0.198	0.5
0.45	0.1815	0.1815	0.5
0.5	0.165	0.165	0.5
0.55	0.1485	0.1485	0.5
0.6	0.132	0.132	0.5
0.65	0.1155	0.1155	0.5
0.7	0.099	0.099	0.5
0.75	0.0825	0.0825	0.5
0.8	0.066	0.066	0.5
0.85	0.0495	0.0495	0.5
0.9	0.033	0.033	0.5
0.95	0.0165	0.0165	0.5
1	0	0	0.5
1.05	0	0	0.5
1.1	0	0	0.5
1.15	0	0	0.5
1.2	0	0	0.5
1.25	0	0	0.5
1.3	0	0	0.5
1.35	0	0	0.5
1.4	0	0	0.5
1.45	0	0	0.5
1.5	0	0	0.495
1.55	0	0	0.4785
1.6	0	0	0.462
1.65	0	0	0.4455
1.7	0	0	0.429
1.75	0	0	0.4125
1.8	0	0	0.396
1.85	0	0	0.3795
1.9	0	0	0.363
1.95	0	0	0.3465
2	0	0	0.33
2.05	0	0	0.3135
2.1	0	0	0.297
2.15	0	0	0.2805
2.2	0	0	0.264
2.25	0	0	0.2475
2.3	0	0	0.231
2.35	0	0	0.2145
2.4	0	0	0.198
2.45	0	0	0.1815
2.5	0	0	0.165
2.55	0	0	0.1485
2.6	0	0	0.132
2.65	0	0	0.1155
2.7	0	0	0.099
2.75	0	0	0.0825
2.8	0	0	0.066
2.85	0	0	0.0495
2.9	0	0	0.033
2.95	0	0	0.0165
3	0	0	8.79297E-16
3.05	0	0	0
3.1	0	0	0
