%!PS-Adobe-3.0 EPSF-3.0
%%BoundingBox: 0 0 963 797
%%Creator: yExport 1.5
%%Producer: org.freehep.graphicsio.ps.EPSGraphics2D Revision: 12753 
%%For: 
%%Title: 
%%CreationDate: Friday, January 27, 2023 at 10:50:32 AM Central European Standard Time
%%LanguageLevel: 3
%%EndComments
%%BeginProlog
100 dict dup begin

%
% File: org/freehep/graphicsio.ps/PSProlog.txt
% Author: Charles Loomis
%

% Redefinitions which save some space in the output file.  These are also
% the same as the PDF operators.
/q {gsave} def
/Q {grestore} def

/n {newpath} def
/m {moveto} def
/l {lineto} def
/c {curveto} def
/h {closepath} def

/re {4 -2 roll moveto
     dup 0 exch rlineto exch 0 rlineto
     neg 0 exch rlineto closepath} def

/f {fill} def
/f* {eofill} def
/F {gsave vg&FC fill grestore} def
/F* {gsave vg&FC eofill grestore} def

/s {closepath stroke} def
/S {stroke} def

/b {closepath gsave vg&FC fill grestore
    gsave stroke grestore newpath} def
/B {gsave vg&FC fill grestore gsave stroke grestore newpath} def
/b* {closepath gsave vg&FC eofill grestore
    gsave stroke grestore newpath} def
/B* {gsave vg&FC eofill grestore gsave stroke grestore newpath} def

/g {1 array astore /vg&fcolor exch def} def
/G {setgray} def
/k {4 array astore /vg&fcolor exch def} def
/K {setcmykcolor} def
/rg {3 array astore /vg&fcolor exch def} def
/RG {setrgbcolor} def

% Initialize the fill color.
0 0 0 rg

/vg&FC {mark vg&fcolor aload pop
        counttomark 1 eq {G} if
        counttomark 3 eq {RG} if
        counttomark 4 eq {K} if
        cleartomark } def

/vg&DFC {/vg&fcolor exch def} def

/vg&C {mark exch aload pop
       counttomark 1 eq {G} if
       counttomark 3 eq {RG} if
       counttomark 4 eq {K} if
       cleartomark } def

/w {setlinewidth} def
/j {setlinejoin} def
/J {setlinecap} def
/M {setmiterlimit} def
/d {setdash} def
/i {setflat} def

/W {clip} def
/W* {eoclip} def

% Setup the default graphics state.
% (black; 1 pt. linewidth; miter join; butt-ends; solid)
/defaultGraphicsState {0 g 1 w 0 j 0 J [] 0 d} def

% Emulation of the rectangle operators for PostScript implementations
% which do not implement all Level 2 features.  This is an INCOMPLETE
% emulation; only the "x y width height rect..." form is emulated.
/*rf {gsave newpath re fill grestore} def
/*rs {gsave newpath re stroke grestore} def
/*rc {newpath re clip} def
/rf  /rectfill where {pop /rectfill}{/*rf} ifelse load def
/rs  /rectstroke where {pop /rectstroke}{/*rs} ifelse load def
/rc  /rectclip where {pop /rectclip}{/*rc} ifelse load def

% Emulation of the selectfont operator.  This includes a 20% increase in
% the fontsize which is necessary to get sizes similar to the Java fonts.
/*sf {exch findfont exch
      dup type /arraytype eq {makefont}{scalefont} ifelse setfont} bind def
/sf /selectfont where {pop {1.2 mul selectfont}}{{1.2 mul *sf}} ifelse def

% Special version of stroke which allows the dash pattern to continue
% across path segments.  (This may be needed for PostScript although
% modern printers seem to do this correctly.)
/vg&stroke {
  currentdash pop length 0 eq
  {stroke}
  {
    currentdash /vg&doffset exch def pop
    flattenpath
    {m vg&resetdash}
    {2 copy
     currentpoint
     3 -1 roll sub dup mul
     3 1 roll sub dup mul
     add sqrt
     3 1 roll l
     currentdash 3 -1 roll add setdash}
     {}
     {h vg&resetdash}
     pathforall
     stroke
     vg&resetdash
  } ifelse
} def
/vg&resetdash {currentdash pop vg&doffset setdash} def

% Initialize variables for safety.
/delta 0 def
/xv 0 def  /yv 0 def  /width 0 def  /height 0 def

% Initialize to portrait INTERNATIONAL (Letter-height, A4-width) page.
/pw 595 def  /ph 791  def  /po true def /ftp false def

% Initialize margins to 20 points.
/ml 20 def  /mr 20 def  /mt 20 def  /mb 20 def

% Temporary matrices.
/smatrix 0 def  /nmatrix 0 def

% set page size (usage: <page width><page height> setpagesize)
/setpagesize {/ph exch def /pw exch def} def

% set page orientation (usage: portrait or landscape)
/portrait {/po true def} def
/landscape {/po false def} def

% force natural size for image (usage: naturalsize)
/naturalsize {/ftp false def} def

% resize image to fill page (usage: fittopage)
/fittopage {/ftp true def} def

% set margins of the page (usage: <left><bottom><top><right> setmargins)
/setmargins {/mr exch def /mt exch def /mb exch def /ml exch def} def

% set the graphic's size (usage: <width><height> setsize)
/setsize {/gh exch def /gw exch def} def

% set the graphic's origin (usage: <x0><y0> setorigin)
/setorigin {/gy exch def /gx exch def} def

% calculate image center
/imagecenter {pw ml sub mr sub 2 div ml add
              ph mt sub mb sub 2 div mb add} def

% calculate the necessary scaling
/imagescale {po {gw}{gh} ifelse pw ml sub mr sub div
             po {gh}{gw} ifelse ph mt sub mb sub div
             2 copy lt {exch} if pop
             ftp not {1 2 copy lt {exch} if pop} if
             1 exch div /sfactor exch def
             /gw gw sfactor mul def /gh gh sfactor mul def} def

% calculate image origin
/imageorigin {pw ml sub mr sub 2 div ml add
              po {gw}{gh} ifelse 2 div sub
              ph mt sub mb sub 2 div mb add
              po {gh}{gw} ifelse 2 div po {add}{sub} ifelse} def

% calculate the clipping origin
/cliporigin  {pw ml sub mr sub 2 div ml add
              po {gw}{gh} ifelse 2 div sub floor
              ph mt sub mb sub 2 div mb add
              po {gh}{gw} ifelse 2 div sub floor} def

% Set the clipping region to the bounding box.
/cliptobounds {cliporigin po {gw}{gh} ifelse 1 add
                          po {gh}{gw} ifelse 1 add rc} def

% set the base transformation matrix (usage: setbasematrix)
/setbasematrix {imageorigin translate
                po {0}{90} ifelse rotate
                sfactor sfactor neg scale
                /defaultmatrix matrix currentmatrix def} def

% The lower-right bias in drawing 1 pt. wide lines.
/bias  {q 0.5 0.5 translate} def
/unbias {Q} def

% Define the composite fonts used to print Unicode strings.
% Undefine particular values in an encoding array.
/vg&undef { {exch dup 3 -1 roll /.notdef put} forall } def
/vg&redef { {3 -1 roll dup 4 2 roll put} forall } def

% usage: key encoding basefontname vg&newbasefont font
/vg&newbasefont {
findfont dup length dict copy
  begin
    currentdict /FID undef
    /Encoding exch def
    dup /FontName exch def
    currentdict
  end
definefont
} def

% usage: key encoding basefontname vg&newskewedbasefont font
/vg&newskewedbasefont {
findfont dup length dict copy
  begin
    currentdict /FID undef
    /Encoding exch def
    dup /FontName exch def
    exch FontMatrix exch matrix concatmatrix /FontMatrix exch def
    currentdict
  end
definefont
} def

% usage: basekey suffix vg&nconcat name
/vg&nconcat {
  2 {dup length string cvs exch} repeat
  dup length 3 -1 roll dup length 3 -1 roll add string
  dup 0 4 -1 roll dup length 5 1 roll putinterval
  dup 4 -2 roll exch putinterval cvn
} def

%usage: fontname vg&skewmatrix matrix
/vg&skewmatrix {
findfont dup /FontInfo known
  {
    /FontInfo get dup /ItalicAngle known
    {
      [ 1 0 4 -1 roll /ItalicAngle get neg dup sin exch cos div 1 0 0 ]
    }
    {pop matrix} ifelse
  }
  {pop matrix} ifelse
} def

% usage: newfontname basefontname vg&newcompositefont --
/vg&newcompositefont {
/vg&fstyle exch def
/vg&bfont exch def
/vg&fname exch def
<<
/FontStyleBits vg&fstyle
/FontType 0
/FontMatrix matrix
/FontName vg&fname
/FMapType 2
/Encoding [ 0 1 255 {pop 6} for ]
          dup 16#00 0 put % Latin
          dup 16#03 1 put % Greek
          dup 16#20 2 put % Punctuation
          dup 16#21 3 put % Arrows
          dup 16#22 4 put % MathOps
          dup 16#27 5 put % Dingbats

/FDepVector [
vg&bfont /-UC-Latin vg&nconcat UCLatinEncoding
vg&bfont vg&newbasefont

vg&bfont vg&skewmatrix
vg&bfont /-UC-Greek vg&nconcat UCGreekEncoding
/Symbol vg&newskewedbasefont

vg&bfont /-UC-Punctuation vg&nconcat UCPunctuationEncoding
vg&bfont vg&newbasefont

/Arrows-UC findfont
/MathOps-UC findfont
/Dingbats-UC findfont
/Undefined-UC findfont ]
>>
vg&fname exch definefont pop
} def

% Null encoding vector (all elements set to .notdef)
/NullEncoding [ 256 {/.notdef} repeat ] def

% Unicode Latin encoding (unicode codes \u0000-\u00ff)
/UCLatinEncoding
  ISOLatin1Encoding dup length array copy
  dup 16#60 /grave put
  [ 16#90 16#91 16#92 16#93 16#94 16#95 16#96
    16#97 16#98 16#9a 16#9b 16#9d 16#9e 16#9f
  ] vg&undef
  def

% Unicode Greek encoding (unicode codes \u0370-\u03ff)
/UCGreekEncoding
  NullEncoding dup length array copy
  << 16#91 /Alpha    16#92 /Beta      16#93 /Gamma    16#94 /Delta
     16#95 /Epsilon  16#96 /Zeta      16#97 /Eta      16#98 /Theta
     16#99 /Iota     16#9a /Kappa     16#9b /Lambda   16#9c /Mu
     16#9d /Nu       16#9e /Xi        16#9f /Omicron  16#a0 /Pi
     16#a1 /Rho      16#a3 /Sigma     16#a4 /Tau      16#a5 /Upsilon
     16#a6 /Phi      16#a7 /Chi       16#a8 /Psi      16#a9 /Omega
     16#b1 /alpha    16#b2 /beta      16#b3 /gamma    16#b4 /delta
     16#b5 /epsilon  16#b6 /zeta      16#b7 /eta      16#b8 /theta
     16#b9 /iota     16#ba /kappa     16#bb /lambda   16#bc /mu
     16#bd /nu       16#be /xi        16#bf /omicron  16#c0 /pi
     16#c1 /rho      16#c2 /sigma1    16#c3 /sigma    16#c4 /tau
     16#c5 /upsilon  16#c6 /phi1      16#c7 /chi      16#c8 /psi
     16#c9 /omega    16#7e /semicolon 16#87 /dotmath  16#d1 /theta1
     16#d2 /Upsilon1 16#d5 /phi       16#d6 /omega1
  >> vg&redef
  def

% Unicode punctuation encoding (unicode codes \u2000-\u206f)
/UCPunctuationEncoding
  NullEncoding dup length array copy
  << 16#10 /hyphen          16#11 /hyphen              16#12 /endash
     16#13 /emdash          16#18 /quoteleft           16#19 /quoteright
     16#1a /quotesinglbase  16#1b /quotesingle         16#1c /quotedblleft
     16#1d /quotedblright   16#1e /quotedblbase        16#1f /quotedbl
     16#20 /dagger          16#21 /daggerdbl           16#22 /bullet
     16#24 /period          16#26 /ellipsis            16#27 /periodcentered
     16#30 /perthousand     16#44 /fraction
     16#70 /zerosuperior    16#74 /foursuperior        16#75 /fivesuperior
     16#76 /sixsuperior     16#77 /sevensuperior       16#78 /eightsuperior
     16#79 /ninesuperior    16#7b /hyphensuperior      16#7d /parenleftsuperior
     16#7e /parenrightsuperior
     16#80 /zeroinferior    16#84 /fourinferior        16#85 /fiveinferior
     16#81 /oneinferior     16#82 /twoinferior         16#83 /threeinferior
     16#86 /sixinferior     16#87 /seveninferior       16#88 /eightinferior
     16#89 /nineinferior    16#8b /hypheninferior      16#8d /parenleftinferior
     16#8e /parenrightinferior
  >> vg&redef
  def

% Unicode mathematical operators encoding (unicode codes \u2200-\u22ff)
/UCMathOpsEncoding
  NullEncoding dup length array copy
  << 16#00 /universal       16#02 /partialdiff         16#03 /existential
     16#05 /emptyset        16#06 /Delta               16#07 /gradient
     16#08 /element         16#09 /notelement          16#0b /suchthat
     16#0f /product         16#11 /summation           16#12 /minus
     16#15 /fraction        16#17 /asteriskmath        16#19 /bullet
     16#1a /radical         16#1d /proportional        16#1e /infinity
     16#20 /angle           16#23 /bar                 16#27 /logicaland
     16#28 /logicalor       16#29 /intersection        16#2a /union
     16#2b /integral        16#34 /therefore           16#36 /colon
     16#3c /similar         16#45 /congruent           16#48 /approxequal
     16#60 /notequal        16#61 /equivalence         16#64 /lessequal
     16#65 /greaterequal    16#82 /propersubset        16#83 /propersuperset
     16#86 /reflexsubset    16#87 /reflexsuperset      16#95 /circleplus
     16#97 /circlemultiply  16#a5 /perpendicular       16#03 /existential
     16#c0 /logicaland      16#c1 /logicalor           16#c2 /intersection
     16#c3 /union           16#c4 /diamond             16#c5 /dotmath
  >> vg&redef
  def

% Unicode arrows encoding (unicode codes \u2190-\u21ff)
% Also includes those "Letterlike" unicode characters
% which are available in the symbol font. (unicode codes \u2100-\u214f)
/UCArrowsEncoding
  NullEncoding dup length array copy
  << 16#11 /Ifraktur        16#1c /Rfraktur            16#22 /trademarkserif
     16#35 /aleph
     16#90 /arrowleft       16#91 /arrowup             16#92 /arrowright
     16#93 /arrowdown       16#94 /arrowboth           16#d0 /arrowdblleft
     16#d1 /arrowdblup      16#d2 /arrowdblright       16#d3 /arrowdbldown
     16#d4 /arrowdblboth
  >> vg&redef
  def

/ZapfDingbats findfont /Encoding get
dup length array copy /UCDingbatsEncoding exch def
16#20 1 16#7f {
  dup 16#20 sub exch
  UCDingbatsEncoding exch get
  UCDingbatsEncoding 3 1 roll put
} for
16#a0 1 16#ff {
  dup 16#40 sub exch
  UCDingbatsEncoding exch get
  UCDingbatsEncoding 3 1 roll put
} for
UCDingbatsEncoding [ 16#c0 1 16#ff {} for ] vg&undef
[ 16#00  16#05 16#0a 16#0b  16#28 16#4c 16#4e  16#53 16#54 16#55  16#57 16#5f
  16#60  16#68 16#69 16#6a  16#6b 16#6c 16#6d  16#6e 16#6f 16#70  16#71 16#72
  16#73  16#74 16#75 16#95  16#96 16#97 16#b0  16#bf
] vg&undef pop

% Define the base fonts which don't change.
/Undefined-UC NullEncoding       /Helvetica    vg&newbasefont pop
/MathOps-UC   UCMathOpsEncoding  /Symbol       vg&newbasefont pop
/Arrows-UC    UCArrowsEncoding   /Symbol       vg&newbasefont pop
/Dingbats-UC  UCDingbatsEncoding /ZapfDingbats vg&newbasefont pop

% Make the SansSerif composite fonts.
/SansSerif /Helvetica 16#00 vg&newcompositefont
/SansSerif-Bold /Helvetica-Bold 16#01 vg&newcompositefont
/SansSerif-Italic /Helvetica-Oblique 16#02 vg&newcompositefont
/SansSerif-BoldItalic /Helvetica-BoldOblique 16#03 vg&newcompositefont

% Make the Serif composite fonts.
/Serif /Times-Roman 16#00 vg&newcompositefont
/Serif-Bold /Times-Bold 16#01 vg&newcompositefont
/Serif-Italic /Times-Italic 16#02 vg&newcompositefont
/Serif-BoldItalic /Times-BoldItalic 16#03 vg&newcompositefont

% Make the Monospaced composite fonts.
/Monospaced /Courier 16#00 vg&newcompositefont
/Monospaced-Bold /Courier-Bold 16#01 vg&newcompositefont
/Monospaced-Italic /Courier-Oblique 16#02 vg&newcompositefont
/Monospaced-BoldItalic /Courier-BoldOblique 16#03 vg&newcompositefont

% Make the Dialog composite fonts.
/Dialog /Helvetica 16#00 vg&newcompositefont
/Dialog-Bold /Helvetica-Bold 16#01 vg&newcompositefont
/Dialog-Italic /Helvetica-Oblique 16#02 vg&newcompositefont
/Dialog-BoldItalic /Helvetica-BoldOblique 16#03 vg&newcompositefont

% Make the DialogInput composite fonts.
/DialogInput /Courier 16#00 vg&newcompositefont
/DialogInput-Bold /Courier-Bold 16#01 vg&newcompositefont
/DialogInput-Italic /Courier-Oblique 16#02 vg&newcompositefont
/DialogInput-BoldItalic /Courier-BoldOblique 16#03 vg&newcompositefont

% Make the Typewriter composite fonts (JDK 1.1 only).
/Typewriter /Courier 16#00 vg&newcompositefont
/Typewriter-Bold /Courier-Bold 16#01 vg&newcompositefont
/Typewriter-Italic /Courier-Oblique 16#02 vg&newcompositefont
/Typewriter-BoldItalic /Courier-BoldOblique 16#03 vg&newcompositefont


/cfontH {
 dup /fontsize exch def /SansSerif exch sf
 /vg&fontstyles [{cfontH} {cfontHB} {cfontHI} {cfontHBI}] def
} def
/cfontHB {
  dup /fontsize exch def /SansSerif-Bold exch sf
 /vg&fontstyles [{cfontH} {cfontHB} {cfontHI} {cfontHBI}] def
} def
/cfontHI {
 dup /fontsize exch def /SansSerif-Italic exch sf
 /vg&fontstyles [{cfontH} {cfontHB} {cfontHI} {cfontHBI}] def
} def
/cfontHBI {
 dup /fontsize exch def /SansSerif-BoldItalic exch sf
 /vg&fontstyles [{cfontH} {cfontHB} {cfontHI} {cfontHBI}] def
} def

/cfontT {
 dup /fontsize exch def /Serif exch sf
 /vg&fontstyles [{cfontT} {cfontTB} {cfontTI} {cfontTBI}] def
} def
/cfontTB {
 dup /fontsize exch def /Serif-Bold exch sf
 /vg&fontstyles [{cfontT} {cfontTB} {cfontTI} {cfontTBI}] def
} def
/cfontTI {
 dup /fontsize exch def /Serif-Italic exch sf
 /vg&fontstyles [{cfontT} {cfontTB} {cfontTI} {cfontTBI}] def
} def
/cfontTBI {
 dup /fontsize exch def /Serif-BoldItalic exch sf
 /vg&fontstyles [{cfontT} {cfontTB} {cfontTI} {cfontTBI}] def
} def

/cfontC {
 dup /fontsize exch def /Typewriter exch sf
 /vg&fontstyles [{cfontC} {cfontCB} {cfontCI} {cfontCBI}] def
} def
/cfontCB {
 dup /fontsize exch def /Typewriter-Bold exch sf
 /vg&fontstyles [{cfontC} {cfontCB} {cfontCI} {cfontCBI}] def
} def
/cfontCI {
 dup /fontsize exch def /Typewriter-Italic exch sf
 /vg&fontstyles [{cfontC} {cfontCB} {cfontCI} {cfontCBI}] def
} def
/cfontCBI {
 dup /fontsize exch def /Typewriter-BoldItalic exch sf
 /vg&fontstyles [{cfontC} {cfontCB} {cfontCI} {cfontCBI}] def
} def

% Darken or lighten the current color.
/darken {0.7 exch exp 3 copy
         q 4 -1 roll vg&C
         currentrgbcolor 3 {4 -2 roll mul} repeat
         3 array astore Q} def

/displayColorMap
<< /Cr   [1.00 0.00 0.00]       /Cg     [0.00 1.00 0.00]
   /Cb   [0.00 0.00 1.00]       /Cc     [1.00 0.00 0.00 0.00]
   /Cm   [0.00 1.00 0.00 0.00]  /Cy     [0.00 0.00 1.00 0.00]
   /Co   [1.00 0.78 0.00]       /Cp     [1.00 0.67 0.67]
   /Cw   [1   ]                 /Cgrl   [0.75]
   /Cgr  [0.50]                 /Cgrd   [0.25]
   /Ck   [0   ]
   /CGr  [1.00 0.00 0.00]       /CGg    [0.00 1.00 0.00]
   /CGb  [0.00 0.00 1.00]       /CGc    [1.00 0.00 0.00 0.00]
   /CGm  [0.00 1.00 0.00 0.00]  /CGy    [0.00 0.00 1.00 0.00]
   /CGo  [1.00 0.78 0.00]       /CGp    [1.00 0.67 0.67]
   /CGw  [1   ]                 /CGgrl  [0.75]
   /CGgr [0.50]                 /CGgrd  [0.25]
   /CGk  [0   ]
   /CIr  [1.00 0.00 0.00]       /CIg    [0.00 1.00 0.00]
   /CIb  [0.00 0.00 1.00]       /CIc    [1.00 0.00 0.00 0.00]
   /CIm  [0.00 1.00 0.00 0.00]  /CIy    [0.00 0.00 1.00 0.00]
   /CIo  [1.00 0.78 0.00]       /CIp    [1.00 0.67 0.67]
   /CIw  [1   ]                 /CIgrl  [0.75]
   /CIgr [0.50]                 /CIgrd  [0.25]
   /CIk  [0   ]
>> def

/printColorMap
<< /Cr   [1.00 0.33 0.33]       /Cg     [0.33 1.00 0.33]
   /Cb   [0.33 0.33 1.00]       /Cc     [1.00 0.00 0.00 0.00]
   /Cm   [0.00 1.00 0.00 0.00]  /Cy     [0.00 0.00 1.00 0.00]
   /Co   [1.00 0.78 0.00]       /Cp     [1.00 0.67 0.67]
   /Cw   [1   ]                 /Cgrl   [0.75]
   /Cgr  [0.50]                 /Cgrd   [0.25]
   /Ck   [0   ]
   /CGr  [1.00 0.33 0.33]       /CGg    [0.33 1.00 0.33]
   /CGb  [0.33 0.33 1.00]       /CGc    [1.00 0.00 0.00 0.00]
   /CGm  [0.00 1.00 0.00 0.00]  /CGy    [0.00 0.00 1.00 0.00]
   /CGo  [1.00 0.78 0.00]       /CGp    [1.00 0.67 0.67]
   /CGw  [1   ]                 /CGgrl  [0.75]
   /CGgr [0.50]                 /CGgrd  [0.25]
   /CGk  [0   ]
   /CIr  [1.00 0.33 0.33]       /CIg    [0.33 1.00 0.33]
   /CIb  [0.33 0.33 1.00]       /CIc    [1.00 0.00 0.00 0.00]
   /CIm  [0.00 1.00 0.00 0.00]  /CIy    [0.00 0.00 1.00 0.00]
   /CIo  [1.00 0.78 0.00]       /CIp    [1.00 0.67 0.67]
   /CIw  [1   ]                 /CIgrl  [0.75]
   /CIgr [0.50]                 /CIgrd  [0.25]
   /CIk  [0   ]
>> def

/grayColorMap
<< /Cr   [0   ]                 /Cg     [0   ]
   /Cb   [0   ]                 /Cc     [0   ]
   /Cm   [0   ]                 /Cy     [0   ]
   /Co   [0   ]                 /Cp     [0   ]
   /Cw   [0   ]                 /Cgrl   [0   ]
   /Cgr  [0   ]                 /Cgrd   [0   ]
   /Ck   [0   ]
   /CGr  [0.75]                 /CGg    [1   ]
   /CGb  [0.50]                 /CGc    [0.75]
   /CGm  [0.50]                 /CGy    [1   ]
   /CGo  [0.75]                 /CGp    [1   ]
   /CGw  [0   ]                 /CGgrl  [0.25]
   /CGgr [0.50]                 /CGgrd  [0.75]
   /CGk  [1   ]
   /CIr  [1   ]                 /CIg    [1   ]
   /CIb  [1   ]                 /CIc    [1   ]
   /CIm  [1   ]                 /CIy    [1   ]
   /CIo  [1   ]                 /CIp    [1   ]
   /CIw  [1   ]                 /CIgrl  [1   ]
   /CIgr [1   ]                 /CIgrd  [1   ]
   /CIk  [1   ]
>> def

/bwColorMap
<< /Cr   [0   ]                 /Cg     [0   ]
   /Cb   [0   ]                 /Cc     [0   ]
   /Cm   [0   ]                 /Cy     [0   ]
   /Co   [0   ]                 /Cp     [0   ]
   /Cw   [0   ]                 /Cgrl   [0   ]
   /Cgr  [0   ]                 /Cgrd   [0   ]
   /Ck   [0   ]
   /CGr  [1   ]                 /CGg    [1   ]
   /CGb  [1   ]                 /CGc    [1   ]
   /CGm  [1   ]                 /CGy    [1   ]
   /CGo  [1   ]                 /CGp    [1   ]
   /CGw  [0   ]                 /CGgrl  [1   ]
   /CGgr [1   ]                 /CGgrd  [1   ]
   /CGk  [1   ]
   /CIr  [1   ]                 /CIg    [1   ]
   /CIb  [1   ]                 /CIc    [1   ]
   /CIm  [1   ]                 /CIy    [1   ]
   /CIo  [1   ]                 /CIp    [1   ]
   /CIw  [1   ]                 /CIgrl  [1   ]
   /CIgr [1   ]                 /CIgrd  [1   ]
   /CIk  [1   ]
>> def

%
% The following routines handle the alignment of and printing of
% tagged strings.
%

% Predefine the bounding box values.
/bbllx 0 def /bblly 0 def /bburx 0 def /bbury 0 def

% This routine pops the first unicode character off of a string and returns
% the remainder of the string, the character code of first character,
% and a "true" if the string was non-zero length.
% <string>      popfirst <remaining string> <true>
% <null string> popfirst <false>
/popfirst {
  dup length 1 gt
    {dup 0 get /vg&fbyte exch def
     dup 1 get /vg&cbyte exch def
     dup length 2 sub 2 exch getinterval true}
    {pop false} ifelse
} def

% This routine shows a single unicode character given the font and
% character codes.
% <font code> <char code> unicharshow --
/unicharshow {
  2 string
  dup 0 5 -1 roll put
  dup 1 4 -1 roll put
  internalshow
} def

% This is an internal routine to alternate between determining the
% bounding box for stringsize and showing the string for recshow.
% <string> internalshow --
/internalshow {show} def

% This is an internal routine to alternate between determining the
% bounding box for stringsize and stroking various ornaments.
% <string> internalstroke --
/internalstroke {S} def

% Sets up internalshow to use the null device to determine string size.
% -- nullinternalshow --
/nullinternalshow {/internalshow {false charpath flattenpath
                                  pathbbox updatebbox} def} def

% Sets up internalstroke to use the null device to determine string size.
% -- nullinternalstroke --
/nullinternalstroke {
 /internalstroke {flattenpath pathbbox updatebbox} def} def

% This routine tests to see if the character code matches the first
% character of a string.
% <char code> <string> testchar <char code> <true or false>
/testchar {exch dup 3 -1 roll 0 get eq} def

% Raise the text baseline for superscripts.
% -- raise --
/raise {
  0 fontsize 2 div rmoveto
  /fontsize fontsize 2 mul 3 div def
  currentfont /FontName get fontsize sf
} def

% Un-raise the text baseline for superscripts.
% -- unraise --
/unraise {
  /fontsize fontsize 1.5 mul def
  0 fontsize 2 div neg rmoveto
} def

% Lower the text baseline for subscripts.
% -- lower --
/lower {
  0 fontsize 3 div neg rmoveto
  /fontsize fontsize 2 mul 3 div def
  currentfont /FontName get fontsize sf
} def

% Un-lower the text baseline for subscripts.
% -- unlower --
/unlower {
  /fontsize fontsize 1.5 mul def
  0 fontsize 3 div rmoveto
} def

% Compare the top two elements on the stack and leave only the
% larger one.
/maxval {2 copy gt {pop} {exch pop} ifelse} def

% Tokenize a string.  Do not use the usual PostScript token because
% parentheses will not be interpreted correctly because of rescanning
% of the string.
/vg&token {/vg&string exch def /vg&index -1 def /vg&level 0 def
0 2 vg&string length 2 sub {
  dup dup 1 add exch vg&string exch get 8 bitshift vg&string 3 -1 roll get or
  dup 16#f0fe eq {pop 1}{16#f0ff eq {-1}{0} ifelse} ifelse
  /vg&level exch vg&level add def
  vg&level 0 eq {/vg&index exch def exit} if pop
} for
vg&index 0 ge {
  vg&string vg&index 2 add dup vg&string length exch sub getinterval
  vg&index 2 gt {vg&string 2 vg&index 2 sub getinterval}{()} ifelse
  true}
{false} ifelse
} bind def

% Recursively show an unicode string.
% <string> recshow --
/recshow {
  popfirst
  {
    % Test to see if this is a string attribute.
    vg&fbyte 16#f0 and 16#e0 eq
    {
      q

      % Font style.
      currentfont dup /FontStyleBits known {/FontStyleBits get}{pop 0} ifelse
      vg&cbyte or vg&fontstyles exch get fontsize exch exec

      vg&token pop recshow currentpoint Q m recshow
    }
    {
      vg&fbyte 16#F8 and 16#F0 eq {

        % Superscript and/or subscript.
        vg&cbyte 16#00 eq {
          vg&token pop exch vg&token pop 3 -1 roll
          q raise recshow unraise currentpoint pop Q exch
          q lower recshow unlower currentpoint pop Q
          maxval currentpoint exch pop m recshow } if

        % Strikeout.
        vg&cbyte 16#01 eq {
          vg&token pop currentpoint 3 -1 roll recshow
          q 0 J vg&underline vg&uthick w
          currentpoint 4 -2 roll fontsize 3 div add moveto
          fontsize 3 div add lineto internalstroke Q
          recshow} if

        % Underline.
        vg&cbyte 16#02 eq {
          vg&token pop currentpoint 3 -1 roll recshow
          q 0 J vg&underline vg&uthick w
          currentpoint 4 -2 roll vg&uoffset add moveto
          vg&uoffset add lineto internalstroke Q
          recshow} if

        % Dashed underline.
        vg&cbyte 16#03 eq {
          vg&token pop currentpoint 3 -1 roll recshow
          q 0 J [ vg&uthick 5 mul vg&uthick 2 mul] 0 d
          vg&underline vg&uthick w
          currentpoint 4 -2 roll vg&uoffset add moveto
          vg&uoffset add lineto internalstroke Q
          recshow} if

        % Dotted underline.
        vg&cbyte 16#04 eq {
          vg&token pop currentpoint 3 -1 roll recshow
          q 1 J [ 0 vg&uthick 3 mul] 0 d
          vg&underline vg&uthick w
          currentpoint 4 -2 roll vg&uoffset add moveto
          vg&uoffset add lineto internalstroke Q
          recshow} if

        % Thick underline.
        vg&cbyte 16#05 eq {
          vg&token pop currentpoint 3 -1 roll recshow
          q 0 J vg&underline vg&uthick 2 mul w
          currentpoint 4 -2 roll vg&uoffset vg&uthick 2 div sub add moveto
          vg&uoffset vg&uthick 2 div sub add lineto internalstroke Q
          recshow} if

        % Gray thick underline.
        vg&cbyte 16#06 eq {
          vg&token pop currentpoint 3 -1 roll recshow
          q 0 J vg&underline vg&uthick 2 mul w 0.5 setgray
          currentpoint 4 -2 roll vg&uoffset vg&uthick 2 div sub add moveto
          vg&uoffset vg&uthick 2 div sub add lineto internalstroke Q
          recshow} if

        % Overbar.
        vg&cbyte 16#07 eq {
          vg&token pop dup stringsize relative 4 1 roll pop pop exch
          3 -1 roll recshow
          q 0 J vg&underline vg&uthick w
          vg&uoffset neg add dup currentpoint pop exch m l internalstroke Q
          recshow} if
      }
      {
        vg&fbyte vg&cbyte unicharshow recshow
      } ifelse
    } ifelse
  } if
} def

% Get the underline position and thickness from the current font.
/vg&underline {

currentfont dup /FontType get 0 eq {/FDepVector get 0 get} if
dup dup /FontInfo known {
  /FontInfo get dup
  dup /UnderlinePosition known {
    /UnderlinePosition get /vg&uoffset exch def
  }
  {
    pop /vg&uoffset 0 def
  } ifelse
  dup /UnderlineThickness known {
    /UnderlineThickness get /vg&uthick exch def
  }
  {
    pop /vg&uthick 0 def
  } ifelse
}
{
  pop /vg&uoffset 0 def /vg&uthick 0 def
} ifelse
/FontMatrix get
currentfont dup /FontType get 0 eq
{/FontMatrix get matrix concatmatrix}{pop} ifelse
dup 0 vg&uoffset 3 -1 roll transform /vg&uoffset exch def pop
0 vg&uthick 3 -1 roll transform /vg&uthick exch def pop
} def

% Make a frame with the coordinates on the stack.
% <llx> <lly> <urx> <ury> frame --
/frame {4 copy m 3 1 roll exch l 4 -2 roll l l h} def

% Resets the accumulated bounding box to a degenerate box at the
% current point.
% -- resetbbox --
/resetbbox {
  currentpoint 2 copy
  /bbury exch def
  /bburx exch def
  /bblly exch def
  /bbllx exch def
} def

% Update the accumulated bounding box.
% <llx'> <lly'> <urx'> <ury'> updatebbox --
/updatebbox {
  dup bbury gt {/bbury exch def} {pop} ifelse
  dup bburx gt {/bburx exch def} {pop} ifelse
  dup bblly lt {/bblly exch def} {pop} ifelse
  dup bbllx lt {/bbllx exch def} {pop} ifelse
} def

% Set the bounding box to the values on the stack.
% <llx'> <lly'> <urx'> <ury'> updatebbox --
/restorebbox {
  /bbury exch def /bburx exch def /bblly exch def /bbllx exch def
} def

% Push the accumulated bounding box onto the stack.
% -- pushbbox <llx> <lly> <urx> <ury>
/pushbbox {bbllx bblly bburx bbury} def

% Make the relative bounding box relative to the currentpoint.
% <llx'> <lly'> <urx'> <ury'> inflate <llx> <lly> <urx> <ury>
/inflate {
  2 {fontsize 0.2 mul add 4 1 roll} repeat
  2 {fontsize 0.2 mul sub 4 1 roll} repeat
} def

% Make the relative bounding box relative to the currentpoint.
% <llx'> <lly'> <urx'> <ury'> relative <llx> <lly> <urx> <ury>
/relative {
  currentpoint 3 -1 roll add 3 1 roll add exch 4 2 roll
  currentpoint 3 -1 roll add 3 1 roll add exch 4 2 roll
} def

% Returns the size of a string appropriate for recshow.
% <string> stringsize <llx> <lly> <urx> <ury>
/stringsize {
  pushbbox /internalshow load /internalstroke load 7 -1 roll
  q
  nulldevice 0 0 m
  nullinternalshow nullinternalstroke
  resetbbox
  recshow
  /internalstroke exch def /internalshow exch def
  pushbbox 8 -4 roll restorebbox
  Q
} def

% Calculate values for string positioning.
/calcval {4 copy
  3 -1 roll sub /widy exch def sub neg /widx exch def
  pop pop /dy exch def /dx exch def} def

% Utilities to position a string.
% First letter (U=upper, C=center, B=baseline, L=lower)
% Second letter (L=left, C=center, R=right)
/align [
{calcval dx neg widy dy add neg rmoveto} % UL
{calcval dx neg widy 2 div dy add neg rmoveto} % CL
{calcval dx neg 0 rmoveto} % BL
{calcval dx neg dy neg rmoveto} % LL
{calcval widx dx add neg widy dy add neg rmoveto} % UR
{calcval widx dx add neg widy 2 div dy add neg rmoveto} % CR
{calcval widx dx add neg 0 rmoveto} % BR
{calcval widx dx add neg dy neg rmoveto} % LR
{calcval widx 2 div dx add neg widy dy add neg rmoveto} % UC
{calcval widx 2 div dx add neg widy 2 div dy add neg rmoveto} % CC
{calcval widx 2 div dx add neg 0 rmoveto} % BC
{calcval widx 2 div dx add neg dy neg rmoveto} % LC
] def

/vg&str {m q 1 -1 scale dup stringsize 4 copy align 11 -1 roll get exec
         q inflate relative frame exch exec Q recshow Q} def

end /procDict exch def
%%EndProlog

%%BeginSetup
save
procDict begin
printColorMap begin
963 797 setpagesize
0 0 0 0 setmargins
0 0 setorigin
963 797 setsize
naturalsize
portrait
imagescale
cliptobounds
setbasematrix
/Helvetica 10 sf
defaultGraphicsState
%%EndSetup

0.00000 0.00000 0.00000 RG
[ 1.00000 0.00000 0.00000 1.00000 0.00000 0.00000 ] defaultmatrix matrix concatmatrix setmatrix
cliprestore
1.00000 1.00000 1.00000 RG
newpath
0.00000 0.00000 m
963.000 0.00000 l
963.000 797.000 l
0.00000 797.000 l
0.00000 0.00000 l
h
f
0.00000 0.00000 0.00000 RG
0.00000 0.00000 0.00000 RG
[ 1.00000 0.00000 0.00000 1.00000 0.00000 0.00000 ] defaultmatrix matrix concatmatrix setmatrix
cliprestore
1.00000 1.00000 1.00000 RG
newpath
0.00000 0.00000 m
963.000 0.00000 l
963.000 797.000 l
0.00000 797.000 l
0.00000 0.00000 l
h
f
0.00000 0.00000 0.00000 RG
0 0 963 797 rc
q
[ 1.00000 0.00000 0.00000 1.00000 0.00000 0.00000 ] concat
[ 1.00000 0.00000 0.00000 1.00000 -64.0000 179.000 ] concat
1.00000 1.00000 1.00000 RG
newpath
64.0000 -179.000 m
1027.00 -179.000 l
1027.00 618.000 l
64.0000 618.000 l
64.0000 -179.000 l
h
f
0.00000 0.00000 0.00000 RG
[ 1.00000 0.00000 0.00000 1.00000 -64.0000 179.000 ] defaultmatrix matrix concatmatrix setmatrix
[ 1.00000 0.00000 0.00000 1.00000 -64.0000 179.000 ] defaultmatrix matrix concatmatrix setmatrix
[ 1.00000 0.00000 0.00000 1.00000 0.00000 0.00000 ] defaultmatrix matrix concatmatrix setmatrix
[ 1.00000 0.00000 0.00000 1.00000 -64.0000 179.000 ] defaultmatrix matrix concatmatrix setmatrix
1.00000 1.00000 1.00000 RG
newpath
211.427 -123.920 m
211.427 -104.775 193.659 -89.2544 171.740 -89.2544  c
149.822 -89.2544 132.054 -104.775 132.054 -123.920  c
132.054 -143.065 149.822 -158.585 171.740 -158.585  c
193.659 -158.585 211.427 -143.065 211.427 -123.920  c
h
f
0 J
1.45000 M
0.00000 0.00000 0.00000 RG
newpath
211.427 -123.920 m
211.427 -104.775 193.659 -89.2544 171.740 -89.2544  c
149.822 -89.2544 132.054 -104.775 132.054 -123.920  c
132.054 -143.065 149.822 -158.585 171.740 -158.585  c
193.659 -158.585 211.427 -143.065 211.427 -123.920  c
h
S
2 J
10.0000 M
0 J
1.45000 M
q
[ 1.00000 0.00000 0.00000 -1.00000 144.723 -119.206 ] concat
0.00000 0.00000 moveto
/Helvetica findfont 12 scalefont setfont 10.0000 cfontH
(\000c\000o\000d\000e\000i\000n\000s\000t\000a\000l) recshow
Q
2 J
10.0000 M
2.00000 w
0 J
1.45000 M
newpath
312.630 -28.0693 m
357.536 -48.3758 l
421.042 -48.3758 l
465.947 -28.0693 l
465.947 .648248 l
421.042 20.9547 l
357.536 20.9547 l
312.630 .648248 l
h
S
1.00000 w
2 J
10.0000 M
0 J
1.45000 M
q
[ 1.00000 0.00000 0.00000 1.00000 331.000 -32.0000 ] concat
0 0 116 38 rc
q
q
q
Q
q
Q
q
Q
q
Q
q
[ 1.00000 0.00000 0.00000 -1.00000 0.00000 11.0000 ] concat
0.00000 0.00000 moveto
/Arial findfont 12 scalefont setfont 10.0000 cfontH
(\000c\000o\000d\000e\000d\000i\000s\000r\000a\000c) recshow
Q
q
[ 1.00000 0.00000 0.00000 -1.00000 61.0000 16.0000 ] concat
0.00000 0.00000 moveto
/Arial findfont 10 scalefont setfont 8.33333 cfontH
(\000P\000 ) recshow
Q
q
[ 1.00000 0.00000 0.00000 -1.00000 71.0000 11.0000 ] concat
0.00000 0.00000 moveto
/Arial findfont 12 scalefont setfont 10.0000 cfontH
(\000=\000 \0001\000 \000A\000N\000D) recshow
Q
q
[ 1.00000 0.00000 0.00000 -1.00000 116.000 11.0000 ] concat
0.00000 0.00000 moveto
/Arial findfont 12 scalefont setfont 10.0000 cfontH
(\000 ) recshow
Q
q
[ 1.00000 0.00000 0.00000 -1.00000 0.00000 30.0000 ] concat
0.00000 0.00000 moveto
/Arial findfont 12 scalefont setfont 10.0000 cfontH
(\000c\000o\000d\000e\000m\000o\000n\000o\000c\000o\000t) recshow
Q
q
[ 1.00000 0.00000 0.00000 -1.00000 75.0000 35.0000 ] concat
0.00000 0.00000 moveto
/Arial findfont 10 scalefont setfont 8.33333 cfontH
(\000P\000 ) recshow
Q
q
[ 1.00000 0.00000 0.00000 -1.00000 85.0000 30.0000 ] concat
0.00000 0.00000 moveto
/Arial findfont 12 scalefont setfont 10.0000 cfontH
(\000=\000 \0001) recshow
Q
Q
Q
Q
2 J
10.0000 M
1.00000 1.00000 1.00000 RG
newpath
623.769 256.066 m
623.769 283.680 578.998 306.066 523.769 306.066  c
468.541 306.066 423.769 283.680 423.769 256.066  c
423.769 228.451 468.541 206.066 523.769 206.066  c
578.998 206.066 623.769 228.451 623.769 256.066  c
h
f
0 J
1.45000 M
0.00000 0.00000 0.00000 RG
newpath
623.769 256.066 m
623.769 283.680 578.998 306.066 523.769 306.066  c
468.541 306.066 423.769 283.680 423.769 256.066  c
423.769 228.451 468.541 206.066 523.769 206.066  c
578.998 206.066 623.769 228.451 623.769 256.066  c
h
S
2 J
10.0000 M
0 J
1.45000 M
q
[ 1.00000 0.00000 0.00000 -1.00000 495.950 244.414 ] concat
0.00000 0.00000 moveto
/Helvetica findfont 14 scalefont setfont 11.6667 cfontH
(\000D\000e\000l\000t\000a\000z\000 \000=\000 ) recshow
Q
q
[ 1.00000 0.00000 0.00000 -1.00000 452.200 261.565 ] concat
0.00000 0.00000 moveto
/Helvetica findfont 14 scalefont setfont 11.6667 cfontH
(\000f\000\050\000t\000h\000e\000r\000m\000a\000l\000 \000t\000i\000m\000e\000,\000 \000c\000r\000o\000i\000r\000a\000c\000,\000 ) recshow
Q
q
[ 1.00000 0.00000 0.00000 -1.00000 459.197 278.717 ] concat
0.00000 0.00000 moveto
/Helvetica findfont 14 scalefont setfont 11.6667 cfontH
(\000H\000u\000m\000i\000r\000a\000c\000,\000 \000i\000z\000r\000a\000c\000,\000 \000e\000f\000d\000a\000\051) recshow
Q
2 J
10.0000 M
1.00000 1.00000 1.00000 RG
newpath
437.696 386.528 m
609.842 386.528 l
609.842 444.980 l
437.696 444.980 l
437.696 386.528 l
h
f
2.00000 w
0 J
1.45000 M
0.00000 0.00000 0.00000 RG
newpath
437.696 386.528 m
609.842 386.528 l
609.842 444.980 l
437.696 444.980 l
437.696 386.528 l
h
S
1.00000 w
2 J
10.0000 M
0 J
1.45000 M
q
[ 1.00000 0.00000 0.00000 -1.00000 444.790 412.787 ] concat
0.00000 0.00000 moveto
/Arial findfont 14 scalefont setfont 11.6667 cfontH
(\000V\000e\000r\000t\000i\000c\000a\000l\000 \000r\000o\000o\000t\000 \000g\000r\000o\000w\000t\000h\000 \000s\000t\000o\000p\000s) recshow
Q
q
[ 1.00000 0.00000 0.00000 -1.00000 482.723 428.428 ] concat
0.00000 0.00000 moveto
/Arial findfont 14 scalefont setfont 11.6667 cfontH
(\000 \000\050\000d\000e\000l\000t\000a\000z\000 \000=\000 \0000\000\051\000 \000 ) recshow
Q
2 J
10.0000 M
1.00000 1.00000 1.00000 RG
newpath
407.891 556.837 m
407.891 582.242 369.836 602.837 322.891 602.837  c
275.947 602.837 237.891 582.242 237.891 556.837  c
237.891 531.432 275.947 510.837 322.891 510.837  c
369.836 510.837 407.891 531.432 407.891 556.837  c
h
f
0 J
1.45000 M
0.00000 0.00000 0.00000 RG
newpath
407.891 556.837 m
407.891 582.242 369.836 602.837 322.891 602.837  c
275.947 602.837 237.891 582.242 237.891 556.837  c
237.891 531.432 275.947 510.837 322.891 510.837  c
369.836 510.837 407.891 531.432 407.891 556.837  c
h
S
2 J
10.0000 M
0 J
1.45000 M
q
[ 1.00000 0.00000 0.00000 1.00000 269.000 545.000 ] concat
0 0 106 22 rc
q
q
q
Q
q
Q
q
Q
q
Q
q
[ 1.00000 0.00000 0.00000 -1.00000 0.00000 12.0000 ] concat
0.00000 0.00000 moveto
/Helvetica findfont 12 scalefont setfont 10.0000 cfontH
(\000I\000F\000 \000z\000r\000a\000c\000 \000=\000 \000o\000b\000s\000t\000a\000r\000a\000c) recshow
Q
q
[ 1.00000 0.00000 0.00000 -1.00000 96.0000 18.0000 ] concat
0.00000 0.00000 moveto
/Helvetica findfont 10 scalefont setfont 8.33333 cfontH
(\000S\000 ) recshow
Q
Q
Q
Q
2 J
10.0000 M
2.00000 w
0 J
1.45000 M
newpath
324.594 -139.531 m
363.663 -163.024 l
418.915 -163.024 l
457.984 -139.531 l
457.984 -106.308 l
418.915 -82.8151 l
363.663 -82.8151 l
324.594 -106.308 l
h
S
1.00000 w
2 J
10.0000 M
0 J
1.45000 M
q
[ 1.00000 0.00000 0.00000 1.00000 359.000 -132.000 ] concat
0 0 63 19 rc
q
q
q
Q
q
Q
q
Q
q
Q
q
[ 1.00000 0.00000 0.00000 -1.00000 0.00000 11.0000 ] concat
0.00000 0.00000 moveto
/Arial findfont 12 scalefont setfont 10.0000 cfontH
(\000c\000o\000d\000e\000h\000y\000p\000o) recshow
Q
q
[ 1.00000 0.00000 0.00000 -1.00000 53.0000 16.0000 ] concat
0.00000 0.00000 moveto
/Arial findfont 10 scalefont setfont 8.33333 cfontH
(\000P\000 ) recshow
Q
Q
Q
Q
2 J
10.0000 M
1.00000 1.00000 1.00000 RG
newpath
813.979 556.837 m
813.979 582.242 775.923 602.837 728.979 602.837  c
682.034 602.837 643.979 582.242 643.979 556.837  c
643.979 531.432 682.034 510.837 728.979 510.837  c
775.923 510.837 813.979 531.432 813.979 556.837  c
h
f
0 J
1.45000 M
0.00000 0.00000 0.00000 RG
newpath
813.979 556.837 m
813.979 582.242 775.923 602.837 728.979 602.837  c
682.034 602.837 643.979 582.242 643.979 556.837  c
643.979 531.432 682.034 510.837 728.979 510.837  c
775.923 510.837 813.979 531.432 813.979 556.837  c
h
S
2 J
10.0000 M
0 J
1.45000 M
q
[ 1.00000 0.00000 0.00000 1.00000 661.000 545.000 ] concat
0 0 135 22 rc
q
q
q
Q
q
Q
q
Q
q
Q
q
[ 1.00000 0.00000 0.00000 -1.00000 0.00000 12.0000 ] concat
0.00000 0.00000 moveto
/Helvetica findfont 12 scalefont setfont 10.0000 cfontH
(\000I\000F\000 \000c\000r\000o\000p\000 \000s\000t\000a\000g\000e\000 \000=\000 \000s\000t\000o\000p\000r\000a\000c) recshow
Q
q
[ 1.00000 0.00000 0.00000 -1.00000 125.000 18.0000 ] concat
0.00000 0.00000 moveto
/Helvetica findfont 10 scalefont setfont 8.33333 cfontH
(\000P\000 ) recshow
Q
Q
Q
Q
2 J
10.0000 M
2.00000 w
0 J
1.45000 M
newpath
533.020 -131.639 m
577.925 -158.585 l
641.431 -158.585 l
686.337 -131.639 l
686.337 -93.5310 l
641.431 -66.5848 l
577.925 -66.5848 l
533.020 -93.5310 l
h
S
1.00000 w
2 J
10.0000 M
0 J
1.45000 M
q
[ 1.00000 0.00000 0.00000 1.00000 551.000 -131.000 ] concat
0 0 116 38 rc
q
q
q
Q
q
Q
q
Q
q
Q
q
[ 1.00000 0.00000 0.00000 -1.00000 0.00000 11.0000 ] concat
0.00000 0.00000 moveto
/Arial findfont 12 scalefont setfont 10.0000 cfontH
(\000c\000o\000d\000e\000d\000i\000s\000r\000a\000c) recshow
Q
q
[ 1.00000 0.00000 0.00000 -1.00000 61.0000 16.0000 ] concat
0.00000 0.00000 moveto
/Arial findfont 10 scalefont setfont 8.33333 cfontH
(\000P\000 ) recshow
Q
q
[ 1.00000 0.00000 0.00000 -1.00000 71.0000 11.0000 ] concat
0.00000 0.00000 moveto
/Arial findfont 12 scalefont setfont 10.0000 cfontH
(\000=\000 \0001\000 \000A\000N\000D) recshow
Q
q
[ 1.00000 0.00000 0.00000 -1.00000 116.000 11.0000 ] concat
0.00000 0.00000 moveto
/Arial findfont 12 scalefont setfont 10.0000 cfontH
(\000 ) recshow
Q
q
[ 1.00000 0.00000 0.00000 -1.00000 0.00000 30.0000 ] concat
0.00000 0.00000 moveto
/Arial findfont 12 scalefont setfont 10.0000 cfontH
(\000c\000o\000d\000e\000m\000o\000n\000o\000c\000o\000t) recshow
Q
q
[ 1.00000 0.00000 0.00000 -1.00000 75.0000 35.0000 ] concat
0.00000 0.00000 moveto
/Arial findfont 10 scalefont setfont 8.33333 cfontH
(\000P\000 ) recshow
Q
q
[ 1.00000 0.00000 0.00000 -1.00000 85.0000 30.0000 ] concat
0.00000 0.00000 moveto
/Arial findfont 12 scalefont setfont 10.0000 cfontH
(\000=\000 \0001) recshow
Q
Q
Q
Q
2 J
10.0000 M
2.00000 w
0 J
1.45000 M
newpath
702.671 -28.0693 m
741.741 -48.3758 l
796.993 -48.3758 l
836.062 -28.0693 l
836.062 .648248 l
796.993 20.9547 l
741.741 20.9547 l
702.671 .648248 l
h
S
1.00000 w
2 J
10.0000 M
0 J
1.45000 M
q
[ 1.00000 0.00000 0.00000 1.00000 727.000 -23.0000 ] concat
0 0 83 19 rc
q
q
q
Q
q
Q
q
Q
q
Q
q
[ 1.00000 0.00000 0.00000 -1.00000 0.00000 11.0000 ] concat
0.00000 0.00000 moveto
/Arial findfont 12 scalefont setfont 10.0000 cfontH
(\000c\000o\000d\000e\000p\000e\000r\000e\000n\000n\000e) recshow
Q
q
[ 1.00000 0.00000 0.00000 -1.00000 73.0000 16.0000 ] concat
0.00000 0.00000 moveto
/Arial findfont 10 scalefont setfont 8.33333 cfontH
(\000P\000 ) recshow
Q
Q
Q
Q
2 J
10.0000 M
2.00000 w
0 J
1.45000 M
newpath
866.062 -28.0693 m
902.490 -48.3758 l
954.006 -48.3758 l
990.434 -28.0693 l
990.434 .648248 l
954.006 20.9547 l
902.490 20.9547 l
866.062 .648248 l
h
S
1.00000 w
2 J
10.0000 M
0 J
1.45000 M
q
[ 1.00000 0.00000 0.00000 1.00000 890.000 -23.0000 ] concat
0 0 76 19 rc
q
q
q
Q
q
Q
q
Q
q
Q
q
[ 1.00000 0.00000 0.00000 -1.00000 0.00000 11.0000 ] concat
0.00000 0.00000 moveto
/Arial findfont 12 scalefont setfont 10.0000 cfontH
(\000c\000o\000d\000e\000g\000e\000r\000m\000i\000n) recshow
Q
q
[ 1.00000 0.00000 0.00000 -1.00000 66.0000 16.0000 ] concat
0.00000 0.00000 moveto
/Arial findfont 10 scalefont setfont 8.33333 cfontH
(\000P\000 ) recshow
Q
Q
Q
Q
2 J
10.0000 M
1.00000 1.00000 1.00000 RG
newpath
630.291 556.837 m
630.291 582.242 582.599 602.837 523.769 602.837  c
464.939 602.837 417.247 582.242 417.247 556.837  c
417.247 531.432 464.939 510.837 523.769 510.837  c
582.599 510.837 630.291 531.432 630.291 556.837  c
h
f
0 J
1.45000 M
0.00000 0.00000 0.00000 RG
newpath
630.291 556.837 m
630.291 582.242 582.599 602.837 523.769 602.837  c
464.939 602.837 417.247 582.242 417.247 556.837  c
417.247 531.432 464.939 510.837 523.769 510.837  c
582.599 510.837 630.291 531.432 630.291 556.837  c
h
S
2 J
10.0000 M
0 J
1.45000 M
q
[ 1.00000 0.00000 0.00000 1.00000 445.000 526.000 ] concat
0 0 156 60 rc
q
q
q
Q
q
Q
q
Q
q
Q
q
[ 1.00000 0.00000 0.00000 -1.00000 0.00000 12.0000 ] concat
0.00000 0.00000 moveto
/Helvetica findfont 12 scalefont setfont 10.0000 cfontH
(\000I\000F\000 \000c\000o\000d\000e\000p\000e\000r\000e\000n\000n\000e) recshow
Q
q
[ 1.00000 0.00000 0.00000 -1.00000 86.0000 18.0000 ] concat
0.00000 0.00000 moveto
/Helvetica findfont 10 scalefont setfont 8.33333 cfontH
(\000P\000 ) recshow
Q
q
[ 1.00000 0.00000 0.00000 -1.00000 96.0000 12.0000 ] concat
0.00000 0.00000 moveto
/Helvetica findfont 12 scalefont setfont 10.0000 cfontH
(\000=\000 \0002\000 \000A\000N\000D) recshow
Q
q
[ 1.00000 0.00000 0.00000 -1.00000 141.000 12.0000 ] concat
0.00000 0.00000 moveto
/Helvetica findfont 12 scalefont setfont 10.0000 cfontH
(\000 ) recshow
Q
q
[ 1.00000 0.00000 0.00000 -1.00000 0.00000 34.0000 ] concat
0.00000 0.00000 moveto
/Helvetica findfont 12 scalefont setfont 10.0000 cfontH
(\000c\000o\000d\000e\000_\000a\000c\000t\000i\000_\000r\000e\000s\000e\000r\000v\000e) recshow
Q
q
[ 1.00000 0.00000 0.00000 -1.00000 101.000 40.0000 ] concat
0.00000 0.00000 moveto
/Helvetica findfont 10 scalefont setfont 8.33333 cfontH
(\000P\000 ) recshow
Q
q
[ 1.00000 0.00000 0.00000 -1.00000 111.000 34.0000 ] concat
0.00000 0.00000 moveto
/Helvetica findfont 12 scalefont setfont 10.0000 cfontH
(\000=\000 \0001\000 \000A\000N\000D) recshow
Q
q
[ 1.00000 0.00000 0.00000 -1.00000 156.000 34.0000 ] concat
0.00000 0.00000 moveto
/Helvetica findfont 12 scalefont setfont 10.0000 cfontH
(\000 ) recshow
Q
q
[ 1.00000 0.00000 0.00000 -1.00000 0.00000 57.0000 ] concat
0.00000 0.00000 moveto
/Helvetica findfont 12 scalefont setfont 10.0000 cfontH
(\000d\000a\000y\000 \000=\000 \000\050\000d\000a\000t\000e\000 \000o\000f\000 \000L\000A\000I\000 \000=\000 \0000\000\051) recshow
Q
Q
Q
Q
2 J
10.0000 M
1.00000 1.00000 1.00000 RG
newpath
253.367 100.657 m
377.740 100.657 l
377.740 160.853 l
253.367 160.853 l
253.367 100.657 l
h
f
2.00000 w
0 J
1.45000 M
0.00000 0.00000 0.00000 RG
newpath
253.367 100.657 m
377.740 100.657 l
377.740 160.853 l
253.367 160.853 l
253.367 100.657 l
h
S
1.00000 w
2 J
10.0000 M
0 J
1.45000 M
q
[ 1.00000 0.00000 0.00000 -1.00000 267.864 121.509 ] concat
0.00000 0.00000 moveto
/Arial findfont 12 scalefont setfont 10.0000 cfontH
(\000R\000o\000o\000t\000 \000f\000r\000o\000n\000t\000 \000g\000r\000o\000w\000t\000h\000 ) recshow
Q
q
[ 1.00000 0.00000 0.00000 -1.00000 285.542 134.915 ] concat
0.00000 0.00000 moveto
/Arial findfont 12 scalefont setfont 10.0000 cfontH
(\000o\000n\000s\000e\000t\000 \000f\000r\000o\000m\000 ) recshow
Q
q
[ 1.00000 0.00000 0.00000 -1.00000 271.857 148.321 ] concat
0.00000 0.00000 moveto
/Arial findfont 12 scalefont setfont 10.0000 cfontH
(\000d\000e\000p\000t\000h\000 \000o\000f\000 \000s\000o\000w\000i\000n\000g\000 ) recshow
Q
2 J
10.0000 M
1.00000 1.00000 1.00000 RG
newpath
79.1839 99.6297 m
217.897 99.6297 l
217.897 159.593 l
79.1839 159.593 l
79.1839 99.6297 l
h
f
2.00000 w
0 J
1.45000 M
0.00000 0.00000 0.00000 RG
newpath
79.1839 99.6297 m
217.897 99.6297 l
217.897 159.593 l
79.1839 159.593 l
79.1839 99.6297 l
h
S
1.00000 w
2 J
10.0000 M
0 J
1.45000 M
q
[ 1.00000 0.00000 0.00000 -1.00000 96.5120 120.365 ] concat
0.00000 0.00000 moveto
/Arial findfont 12 scalefont setfont 10.0000 cfontH
(\000R\000o\000o\000t\000 \000g\000r\000o\000w\000t\000h\000 \000o\000n\000s\000e\000t\000 \000 ) recshow
Q
q
[ 1.00000 0.00000 0.00000 -1.00000 105.190 133.772 ] concat
0.00000 0.00000 moveto
/Arial findfont 12 scalefont setfont 10.0000 cfontH
(\000f\000r\000o\000m\000 \000i\000n\000i\000t\000i\000a\000l\000 \000v\000a\000l\000u\000e) recshow
Q
q
[ 1.00000 0.00000 0.00000 -1.00000 90.8460 147.178 ] concat
0.00000 0.00000 moveto
/Arial findfont 12 scalefont setfont 10.0000 cfontH
(\000\050\000s\000e\000e\000 \000i\000n\000i\000t\000i\000a\000l\000 \000c\000o\000n\000d\000i\000t\000i\000o\000n\000s\000\051) recshow
Q
2 J
10.0000 M
1.00000 1.00000 1.00000 RG
newpath
398.162 99.0811 m
525.558 99.0811 l
525.558 157.766 l
398.162 157.766 l
398.162 99.0811 l
h
f
2.00000 w
0 J
1.45000 M
0.00000 0.00000 0.00000 RG
newpath
398.162 99.0811 m
525.558 99.0811 l
525.558 157.766 l
398.162 157.766 l
398.162 99.0811 l
h
S
1.00000 w
2 J
10.0000 M
0 J
1.45000 M
q
[ 1.00000 0.00000 0.00000 -1.00000 411.499 119.178 ] concat
0.00000 0.00000 moveto
/Arial findfont 12 scalefont setfont 10.0000 cfontH
(\000R\000o\000o\000t\000 \000g\000r\000o\000w\000t\000h\000 \000o\000n\000s\000e\000t\000 ) recshow
Q
q
[ 1.00000 0.00000 0.00000 -1.00000 422.839 132.584 ] concat
0.00000 0.00000 moveto
/Arial findfont 12 scalefont setfont 10.0000 cfontH
(\000b\000e\000t\000w\000e\000e\000n\000 \0001\000 \000c\000m\000 ) recshow
Q
q
[ 1.00000 0.00000 0.00000 -1.00000 408.153 145.990 ] concat
0.00000 0.00000 moveto
/Arial findfont 12 scalefont setfont 10.0000 cfontH
(\000a\000n\000d\000 \000d\000e\000p\000t\000h\000 \000o\000f\000 \000s\000o\000w\000i\000n\000g) recshow
Q
2 J
10.0000 M
1.00000 1.00000 1.00000 RG
newpath
703.376 99.4887 m
836.062 99.4887 l
836.062 155.150 l
703.376 155.150 l
703.376 99.4887 l
h
f
2.00000 w
0 J
1.45000 M
0.00000 0.00000 0.00000 RG
newpath
703.376 99.4887 m
836.062 99.4887 l
836.062 155.150 l
703.376 155.150 l
703.376 99.4887 l
h
S
1.00000 w
2 J
10.0000 M
0 J
1.45000 M
q
[ 1.00000 0.00000 0.00000 1.00000 706.000 110.000 ] concat
0 0 127 33 rc
q
q
q
Q
q
Q
q
Q
q
Q
q
[ 1.00000 0.00000 0.00000 -1.00000 0.00000 11.0000 ] concat
0.00000 0.00000 moveto
/Arial findfont 12 scalefont setfont 10.0000 cfontH
(\000R\000o\000o\000t\000 \000f\000r\000o\000n\000t\000 \000g\000r\000o\000w\000t\000h\000 \000o\000n\000s\000e\000t) recshow
Q
q
[ 1.00000 0.00000 0.00000 -1.00000 127.000 11.0000 ] concat
0.00000 0.00000 moveto
/Arial findfont 12 scalefont setfont 10.0000 cfontH
(\000 ) recshow
Q
q
[ 1.00000 0.00000 0.00000 -1.00000 0.00000 25.0000 ] concat
0.00000 0.00000 moveto
/Arial findfont 12 scalefont setfont 10.0000 cfontH
(\000f\000r\000o\000m\000 \000\050\000z\000r\000a\000c\0000) recshow
Q
q
[ 1.00000 0.00000 0.00000 -1.00000 61.0000 30.0000 ] concat
0.00000 0.00000 moveto
/Arial findfont 10 scalefont setfont 8.33333 cfontH
(\000I\000 ) recshow
Q
q
[ 1.00000 0.00000 0.00000 -1.00000 67.0000 25.0000 ] concat
0.00000 0.00000 moveto
/Arial findfont 12 scalefont setfont 10.0000 cfontH
(\000\051) recshow
Q
Q
Q
Q
2 J
10.0000 M
1.00000 1.00000 1.00000 RG
newpath
545.980 97.7569 m
673.376 97.7569 l
673.376 156.442 l
545.980 156.442 l
545.980 97.7569 l
h
f
2.00000 w
0 J
1.45000 M
0.00000 0.00000 0.00000 RG
newpath
545.980 97.7569 m
673.376 97.7569 l
673.376 156.442 l
545.980 156.442 l
545.980 97.7569 l
h
S
1.00000 w
2 J
10.0000 M
0 J
1.45000 M
q
[ 1.00000 0.00000 0.00000 -1.00000 559.317 117.853 ] concat
0.00000 0.00000 moveto
/Arial findfont 12 scalefont setfont 10.0000 cfontH
(\000R\000o\000o\000t\000 \000g\000r\000o\000w\000t\000h\000 \000o\000n\000s\000e\000t\000 ) recshow
Q
q
[ 1.00000 0.00000 0.00000 -1.00000 570.658 131.260 ] concat
0.00000 0.00000 moveto
/Arial findfont 12 scalefont setfont 10.0000 cfontH
(\000b\000e\000t\000w\000e\000e\000n\000 \0001\000 \000c\000m\000 ) recshow
Q
q
[ 1.00000 0.00000 0.00000 -1.00000 553.630 144.666 ] concat
0.00000 0.00000 moveto
/Arial findfont 12 scalefont setfont 10.0000 cfontH
(\000a\000n\000d\000 \000d\000e\000p\000t\000h\000 \000o\000f\000 \000p\000l\000a\000n\000t\000i\000n\000g) recshow
Q
2 J
10.0000 M
1.00000 1.00000 1.00000 RG
newpath
866.062 97.7569 m
1011.11 97.7569 l
1011.11 153.418 l
866.062 153.418 l
866.062 97.7569 l
h
f
2.00000 w
0 J
1.45000 M
0.00000 0.00000 0.00000 RG
newpath
866.062 97.7569 m
1011.11 97.7569 l
1011.11 153.418 l
866.062 153.418 l
866.062 97.7569 l
h
S
1.00000 w
2 J
10.0000 M
0 J
1.45000 M
q
[ 1.00000 0.00000 0.00000 1.00000 875.000 109.000 ] concat
0 0 127 33 rc
q
q
q
Q
q
Q
q
Q
q
Q
q
[ 1.00000 0.00000 0.00000 -1.00000 0.00000 11.0000 ] concat
0.00000 0.00000 moveto
/Arial findfont 12 scalefont setfont 10.0000 cfontH
(\000R\000o\000o\000t\000 \000f\000r\000o\000n\000t\000 \000g\000r\000o\000w\000t\000h\000 \000o\000n\000s\000e\000t) recshow
Q
q
[ 1.00000 0.00000 0.00000 -1.00000 127.000 11.0000 ] concat
0.00000 0.00000 moveto
/Arial findfont 12 scalefont setfont 10.0000 cfontH
(\000 ) recshow
Q
q
[ 1.00000 0.00000 0.00000 -1.00000 0.00000 25.0000 ] concat
0.00000 0.00000 moveto
/Arial findfont 12 scalefont setfont 10.0000 cfontH
(\000f\000r\000o\000m\000 \000\050\000p\000r\000o\000f\000s\000e\000m) recshow
Q
q
[ 1.00000 0.00000 0.00000 -1.00000 78.0000 30.0000 ] concat
0.00000 0.00000 moveto
/Arial findfont 10 scalefont setfont 8.33333 cfontH
(\000T\000 ) recshow
Q
q
[ 1.00000 0.00000 0.00000 -1.00000 88.0000 25.0000 ] concat
0.00000 0.00000 moveto
/Arial findfont 12 scalefont setfont 10.0000 cfontH
(\000\051) recshow
Q
Q
Q
Q
2 J
10.0000 M
0 J
1.45000 M
newpath
523.769 306.066 m
523.769 378.528 l
S
newpath
523.769 386.528 m
528.769 374.528 l
523.769 377.528 l
518.769 374.528 l
h
f
2 J
10.0000 M
0 J
1.45000 M
newpath
437.676 444.969 m
369.885 511.038 l
S
newpath
364.156 516.621 m
376.239 511.827 l
370.601 510.340 l
369.260 504.665 l
h
f
2 J
10.0000 M
0 J
1.45000 M
newpath
211.426 -123.739 m
316.587 -123.260 l
S
newpath
324.587 -123.223 m
312.610 -128.278 l
315.587 -123.264 l
312.564 -118.278 l
h
f
q
[ 1.00000 0.00000 0.00000 -1.00000 264.117 -128.884 ] concat
0.00000 0.00000 moveto
/Helvetica findfont 14 scalefont setfont 11.6667 cfontH
(\0000) recshow
Q
2 J
10.0000 M
0 J
1.45000 M
newpath
389.289 -82.7923 m
389.289 -56.3526 l
S
newpath
389.289 -48.3526 m
394.289 -60.3526 l
389.289 -57.3526 l
384.289 -60.3526 l
h
f
q
[ 1.00000 0.00000 0.00000 -1.00000 355.952 -60.8815 ] concat
0.00000 0.00000 moveto
/Helvetica findfont 12 scalefont setfont 10.0000 cfontH
(\0001) recshow
Q
2 J
10.0000 M
0 J
1.45000 M
newpath
607.304 444.998 m
679.963 511.784 l
S
newpath
685.853 517.197 m
680.402 505.396 l
679.227 511.107 l
673.635 512.758 l
h
f
2 J
10.0000 M
0 J
1.45000 M
newpath
457.994 -118.204 m
525.032 -113.464 l
S
newpath
533.012 -112.900 m
521.395 -118.734 l
524.035 -113.535 l
520.689 -108.759 l
h
f
q
[ 1.00000 0.00000 0.00000 -1.00000 491.609 -102.454 ] concat
0.00000 0.00000 moveto
/Helvetica findfont 14 scalefont setfont 11.6667 cfontH
(\0002) recshow
Q
2 J
10.0000 M
0 J
1.45000 M
newpath
658.725 -76.9277 m
719.352 -44.2234 l
S
newpath
726.393 -40.4253 m
718.206 -50.5230 l
718.472 -44.6981 l
713.458 -41.7218 l
h
f
q
[ 1.00000 0.00000 0.00000 -1.00000 688.103 -68.7959 ] concat
0.00000 0.00000 moveto
/Helvetica findfont 12 scalefont setfont 10.0000 cfontH
(\000n\000o) recshow
Q
2 J
10.0000 M
0 J
1.45000 M
newpath
836.045 -13.7106 m
858.074 -13.7106 l
S
newpath
866.074 -13.7106 m
854.074 -18.7106 l
857.074 -13.7106 l
854.074 -8.71055 l
h
f
q
[ 1.00000 0.00000 0.00000 -1.00000 847.169 -20.7867 ] concat
0.00000 0.00000 moveto
/Helvetica findfont 14 scalefont setfont 11.6667 cfontH
(\0001) recshow
Q
2 J
10.0000 M
0 J
1.45000 M
newpath
523.769 444.980 m
523.769 502.837 l
S
newpath
523.769 510.837 m
528.769 498.837 l
523.769 501.837 l
518.769 498.837 l
h
f
2 J
10.0000 M
0 J
1.45000 M
newpath
371.593 20.9598 m
334.553 93.5310 l
S
newpath
330.916 100.656 m
340.825 92.2413 l
335.007 92.6403 l
331.918 87.6952 l
h
f
q
[ 1.00000 0.00000 0.00000 -1.00000 329.136 65.5194 ] concat
0.00000 0.00000 moveto
/Helvetica findfont 12 scalefont setfont 10.0000 cfontH
(\000n\000o) recshow
Q
2 J
10.0000 M
0 J
1.45000 M
newpath
365.565 160.853 m
453.011 213.481 l
S
newpath
459.866 217.607 m
452.163 207.135 l
452.155 212.966 l
447.006 215.703 l
h
f
2 J
10.0000 M
0 J
1.45000 M
newpath
167.290 -89.4455 m
166.434 91.6436 l
S
newpath
166.396 99.6435 m
171.453 87.6673 l
166.439 90.6436 l
161.453 87.6200 l
h
f
q
[ 1.00000 0.00000 0.00000 -1.00000 156.507 10.6872 ] concat
0.00000 0.00000 moveto
/Helvetica findfont 14 scalefont setfont 11.6667 cfontH
(\0001) recshow
Q
2 J
10.0000 M
0 J
1.45000 M
newpath
210.606 159.602 m
430.983 227.485 l
S
newpath
438.629 229.840 m
428.633 221.529 l
430.028 227.190 l
425.689 231.086 l
h
f
2 J
10.0000 M
0 J
1.45000 M
newpath
406.989 20.9555 m
443.240 91.9561 l
S
newpath
446.878 99.0811 m
445.875 86.1199 l
442.786 91.0655 l
436.968 90.6673 l
h
f
q
[ 1.00000 0.00000 0.00000 -1.00000 399.485 64.7318 ] concat
0.00000 0.00000 moveto
/Helvetica findfont 12 scalefont setfont 10.0000 cfontH
(\000y\000e\000s) recshow
Q
2 J
10.0000 M
0 J
1.45000 M
newpath
476.092 157.766 m
496.710 200.276 l
S
newpath
500.201 207.474 m
499.463 194.495 l
496.274 199.376 l
490.466 198.859 l
h
f
2 J
10.0000 M
0 J
1.45000 M
newpath
769.475 20.9733 m
769.694 91.4504 l
S
newpath
769.719 99.4504 m
774.681 87.4349 l
769.691 90.4504 l
764.682 87.4660 l
h
f
q
[ 1.00000 0.00000 0.00000 -1.00000 757.778 65.7212 ] concat
0.00000 0.00000 moveto
/Helvetica findfont 14 scalefont setfont 11.6667 cfontH
(\0002) recshow
Q
2 J
10.0000 M
0 J
1.45000 M
newpath
901.388 20.3704 m
810.192 94.4449 l
S
newpath
803.982 99.4887 m
816.449 95.8040 l
810.968 93.8144 l
810.144 88.0419 l
h
f
q
[ 1.00000 0.00000 0.00000 -1.00000 848.433 48.3588 ] concat
0.00000 0.00000 moveto
/Helvetica findfont 14 scalefont setfont 11.6667 cfontH
(\0001) recshow
Q
2 J
10.0000 M
0 J
1.45000 M
newpath
714.276 155.150 m
595.995 214.522 l
S
newpath
588.846 218.111 m
601.813 217.196 l
596.889 214.074 l
597.327 208.259 l
h
f
2 J
10.0000 M
0 J
1.45000 M
newpath
609.678 -66.5614 m
609.678 89.7569 l
S
newpath
609.678 97.7569 m
614.678 85.7569 l
609.678 88.7569 l
604.678 85.7569 l
h
f
q
[ 1.00000 0.00000 0.00000 -1.00000 587.004 20.2999 ] concat
0.00000 0.00000 moveto
/Helvetica findfont 12 scalefont setfont 10.0000 cfontH
(\000y\000e\000s) recshow
Q
2 J
10.0000 M
0 J
1.45000 M
newpath
581.812 156.442 m
539.908 200.567 l
S
newpath
534.399 206.368 m
546.288 201.109 l
540.597 199.842 l
539.037 194.223 l
h
f
2 J
10.0000 M
0 J
1.45000 M
newpath
928.248 20.9660 m
928.248 89.7457 l
S
newpath
928.248 97.7457 m
933.248 85.7457 l
928.248 88.7457 l
923.248 85.7457 l
h
f
q
[ 1.00000 0.00000 0.00000 -1.00000 916.462 64.8553 ] concat
0.00000 0.00000 moveto
/Helvetica findfont 14 scalefont setfont 11.6667 cfontH
(\0002) recshow
Q
2 J
10.0000 M
0 J
1.45000 M
newpath
872.743 153.423 m
617.637 228.457 l
S
newpath
609.962 230.714 m
622.885 232.125 l
618.596 228.174 l
620.063 222.531 l
h
f
2 J
10.0000 M
Q
[ 1.00000 0.00000 0.00000 1.00000 0.00000 0.00000 ] defaultmatrix matrix concatmatrix setmatrix
cliprestore

%%Trailer
%%EOF
