:nbplantes:
1
:plante:
snu
0.0
0.0
0.0
code_acti_reserve
2
0
0
0
0
0.0
0.0
0.0
:densinitial:
0.0 0.0 0.0 0.0 0.0 
:plante:




code_acti_reserve
2
0
0
0
0



:densinitial:
     
:Hinitf:
23.0 22.0 20.0 0.0 0.0 
:NO3initf:
136.0 61.0 34.0 0.0 0.0 
:NH4initf:
0.0 0.0 0.0 0.0 0.0 
:snow:
Sdepth0
0.0
Sdry0
0.0
Swet0
0.0
ps0
0.0
