{
    "prepare_queue": {
        "installed": [],
        "uninstalled": []
    },
    "config_munge": {
        "files": {}
    },
    "installed_plugins": {
        "cordova-plugin-inappbrowser": {
            "PACKAGE_NAME": "io.cordova.hellocordova"
        },
        "cordova-plugin-media": {
            "PACKAGE_NAME": "io.cordova.hellocordova"
        },
        "cordova-plugin-splashscreen": {
            "PACKAGE_NAME": "io.cordova.hellocordova"
        },
        "cordova-plugin-device": {
            "PACKAGE_NAME": "io.cordova.hellocordova"
        },
        "cordova-plugin-statusbar": {
            "PACKAGE_NAME": "io.cordova.hellocordova"
        },
        "cordova-plugin-fullscreen": {
            "PACKAGE_NAME": "io.cordova.hellocordova"
        }
    },
    "dependent_plugins": {
        "cordova-plugin-compat": {
            "PACKAGE_NAME": "io.cordova.hellocordova"
        },
        "cordova-plugin-file": {
            "PACKAGE_NAME": "io.cordova.hellocordova"
        }
    }
}