module myMod:
int a;
int b;
int c;
  starthere:
    if 2 equals 2 ?
      a = 32;
      if 3 smaller 2 ?
        b = 34;
      else:
        c = 3;
        call show with ("3 is not smaller than 2!");
      endif;
    endif;
  endhere;