[gd_scene load_steps=5 format=2]

[ext_resource path="res://addons/uma/data/HumanMale/Import/Eyes.material" type="Material" id=1]
[ext_resource path="res://addons/uma/utils/UMASlot.cs" type="Script" id=2]

[sub_resource type="ArrayMesh" id=1]
resource_name = "UMA_Human_Male_Eyes"
surfaces/0 = {
"aabb": AABB( -0.0514642, 1.84651, 0.0689208, 0.102928, 0.0330459, 0.022845 ),
"array_data": PoolByteArray( 11, 82, 28, 61, 221, 119, 238, 63, 0, 73, 187, 61, 26, 0, 124, 0, 124, 0, 230, 127, 146, 56, 0, 56, 125, 0, 0, 0, 255, 255, 0, 0, 0, 0, 0, 0, 161, 4, 41, 61, 221, 119, 238, 63, 43, 92, 185, 61, 56, 0, 113, 0, 113, 0, 200, 127, 28, 57, 0, 56, 125, 0, 0, 0, 255, 255, 0, 0, 0, 0, 0, 0, 55, 11, 39, 61, 41, 199, 238, 63, 43, 92, 185, 61, 51, 21, 113, 0, 115, 0, 204, 127, 7, 57, 41, 55, 125, 0, 0, 0, 255, 255, 0, 0, 0, 0, 0, 0, 123, 30, 15, 61, 73, 149, 240, 63, 234, 24, 154, 61, 0, 127, 0, 0, 126, 0, 2, 127, 3, 56, 36, 46, 125, 0, 0, 0, 255, 255, 0, 0, 0, 0, 0, 0, 123, 30, 15, 61, 17, 108, 240, 63, 93, 38, 141, 61, 0, 124, 232, 0, 126, 0, 1, 127, 3, 56, 216, 38, 125, 0, 0, 0, 255, 255, 0, 0, 0, 0, 0, 0, 102, 97, 238, 60, 253, 69, 240, 63, 93, 38, 141, 61, 209, 115, 232, 0, 77, 50, 86, 127, 32, 53, 4, 44, 125, 0, 0, 0, 255, 255, 0, 0, 0, 0, 0, 0, 48, 116, 24, 61, 138, 194, 238, 63, 0, 73, 187, 61, 18, 18, 124, 0, 125, 0, 238, 127, 104, 56, 54, 55, 125, 0, 0, 0, 255, 255, 0, 0, 0, 0, 0, 0, 36, 81, 27, 61, 76, 160, 238, 63, 0, 73, 187, 61, 24, 10, 124, 0, 124, 0, 232, 127, 136, 56, 147, 55, 125, 0, 0, 0, 255, 255, 0, 0, 0, 0, 0, 0, 170, 110, 33, 61, 94, 10, 239, 63, 43, 92, 185, 61, 39, 39, 113, 0, 119, 0, 215, 127, 202, 56, 115, 54, 125, 0, 0, 0, 255, 255, 0, 0, 0, 0, 0, 0, 253, 6, 25, 61, 75, 55, 239, 63, 43, 92, 185, 61, 21, 51, 113, 0, 124, 0, 233, 127, 111, 56, 248, 53, 125, 0, 0, 0, 255, 255, 0, 0, 0, 0, 0, 0, 255, 248, 62, 61, 177, 246, 239, 63, 233, 24, 154, 61, 89, 89, 0, 0, 40, 216, 143, 127, 76, 58, 220, 50, 125, 0, 0, 0, 255, 255, 0, 0, 0, 0, 0, 0, 208, 84, 59, 61, 143, 217, 239, 63, 92, 38, 141, 61, 88, 88, 232, 0, 11, 212, 138, 127, 177, 58, 75, 49, 125, 0, 0, 0, 255, 255, 0, 0, 0, 0, 0, 0, 55, 11, 39, 61, 253, 69, 240, 63, 93, 38, 141, 61, 47, 115, 232, 0, 73, 206, 166, 127, 118, 57, 4, 44, 125, 0, 0, 0, 255, 255, 0, 0, 0, 0, 0, 0, 254, 248, 62, 61, 8, 249, 236, 63, 233, 24, 154, 61, 89, 167, 0, 0, 36, 36, 141, 127, 76, 58, 73, 58, 125, 0, 0, 0, 255, 255, 0, 0, 0, 0, 0, 0, 207, 84, 59, 61, 42, 22, 237, 63, 92, 38, 141, 61, 88, 168, 232, 0, 14, 46, 139, 127, 177, 58, 174, 58, 125, 0, 0, 0, 255, 255, 0, 0, 0, 0, 0, 0, 141, 226, 72, 61, 119, 184, 237, 63, 92, 38, 141, 61, 115, 209, 232, 0, 244, 33, 135, 127, 131, 59, 115, 57, 125, 0, 0, 0, 255, 255, 0, 0, 0, 0, 0, 0, 77, 208, 197, 60, 91, 229, 237, 63, 43, 6, 178, 61, 172, 222, 88, 0, 91, 0, 87, 127, 70, 52, 199, 56, 125, 0, 0, 0, 255, 255, 0, 0, 0, 0, 0, 0, 211, 180, 170, 60, 119, 184, 237, 63, 252, 11, 167, 61, 148, 211, 47, 0, 53, 249, 115, 127, 63, 50, 4, 57, 125, 0, 0, 0, 255, 255, 0, 0, 0, 0, 0, 0, 77, 208, 197, 60, 42, 22, 237, 63, 252, 11, 167, 61, 173, 173, 47, 0, 73, 242, 102, 127, 70, 52, 224, 57, 125, 0, 0, 0, 255, 255, 0, 0, 0, 0, 0, 0, 96, 43, 20, 61, 114, 217, 238, 63, 0, 73, 187, 61, 10, 24, 124, 0, 126, 0, 246, 127, 58, 56, 247, 54, 125, 0, 0, 0, 255, 255, 0, 0, 0, 0, 0, 0, 123, 30, 15, 61, 14, 71, 239, 63, 43, 92, 185, 61, 0, 56, 113, 0, 127, 0, 0, 127, 3, 56, 206, 53, 125, 0, 0, 0, 255, 255, 0, 0, 0, 0, 0, 0, 103, 97, 238, 60, 253, 69, 240, 63, 252, 11, 167, 61, 211, 108, 47, 0, 105, 13, 69, 127, 254, 53, 51, 50, 125, 0, 0, 0, 255, 255, 0, 0, 0, 0, 0, 0, 123, 30, 15, 61, 17, 108, 240, 63, 252, 11, 167, 61, 0, 117, 47, 0, 127, 0, 0, 127, 3, 56, 100, 49, 125, 0, 0, 0, 255, 255, 0, 0, 0, 0, 0, 0, 215, 133, 190, 60, 177, 246, 239, 63, 234, 24, 154, 61, 167, 89, 0, 0, 39, 39, 114, 127, 232, 50, 220, 50, 125, 0, 0, 0, 255, 255, 0, 0, 0, 0, 0, 0, 172, 112, 234, 60, 17, 108, 240, 63, 234, 24, 154, 61, 208, 117, 0, 0, 90, 37, 80, 127, 141, 53, 14, 48, 125, 0, 0, 0, 255, 255, 0, 0, 0, 0, 0, 0, 152, 156, 249, 60, 91, 229, 237, 63, 43, 92, 185, 61, 217, 217, 113, 0, 119, 0, 41, 127, 121, 54, 199, 56, 125, 0, 0, 0, 255, 255, 0, 0, 0, 0, 0, 0, 102, 97, 238, 60, 144, 40, 238, 63, 43, 92, 185, 61, 205, 235, 113, 0, 115, 0, 52, 127, 254, 53, 108, 56, 125, 0, 0, 0, 255, 255, 0, 0, 0, 0, 0, 0, 171, 112, 234, 60, 221, 119, 238, 63, 43, 92, 185, 61, 200, 0, 113, 0, 113, 0, 56, 127, 212, 53, 0, 56, 125, 0, 0, 0, 255, 255, 0, 0, 0, 0, 0, 0, 214, 133, 190, 60, 221, 119, 238, 63, 43, 6, 178, 61, 165, 0, 88, 0, 88, 0, 91, 127, 237, 51, 0, 56, 125, 0, 0, 0, 255, 255, 0, 0, 0, 0, 0, 0, 36, 81, 27, 61, 109, 79, 238, 63, 0, 73, 187, 61, 24, 246, 124, 0, 124, 0, 232, 127, 136, 56, 55, 56, 125, 0, 0, 0, 255, 255, 0, 0, 0, 0, 0, 0, 55, 11, 39, 61, 144, 40, 238, 63, 43, 92, 185, 61, 51, 235, 113, 0, 115, 0, 204, 127, 7, 57, 108, 56, 125, 0, 0, 0, 255, 255, 0, 0, 0, 0, 0, 0, 237, 52, 5, 61, 119, 184, 237, 63, 43, 92, 185, 61, 235, 205, 113, 0, 124, 0, 23, 127, 47, 55, 4, 57, 125, 0, 0, 0, 255, 255, 0, 0, 0, 0, 0, 0, 74, 142, 218, 60, 42, 105, 237, 63, 43, 6, 178, 61, 192, 192, 88, 0, 102, 0, 75, 127, 39, 53, 112, 57, 125, 0, 0, 0, 255, 255, 0, 0, 0, 0, 0, 0, 195, 83, 59, 61, 143, 217, 239, 63, 129, 12, 167, 61, 83, 83, 47, 0, 71, 244, 152, 127, 227, 57, 64, 52, 125, 0, 0, 0, 255, 255, 0, 0, 0, 0, 0, 0, 128, 225, 72, 61, 75, 55, 239, 63, 129, 12, 167, 61, 108, 45, 47, 0, 52, 251, 141, 127, 119, 58, 248, 53, 125, 0, 0, 0, 255, 255, 0, 0, 0, 0, 0, 0, 255, 164, 77, 61, 14, 71, 239, 63, 233, 24, 154, 61, 117, 48, 0, 0, 11, 230, 133, 127, 0, 59, 135, 53, 125, 0, 0, 0, 255, 255, 0, 0, 0, 0, 0, 0, 138, 16, 10, 61, 114, 217, 238, 63, 0, 73, 187, 61, 246, 24, 124, 0, 126, 0, 10, 127, 153, 55, 247, 54, 125, 0, 0, 0, 255, 255, 0, 0, 0, 0, 0, 0, 123, 30, 15, 61, 129, 225, 238, 63, 0, 73, 187, 61, 0, 26, 124, 0, 127, 0, 0, 127, 3, 56, 226, 54, 125, 0, 0, 0, 255, 255, 0, 0, 0, 0, 0, 0, 102, 97, 238, 60, 188, 169, 236, 63, 252, 11, 167, 61, 211, 148, 47, 0, 104, 244, 70, 127, 254, 53, 116, 58, 125, 0, 0, 0, 255, 255, 0, 0, 0, 0, 0, 0, 171, 112, 234, 60, 168, 131, 236, 63, 234, 24, 154, 61, 208, 139, 0, 0, 90, 219, 80, 127, 141, 53, 253, 58, 125, 0, 0, 0, 255, 255, 0, 0, 0, 0, 0, 0, 122, 30, 15, 61, 112, 90, 236, 63, 234, 24, 154, 61, 0, 129, 0, 0, 126, 0, 1, 127, 3, 56, 60, 59, 125, 0, 0, 0, 255, 255, 0, 0, 0, 0, 0, 0, 197, 244, 48, 61, 42, 105, 237, 63, 42, 6, 178, 61, 64, 192, 88, 0, 102, 0, 181, 127, 115, 57, 112, 57, 125, 0, 0, 0, 255, 255, 0, 0, 0, 0, 0, 0, 169, 110, 33, 61, 42, 22, 237, 63, 43, 6, 178, 61, 34, 172, 88, 0, 117, 0, 209, 127, 202, 56, 224, 57, 125, 0, 0, 0, 255, 255, 0, 0, 0, 0, 0, 0, 54, 11, 39, 61, 188, 169, 236, 63, 252, 11, 167, 61, 45, 148, 47, 0, 104, 12, 186, 127, 7, 57, 116, 58, 125, 0, 0, 0, 255, 255, 0, 0, 0, 0, 0, 0, 208, 84, 59, 61, 94, 10, 239, 63, 42, 6, 178, 61, 84, 34, 88, 0, 91, 0, 169, 127, 227, 57, 115, 54, 125, 0, 0, 0, 255, 255, 0, 0, 0, 0, 0, 0, 75, 142, 218, 60, 143, 134, 239, 63, 43, 6, 178, 61, 192, 64, 88, 0, 102, 0, 75, 127, 39, 53, 33, 53, 125, 0, 0, 0, 255, 255, 0, 0, 0, 0, 0, 0, 153, 156, 249, 60, 143, 217, 239, 63, 43, 6, 178, 61, 222, 84, 88, 0, 117, 0, 47, 127, 121, 54, 64, 52, 125, 0, 0, 0, 255, 255, 0, 0, 0, 0, 0, 0, 78, 208, 197, 60, 94, 10, 239, 63, 43, 6, 178, 61, 172, 34, 88, 0, 91, 0, 87, 127, 70, 52, 115, 54, 125, 0, 0, 0, 255, 255, 0, 0, 0, 0, 0, 0, 78, 208, 197, 60, 143, 217, 239, 63, 130, 12, 167, 61, 173, 83, 47, 0, 71, 12, 103, 127, 70, 52, 64, 52, 125, 0, 0, 0, 255, 255, 0, 0, 0, 0, 0, 0, 141, 226, 72, 61, 75, 55, 239, 63, 92, 38, 141, 61, 115, 47, 232, 0, 239, 235, 133, 127, 131, 59, 26, 53, 125, 0, 0, 0, 255, 255, 0, 0, 0, 0, 0, 0, 160, 4, 41, 61, 168, 131, 236, 63, 234, 24, 154, 61, 48, 139, 0, 0, 90, 37, 176, 127, 64, 57, 253, 58, 125, 0, 0, 0, 255, 255, 0, 0, 0, 0, 0, 0, 54, 11, 39, 61, 188, 169, 236, 63, 93, 38, 141, 61, 47, 141, 232, 0, 73, 50, 166, 127, 118, 57, 128, 59, 125, 0, 0, 0, 255, 255, 0, 0, 0, 0, 0, 0, 153, 156, 249, 60, 94, 10, 239, 63, 43, 92, 185, 61, 217, 39, 113, 0, 119, 0, 41, 127, 121, 54, 115, 54, 125, 0, 0, 0, 255, 255, 0, 0, 0, 0, 0, 0, 103, 97, 238, 60, 41, 199, 238, 63, 43, 92, 185, 61, 205, 21, 113, 0, 115, 0, 52, 127, 254, 53, 41, 55, 125, 0, 0, 0, 255, 255, 0, 0, 0, 0, 0, 0, 197, 244, 48, 61, 143, 134, 239, 63, 42, 6, 178, 61, 64, 64, 88, 0, 102, 0, 181, 127, 115, 57, 33, 53, 125, 0, 0, 0, 255, 255, 0, 0, 0, 0, 0, 0, 170, 110, 33, 61, 143, 217, 239, 63, 43, 6, 178, 61, 34, 84, 88, 0, 117, 0, 209, 127, 202, 56, 64, 52, 125, 0, 0, 0, 255, 255, 0, 0, 0, 0, 0, 0, 255, 248, 62, 61, 221, 119, 238, 63, 42, 6, 178, 61, 91, 0, 88, 0, 88, 0, 165, 127, 11, 58, 0, 56, 125, 0, 0, 0, 255, 255, 0, 0, 0, 0, 0, 0, 255, 164, 77, 61, 221, 119, 238, 63, 251, 11, 167, 61, 117, 0, 47, 0, 47, 2, 139, 127, 170, 58, 0, 56, 125, 0, 0, 0, 255, 255, 0, 0, 0, 0, 0, 0, 239, 47, 161, 60, 221, 119, 238, 63, 252, 11, 167, 61, 139, 0, 47, 0, 47, 0, 117, 127, 112, 49, 0, 56, 125, 0, 0, 0, 255, 255, 0, 0, 0, 0, 0, 0, 183, 225, 150, 60, 221, 119, 238, 63, 234, 24, 154, 61, 129, 0, 0, 0, 0, 4, 126, 127, 60, 46, 0, 56, 125, 0, 0, 0, 255, 255, 0, 0, 0, 0, 0, 0, 55, 11, 39, 61, 253, 69, 240, 63, 130, 12, 167, 61, 45, 108, 47, 0, 104, 244, 186, 127, 7, 57, 51, 50, 125, 0, 0, 0, 255, 255, 0, 0, 0, 0, 0, 0, 161, 4, 41, 61, 17, 108, 240, 63, 234, 24, 154, 61, 48, 117, 0, 0, 90, 219, 176, 127, 64, 57, 14, 48, 125, 0, 0, 0, 255, 255, 0, 0, 0, 0, 0, 0, 186, 199, 5, 61, 47, 45, 238, 63, 0, 73, 187, 61, 238, 238, 124, 0, 125, 0, 18, 127, 60, 55, 101, 56, 125, 0, 0, 0, 255, 255, 0, 0, 0, 0, 0, 0, 210, 235, 2, 61, 76, 160, 238, 63, 0, 73, 187, 61, 232, 10, 124, 0, 124, 0, 24, 127, 253, 54, 147, 55, 125, 0, 0, 0, 255, 255, 0, 0, 0, 0, 0, 0, 210, 235, 2, 61, 109, 79, 238, 63, 0, 73, 187, 61, 232, 246, 124, 0, 124, 0, 24, 127, 253, 54, 55, 56, 125, 0, 0, 0, 255, 255, 0, 0, 0, 0, 0, 0, 223, 233, 1, 61, 221, 119, 238, 63, 0, 73, 187, 61, 230, 0, 124, 0, 124, 0, 26, 127, 232, 54, 0, 56, 125, 0, 0, 0, 255, 255, 0, 0, 0, 0, 0, 0, 123, 30, 15, 61, 177, 246, 239, 63, 43, 6, 178, 61, 0, 91, 88, 0, 127, 0, 0, 127, 3, 56, 226, 51, 125, 0, 0, 0, 255, 255, 0, 0, 0, 0, 0, 0, 239, 47, 161, 60, 171, 168, 237, 63, 112, 25, 154, 61, 139, 208, 0, 0, 8, 236, 125, 127, 26, 48, 61, 57, 125, 0, 0, 0, 255, 255, 0, 0, 0, 0, 0, 0, 214, 133, 190, 60, 8, 249, 236, 63, 234, 24, 154, 61, 167, 167, 0, 0, 40, 216, 113, 127, 232, 50, 73, 58, 125, 0, 0, 0, 255, 255, 0, 0, 0, 0, 0, 0, 101, 97, 238, 60, 188, 169, 236, 63, 93, 38, 141, 61, 209, 141, 232, 0, 77, 206, 86, 127, 32, 53, 128, 59, 125, 0, 0, 0, 255, 255, 0, 0, 0, 0, 0, 0, 122, 30, 15, 61, 168, 131, 236, 63, 252, 11, 167, 61, 0, 139, 47, 0, 126, 0, 0, 127, 3, 56, 167, 58, 125, 0, 0, 0, 255, 255, 0, 0, 0, 0, 0, 0, 253, 6, 25, 61, 119, 184, 237, 63, 43, 92, 185, 61, 21, 205, 113, 0, 124, 0, 233, 127, 111, 56, 4, 57, 125, 0, 0, 0, 255, 255, 0, 0, 0, 0, 0, 0, 123, 30, 15, 61, 171, 168, 237, 63, 43, 92, 185, 61, 0, 200, 113, 0, 127, 0, 0, 127, 3, 56, 25, 57, 125, 0, 0, 0, 255, 255, 0, 0, 0, 0, 0, 0, 122, 30, 15, 61, 8, 249, 236, 63, 43, 6, 178, 61, 0, 165, 88, 0, 127, 0, 0, 127, 3, 56, 8, 58, 125, 0, 0, 0, 255, 255, 0, 0, 0, 0, 0, 0, 123, 30, 15, 61, 64, 14, 238, 63, 0, 73, 187, 61, 0, 230, 124, 0, 126, 0, 0, 127, 3, 56, 143, 56, 125, 0, 0, 0, 255, 255, 0, 0, 0, 0, 0, 0, 138, 16, 10, 61, 71, 22, 238, 63, 0, 73, 187, 61, 246, 232, 124, 0, 126, 0, 10, 127, 153, 55, 133, 56, 125, 0, 0, 0, 255, 255, 0, 0, 0, 0, 0, 0, 152, 156, 249, 60, 42, 22, 237, 63, 43, 6, 178, 61, 222, 172, 88, 0, 117, 0, 47, 127, 121, 54, 224, 57, 125, 0, 0, 0, 255, 255, 0, 0, 0, 0, 0, 0, 212, 180, 170, 60, 75, 55, 239, 63, 130, 12, 167, 61, 148, 45, 47, 0, 52, 5, 115, 127, 63, 50, 248, 53, 125, 0, 0, 0, 255, 255, 0, 0, 0, 0, 0, 0, 240, 47, 161, 60, 14, 71, 239, 63, 234, 24, 154, 61, 139, 48, 0, 0, 11, 26, 123, 127, 26, 48, 135, 53, 125, 0, 0, 0, 255, 255, 0, 0, 0, 0, 0, 0, 77, 208, 197, 60, 143, 217, 239, 63, 93, 38, 141, 61, 168, 88, 232, 0, 11, 44, 118, 127, 87, 49, 75, 49, 125, 0, 0, 0, 255, 255, 0, 0, 0, 0, 0, 0, 211, 180, 170, 60, 75, 55, 239, 63, 93, 38, 141, 61, 141, 47, 232, 0, 239, 21, 123, 127, 28, 44, 26, 53, 125, 0, 0, 0, 255, 255, 0, 0, 0, 0, 0, 0, 208, 84, 59, 61, 91, 229, 237, 63, 42, 6, 178, 61, 84, 222, 88, 0, 91, 0, 169, 127, 227, 57, 199, 56, 125, 0, 0, 0, 255, 255, 0, 0, 0, 0, 0, 0, 141, 226, 72, 61, 119, 184, 237, 63, 251, 11, 167, 61, 108, 211, 47, 0, 54, 9, 142, 127, 119, 58, 4, 57, 125, 0, 0, 0, 255, 255, 0, 0, 0, 0, 0, 0, 255, 164, 77, 61, 171, 168, 237, 63, 233, 24, 154, 61, 117, 208, 0, 0, 6, 16, 131, 127, 0, 59, 61, 57, 125, 0, 0, 0, 255, 255, 0, 0, 0, 0, 0, 0, 255, 164, 77, 61, 221, 119, 238, 63, 92, 38, 141, 61, 124, 0, 232, 0, 232, 6, 132, 127, 205, 59, 0, 56, 125, 0, 0, 0, 255, 255, 0, 0, 0, 0, 0, 0, 186, 199, 5, 61, 138, 194, 238, 63, 0, 73, 187, 61, 238, 18, 124, 0, 125, 0, 18, 127, 60, 55, 54, 55, 125, 0, 0, 0, 255, 255, 0, 0, 0, 0, 0, 0, 237, 52, 5, 61, 75, 55, 239, 63, 43, 92, 185, 61, 235, 51, 113, 0, 124, 0, 23, 127, 47, 55, 248, 53, 125, 0, 0, 0, 255, 255, 0, 0, 0, 0, 0, 0, 238, 47, 161, 60, 221, 119, 238, 63, 93, 38, 141, 61, 132, 0, 232, 0, 232, 250, 124, 127, 56, 39, 0, 56, 125, 0, 0, 0, 255, 255, 0, 0, 0, 0, 0, 0, 170, 110, 33, 61, 91, 229, 237, 63, 43, 92, 185, 61, 39, 217, 113, 0, 119, 0, 215, 127, 202, 56, 199, 56, 125, 0, 0, 0, 255, 255, 0, 0, 0, 0, 0, 0, 123, 30, 15, 61, 221, 119, 238, 63, 185, 239, 187, 61, 0, 0, 127, 0, 127, 0, 0, 127, 3, 56, 0, 56, 125, 0, 0, 0, 255, 255, 0, 0, 0, 0, 0, 0, 96, 43, 20, 61, 71, 22, 238, 63, 0, 73, 187, 61, 10, 232, 124, 0, 126, 0, 246, 127, 58, 56, 133, 56, 125, 0, 0, 0, 255, 255, 0, 0, 0, 0, 0, 0, 48, 116, 24, 61, 47, 45, 238, 63, 0, 73, 187, 61, 18, 238, 124, 0, 125, 0, 238, 127, 104, 56, 101, 56, 125, 0, 0, 0, 255, 255, 0, 0, 0, 0, 0, 0, 76, 208, 197, 60, 42, 22, 237, 63, 93, 38, 141, 61, 168, 168, 232, 0, 11, 212, 118, 127, 87, 49, 174, 58, 125, 0, 0, 0, 255, 255, 0, 0, 0, 0, 0, 0, 26, 204, 82, 61, 221, 119, 238, 63, 233, 24, 154, 61, 127, 0, 0, 0, 0, 251, 130, 127, 63, 59, 0, 56, 125, 0, 0, 0, 255, 255, 0, 0, 0, 0, 0, 0, 122, 30, 15, 61, 168, 131, 236, 63, 93, 38, 141, 61, 0, 132, 232, 0, 126, 0, 1, 127, 3, 56, 202, 59, 125, 0, 0, 0, 255, 255, 0, 0, 0, 0, 0, 0, 207, 84, 59, 61, 42, 22, 237, 63, 251, 11, 167, 61, 83, 173, 47, 0, 73, 14, 154, 127, 227, 57, 224, 57, 125, 0, 0, 0, 255, 255, 0, 0, 0, 0, 0, 0, 210, 180, 170, 60, 119, 184, 237, 63, 93, 38, 141, 61, 141, 209, 232, 0, 241, 230, 123, 127, 28, 44, 115, 57, 125, 0, 0, 0, 255, 255, 0, 0, 0, 0, 0, 0, 50, 11, 39, 189, 41, 199, 238, 63, 44, 92, 185, 61, 205, 21, 113, 0, 115, 0, 52, 127, 255, 53, 41, 55, 132, 0, 0, 0, 255, 255, 0, 0, 0, 0, 0, 0, 156, 4, 41, 189, 221, 119, 238, 63, 44, 92, 185, 61, 200, 0, 113, 0, 113, 0, 56, 127, 212, 53, 0, 56, 132, 0, 0, 0, 255, 255, 0, 0, 0, 0, 0, 0, 6, 82, 28, 189, 221, 119, 238, 63, 1, 73, 187, 61, 230, 0, 124, 0, 124, 0, 26, 127, 232, 54, 0, 56, 132, 0, 0, 0, 255, 255, 0, 0, 0, 0, 0, 0, 94, 97, 238, 188, 253, 69, 240, 63, 94, 38, 141, 61, 47, 115, 232, 0, 77, 206, 170, 127, 118, 57, 4, 44, 132, 0, 0, 0, 255, 255, 0, 0, 0, 0, 0, 0, 118, 30, 15, 189, 17, 108, 240, 63, 94, 38, 141, 61, 0, 124, 232, 0, 126, 0, 255, 127, 3, 56, 216, 38, 132, 0, 0, 0, 255, 255, 0, 0, 0, 0, 0, 0, 118, 30, 15, 189, 73, 149, 240, 63, 235, 24, 154, 61, 0, 127, 0, 0, 126, 0, 254, 127, 3, 56, 36, 46, 132, 0, 0, 0, 255, 255, 0, 0, 0, 0, 0, 0, 43, 116, 24, 189, 138, 194, 238, 63, 1, 73, 187, 61, 238, 18, 124, 0, 125, 0, 18, 127, 60, 55, 54, 55, 132, 0, 0, 0, 255, 255, 0, 0, 0, 0, 0, 0, 165, 110, 33, 189, 94, 10, 239, 63, 44, 92, 185, 61, 217, 39, 113, 0, 119, 0, 41, 127, 121, 54, 115, 54, 132, 0, 0, 0, 255, 255, 0, 0, 0, 0, 0, 0, 248, 6, 25, 189, 75, 55, 239, 63, 44, 92, 185, 61, 235, 51, 113, 0, 124, 0, 23, 127, 47, 55, 248, 53, 132, 0, 0, 0, 255, 255, 0, 0, 0, 0, 0, 0, 50, 11, 39, 189, 253, 69, 240, 63, 94, 38, 141, 61, 209, 115, 232, 0, 73, 50, 90, 127, 32, 53, 4, 44, 132, 0, 0, 0, 255, 255, 0, 0, 0, 0, 0, 0, 203, 84, 59, 189, 143, 217, 239, 63, 95, 38, 141, 61, 168, 88, 232, 0, 11, 44, 118, 127, 87, 49, 75, 49, 132, 0, 0, 0, 255, 255, 0, 0, 0, 0, 0, 0, 250, 248, 62, 189, 177, 246, 239, 63, 236, 24, 154, 61, 167, 89, 0, 0, 40, 40, 113, 127, 232, 50, 220, 50, 132, 0, 0, 0, 255, 255, 0, 0, 0, 0, 0, 0, 136, 226, 72, 189, 119, 184, 237, 63, 95, 38, 141, 61, 141, 209, 232, 0, 244, 223, 121, 127, 28, 44, 115, 57, 132, 0, 0, 0, 255, 255, 0, 0, 0, 0, 0, 0, 202, 84, 59, 189, 42, 22, 237, 63, 95, 38, 141, 61, 168, 168, 232, 0, 14, 210, 117, 127, 87, 49, 174, 58, 132, 0, 0, 0, 255, 255, 0, 0, 0, 0, 0, 0, 249, 248, 62, 189, 8, 249, 236, 63, 236, 24, 154, 61, 167, 167, 0, 0, 36, 220, 115, 127, 232, 50, 73, 58, 132, 0, 0, 0, 255, 255, 0, 0, 0, 0, 0, 0, 67, 208, 197, 188, 42, 22, 237, 63, 253, 11, 167, 61, 83, 173, 47, 0, 73, 14, 154, 127, 227, 57, 224, 57, 132, 0, 0, 0, 255, 255, 0, 0, 0, 0, 0, 0, 201, 180, 170, 188, 119, 184, 237, 63, 253, 11, 167, 61, 108, 211, 47, 0, 53, 7, 141, 127, 119, 58, 4, 57, 132, 0, 0, 0, 255, 255, 0, 0, 0, 0, 0, 0, 67, 208, 197, 188, 91, 229, 237, 63, 44, 6, 178, 61, 84, 222, 88, 0, 91, 0, 169, 127, 227, 57, 199, 56, 132, 0, 0, 0, 255, 255, 0, 0, 0, 0, 0, 0, 118, 30, 15, 189, 14, 71, 239, 63, 44, 92, 185, 61, 0, 56, 113, 0, 127, 0, 0, 127, 3, 56, 206, 53, 132, 0, 0, 0, 255, 255, 0, 0, 0, 0, 0, 0, 91, 43, 20, 189, 114, 217, 238, 63, 1, 73, 187, 61, 246, 24, 124, 0, 126, 0, 10, 127, 153, 55, 247, 54, 132, 0, 0, 0, 255, 255, 0, 0, 0, 0, 0, 0, 93, 97, 238, 188, 253, 69, 240, 63, 253, 11, 167, 61, 45, 108, 47, 0, 105, 243, 187, 127, 7, 57, 51, 50, 132, 0, 0, 0, 255, 255, 0, 0, 0, 0, 0, 0, 162, 112, 234, 188, 17, 108, 240, 63, 235, 24, 154, 61, 48, 117, 0, 0, 90, 219, 176, 127, 64, 57, 14, 48, 132, 0, 0, 0, 255, 255, 0, 0, 0, 0, 0, 0, 205, 133, 190, 188, 177, 246, 239, 63, 235, 24, 154, 61, 89, 89, 0, 0, 39, 217, 142, 127, 76, 58, 220, 50, 132, 0, 0, 0, 255, 255, 0, 0, 0, 0, 0, 0, 69, 208, 197, 188, 143, 217, 239, 63, 94, 38, 141, 61, 88, 88, 232, 0, 11, 212, 138, 127, 177, 58, 75, 49, 132, 0, 0, 0, 255, 255, 0, 0, 0, 0, 0, 0, 142, 156, 249, 188, 91, 229, 237, 63, 44, 92, 185, 61, 39, 217, 113, 0, 119, 0, 215, 127, 202, 56, 199, 56, 132, 0, 0, 0, 255, 255, 0, 0, 0, 0, 0, 0, 64, 142, 218, 188, 42, 105, 237, 63, 44, 6, 178, 61, 64, 192, 88, 0, 102, 0, 181, 127, 115, 57, 112, 57, 132, 0, 0, 0, 255, 255, 0, 0, 0, 0, 0, 0, 92, 97, 238, 188, 144, 40, 238, 63, 44, 92, 185, 61, 51, 235, 113, 0, 115, 0, 204, 127, 7, 57, 108, 56, 132, 0, 0, 0, 255, 255, 0, 0, 0, 0, 0, 0, 204, 133, 190, 188, 221, 119, 238, 63, 44, 6, 178, 61, 91, 0, 88, 0, 88, 0, 165, 127, 11, 58, 0, 56, 132, 0, 0, 0, 255, 255, 0, 0, 0, 0, 0, 0, 50, 11, 39, 189, 144, 40, 238, 63, 44, 92, 185, 61, 205, 235, 113, 0, 115, 0, 52, 127, 255, 53, 108, 56, 132, 0, 0, 0, 255, 255, 0, 0, 0, 0, 0, 0, 232, 52, 5, 189, 119, 184, 237, 63, 44, 92, 185, 61, 21, 205, 113, 0, 124, 0, 233, 127, 111, 56, 4, 57, 132, 0, 0, 0, 255, 255, 0, 0, 0, 0, 0, 0, 142, 156, 249, 188, 42, 22, 237, 63, 44, 6, 178, 61, 34, 172, 88, 0, 117, 0, 209, 127, 202, 56, 224, 57, 132, 0, 0, 0, 255, 255, 0, 0, 0, 0, 0, 0, 190, 83, 59, 189, 143, 217, 239, 63, 132, 12, 167, 61, 173, 83, 47, 0, 71, 12, 104, 127, 70, 52, 64, 52, 132, 0, 0, 0, 255, 255, 0, 0, 0, 0, 0, 0, 250, 164, 77, 189, 14, 71, 239, 63, 236, 24, 154, 61, 139, 48, 0, 0, 11, 26, 123, 127, 26, 48, 135, 53, 132, 0, 0, 0, 255, 255, 0, 0, 0, 0, 0, 0, 133, 16, 10, 189, 114, 217, 238, 63, 1, 73, 187, 61, 10, 24, 124, 0, 126, 0, 246, 127, 58, 56, 247, 54, 132, 0, 0, 0, 255, 255, 0, 0, 0, 0, 0, 0, 232, 52, 5, 189, 75, 55, 239, 63, 44, 92, 185, 61, 21, 51, 113, 0, 124, 0, 233, 127, 111, 56, 248, 53, 132, 0, 0, 0, 255, 255, 0, 0, 0, 0, 0, 0, 117, 30, 15, 189, 112, 90, 236, 63, 235, 24, 154, 61, 0, 129, 0, 0, 126, 0, 255, 127, 3, 56, 60, 59, 132, 0, 0, 0, 255, 255, 0, 0, 0, 0, 0, 0, 161, 112, 234, 188, 168, 131, 236, 63, 235, 24, 154, 61, 48, 139, 0, 0, 90, 37, 176, 127, 64, 57, 253, 58, 132, 0, 0, 0, 255, 255, 0, 0, 0, 0, 0, 0, 92, 97, 238, 188, 188, 169, 236, 63, 253, 11, 167, 61, 45, 148, 47, 0, 104, 12, 186, 127, 7, 57, 116, 58, 132, 0, 0, 0, 255, 255, 0, 0, 0, 0, 0, 0, 192, 244, 48, 189, 42, 105, 237, 63, 45, 6, 178, 61, 192, 192, 88, 0, 102, 0, 75, 127, 39, 53, 112, 57, 132, 0, 0, 0, 255, 255, 0, 0, 0, 0, 0, 0, 202, 84, 59, 189, 42, 22, 237, 63, 254, 11, 167, 61, 173, 173, 47, 0, 73, 242, 102, 127, 70, 52, 224, 57, 132, 0, 0, 0, 255, 255, 0, 0, 0, 0, 0, 0, 49, 11, 39, 189, 188, 169, 236, 63, 253, 11, 167, 61, 211, 148, 47, 0, 104, 244, 70, 127, 255, 53, 116, 58, 132, 0, 0, 0, 255, 255, 0, 0, 0, 0, 0, 0, 192, 244, 48, 189, 143, 134, 239, 63, 45, 6, 178, 61, 192, 64, 88, 0, 102, 0, 75, 127, 39, 53, 33, 53, 132, 0, 0, 0, 255, 255, 0, 0, 0, 0, 0, 0, 203, 84, 59, 189, 94, 10, 239, 63, 45, 6, 178, 61, 172, 34, 88, 0, 91, 0, 87, 127, 70, 52, 115, 54, 132, 0, 0, 0, 255, 255, 0, 0, 0, 0, 0, 0, 65, 142, 218, 188, 143, 134, 239, 63, 44, 6, 178, 61, 64, 64, 88, 0, 102, 0, 181, 127, 115, 57, 33, 53, 132, 0, 0, 0, 255, 255, 0, 0, 0, 0, 0, 0, 68, 208, 197, 188, 143, 217, 239, 63, 131, 12, 167, 61, 83, 83, 47, 0, 71, 244, 153, 127, 227, 57, 64, 52, 132, 0, 0, 0, 255, 255, 0, 0, 0, 0, 0, 0, 68, 208, 197, 188, 94, 10, 239, 63, 44, 6, 178, 61, 84, 34, 88, 0, 91, 0, 169, 127, 227, 57, 115, 54, 132, 0, 0, 0, 255, 255, 0, 0, 0, 0, 0, 0, 202, 180, 170, 188, 75, 55, 239, 63, 131, 12, 167, 61, 108, 45, 47, 0, 52, 251, 141, 127, 119, 58, 248, 53, 132, 0, 0, 0, 255, 255, 0, 0, 0, 0, 0, 0, 136, 226, 72, 189, 75, 55, 239, 63, 95, 38, 141, 61, 141, 47, 232, 0, 239, 21, 123, 127, 28, 44, 26, 53, 132, 0, 0, 0, 255, 255, 0, 0, 0, 0, 0, 0, 49, 11, 39, 189, 188, 169, 236, 63, 94, 38, 141, 61, 209, 141, 232, 0, 73, 206, 90, 127, 32, 53, 128, 59, 132, 0, 0, 0, 255, 255, 0, 0, 0, 0, 0, 0, 143, 156, 249, 188, 94, 10, 239, 63, 44, 92, 185, 61, 39, 39, 113, 0, 119, 0, 215, 127, 202, 56, 115, 54, 132, 0, 0, 0, 255, 255, 0, 0, 0, 0, 0, 0, 93, 97, 238, 188, 41, 199, 238, 63, 44, 92, 185, 61, 51, 21, 113, 0, 115, 0, 204, 127, 7, 57, 41, 55, 132, 0, 0, 0, 255, 255, 0, 0, 0, 0, 0, 0, 165, 110, 33, 189, 143, 217, 239, 63, 44, 6, 178, 61, 222, 84, 88, 0, 117, 0, 47, 127, 121, 54, 64, 52, 132, 0, 0, 0, 255, 255, 0, 0, 0, 0, 0, 0, 118, 30, 15, 189, 177, 246, 239, 63, 44, 6, 178, 61, 0, 91, 88, 0, 127, 0, 0, 127, 3, 56, 226, 51, 132, 0, 0, 0, 255, 255, 0, 0, 0, 0, 0, 0, 123, 225, 72, 189, 75, 55, 239, 63, 132, 12, 167, 61, 148, 45, 47, 0, 52, 5, 115, 127, 63, 50, 248, 53, 132, 0, 0, 0, 255, 255, 0, 0, 0, 0, 0, 0, 250, 164, 77, 189, 221, 119, 238, 63, 254, 11, 167, 61, 139, 0, 47, 0, 47, 254, 117, 127, 112, 49, 0, 56, 132, 0, 0, 0, 255, 255, 0, 0, 0, 0, 0, 0, 229, 47, 161, 188, 171, 168, 237, 63, 113, 25, 154, 61, 117, 208, 0, 0, 8, 20, 131, 127, 0, 59, 61, 57, 132, 0, 0, 0, 255, 255, 0, 0, 0, 0, 0, 0, 173, 225, 150, 188, 221, 119, 238, 63, 235, 24, 154, 61, 127, 0, 0, 0, 0, 252, 130, 127, 63, 59, 0, 56, 132, 0, 0, 0, 255, 255, 0, 0, 0, 0, 0, 0, 156, 4, 41, 189, 17, 108, 240, 63, 235, 24, 154, 61, 208, 117, 0, 0, 90, 37, 80, 127, 141, 53, 14, 48, 132, 0, 0, 0, 255, 255, 0, 0, 0, 0, 0, 0, 50, 11, 39, 189, 253, 69, 240, 63, 131, 12, 167, 61, 211, 108, 47, 0, 104, 12, 70, 127, 255, 53, 51, 50, 132, 0, 0, 0, 255, 255, 0, 0, 0, 0, 0, 0, 181, 199, 5, 189, 47, 45, 238, 63, 1, 73, 187, 61, 18, 238, 124, 0, 125, 0, 238, 127, 104, 56, 101, 56, 132, 0, 0, 0, 255, 255, 0, 0, 0, 0, 0, 0, 161, 112, 234, 188, 221, 119, 238, 63, 44, 92, 185, 61, 56, 0, 113, 0, 113, 0, 200, 127, 28, 57, 0, 56, 132, 0, 0, 0, 255, 255, 0, 0, 0, 0, 0, 0, 205, 235, 2, 189, 76, 160, 238, 63, 1, 73, 187, 61, 24, 10, 124, 0, 124, 0, 232, 127, 136, 56, 147, 55, 132, 0, 0, 0, 255, 255, 0, 0, 0, 0, 0, 0, 205, 235, 2, 189, 109, 79, 238, 63, 1, 73, 187, 61, 24, 246, 124, 0, 124, 0, 232, 127, 136, 56, 55, 56, 132, 0, 0, 0, 255, 255, 0, 0, 0, 0, 0, 0, 143, 156, 249, 188, 143, 217, 239, 63, 44, 6, 178, 61, 34, 84, 88, 0, 117, 0, 209, 127, 202, 56, 64, 52, 132, 0, 0, 0, 255, 255, 0, 0, 0, 0, 0, 0, 204, 133, 190, 188, 8, 249, 236, 63, 235, 24, 154, 61, 89, 167, 0, 0, 40, 40, 143, 127, 76, 58, 73, 58, 132, 0, 0, 0, 255, 255, 0, 0, 0, 0, 0, 0, 117, 30, 15, 189, 168, 131, 236, 63, 94, 38, 141, 61, 0, 132, 232, 0, 126, 0, 255, 127, 3, 56, 202, 59, 132, 0, 0, 0, 255, 255, 0, 0, 0, 0, 0, 0, 93, 97, 238, 188, 188, 169, 236, 63, 94, 38, 141, 61, 47, 141, 232, 0, 77, 50, 170, 127, 118, 57, 128, 59, 132, 0, 0, 0, 255, 255, 0, 0, 0, 0, 0, 0, 155, 4, 41, 189, 168, 131, 236, 63, 235, 24, 154, 61, 208, 139, 0, 0, 90, 219, 80, 127, 141, 53, 253, 58, 132, 0, 0, 0, 255, 255, 0, 0, 0, 0, 0, 0, 117, 30, 15, 189, 168, 131, 236, 63, 253, 11, 167, 61, 0, 139, 47, 0, 126, 0, 0, 127, 3, 56, 167, 58, 132, 0, 0, 0, 255, 255, 0, 0, 0, 0, 0, 0, 248, 6, 25, 189, 119, 184, 237, 63, 44, 92, 185, 61, 235, 205, 113, 0, 124, 0, 23, 127, 47, 55, 4, 57, 132, 0, 0, 0, 255, 255, 0, 0, 0, 0, 0, 0, 164, 110, 33, 189, 42, 22, 237, 63, 44, 6, 178, 61, 222, 172, 88, 0, 117, 0, 47, 127, 121, 54, 224, 57, 132, 0, 0, 0, 255, 255, 0, 0, 0, 0, 0, 0, 117, 30, 15, 189, 8, 249, 236, 63, 44, 6, 178, 61, 0, 165, 88, 0, 127, 0, 0, 127, 3, 56, 8, 58, 132, 0, 0, 0, 255, 255, 0, 0, 0, 0, 0, 0, 118, 30, 15, 189, 64, 14, 238, 63, 1, 73, 187, 61, 0, 230, 124, 0, 127, 0, 0, 127, 3, 56, 143, 56, 132, 0, 0, 0, 255, 255, 0, 0, 0, 0, 0, 0, 118, 30, 15, 189, 171, 168, 237, 63, 44, 92, 185, 61, 0, 200, 113, 0, 127, 0, 0, 127, 3, 56, 25, 57, 132, 0, 0, 0, 255, 255, 0, 0, 0, 0, 0, 0, 229, 47, 161, 188, 221, 119, 238, 63, 253, 11, 167, 61, 117, 0, 47, 0, 47, 0, 139, 127, 170, 58, 0, 56, 132, 0, 0, 0, 255, 255, 0, 0, 0, 0, 0, 0, 230, 47, 161, 188, 14, 71, 239, 63, 235, 24, 154, 61, 117, 48, 0, 0, 11, 230, 133, 127, 0, 59, 135, 53, 132, 0, 0, 0, 255, 255, 0, 0, 0, 0, 0, 0, 203, 180, 170, 188, 75, 55, 239, 63, 94, 38, 141, 61, 115, 47, 232, 0, 239, 235, 133, 127, 131, 59, 26, 53, 132, 0, 0, 0, 255, 255, 0, 0, 0, 0, 0, 0, 230, 47, 161, 188, 221, 119, 238, 63, 94, 38, 141, 61, 124, 0, 232, 0, 232, 6, 132, 127, 205, 59, 0, 56, 132, 0, 0, 0, 255, 255, 0, 0, 0, 0, 0, 0, 250, 248, 62, 189, 221, 119, 238, 63, 45, 6, 178, 61, 165, 0, 88, 0, 88, 0, 91, 127, 238, 51, 0, 56, 132, 0, 0, 0, 255, 255, 0, 0, 0, 0, 0, 0, 203, 84, 59, 189, 91, 229, 237, 63, 45, 6, 178, 61, 172, 222, 88, 0, 91, 0, 87, 127, 70, 52, 199, 56, 132, 0, 0, 0, 255, 255, 0, 0, 0, 0, 0, 0, 21, 204, 82, 189, 221, 119, 238, 63, 236, 24, 154, 61, 129, 0, 0, 0, 0, 5, 126, 127, 60, 46, 0, 56, 132, 0, 0, 0, 255, 255, 0, 0, 0, 0, 0, 0, 250, 164, 77, 189, 171, 168, 237, 63, 236, 24, 154, 61, 139, 208, 0, 0, 6, 240, 125, 127, 26, 48, 61, 57, 132, 0, 0, 0, 255, 255, 0, 0, 0, 0, 0, 0, 250, 164, 77, 189, 221, 119, 238, 63, 95, 38, 141, 61, 132, 0, 232, 0, 232, 250, 124, 127, 56, 39, 0, 56, 132, 0, 0, 0, 255, 255, 0, 0, 0, 0, 0, 0, 181, 199, 5, 189, 138, 194, 238, 63, 1, 73, 187, 61, 18, 18, 124, 0, 125, 0, 238, 127, 104, 56, 54, 55, 132, 0, 0, 0, 255, 255, 0, 0, 0, 0, 0, 0, 202, 180, 170, 188, 119, 184, 237, 63, 94, 38, 141, 61, 115, 209, 232, 0, 241, 26, 133, 127, 131, 59, 115, 57, 132, 0, 0, 0, 255, 255, 0, 0, 0, 0, 0, 0, 165, 110, 33, 189, 91, 229, 237, 63, 44, 92, 185, 61, 217, 217, 113, 0, 119, 0, 41, 127, 121, 54, 199, 56, 132, 0, 0, 0, 255, 255, 0, 0, 0, 0, 0, 0, 118, 30, 15, 189, 221, 119, 238, 63, 186, 239, 187, 61, 0, 0, 127, 0, 127, 0, 0, 127, 3, 56, 0, 56, 132, 0, 0, 0, 255, 255, 0, 0, 0, 0, 0, 0, 31, 81, 27, 189, 76, 160, 238, 63, 1, 73, 187, 61, 232, 10, 124, 0, 124, 0, 24, 127, 253, 54, 147, 55, 132, 0, 0, 0, 255, 255, 0, 0, 0, 0, 0, 0, 91, 43, 20, 189, 71, 22, 238, 63, 1, 73, 187, 61, 246, 232, 124, 0, 126, 0, 10, 127, 153, 55, 133, 56, 132, 0, 0, 0, 255, 255, 0, 0, 0, 0, 0, 0, 118, 30, 15, 189, 129, 225, 238, 63, 1, 73, 187, 61, 0, 26, 124, 0, 126, 0, 0, 127, 3, 56, 226, 54, 132, 0, 0, 0, 255, 255, 0, 0, 0, 0, 0, 0, 218, 233, 1, 189, 221, 119, 238, 63, 1, 73, 187, 61, 26, 0, 124, 0, 124, 0, 230, 127, 147, 56, 0, 56, 132, 0, 0, 0, 255, 255, 0, 0, 0, 0, 0, 0, 133, 16, 10, 189, 71, 22, 238, 63, 1, 73, 187, 61, 10, 232, 124, 0, 126, 0, 246, 127, 58, 56, 133, 56, 132, 0, 0, 0, 255, 255, 0, 0, 0, 0, 0, 0, 43, 116, 24, 189, 47, 45, 238, 63, 1, 73, 187, 61, 238, 238, 124, 0, 125, 0, 18, 127, 60, 55, 101, 56, 132, 0, 0, 0, 255, 255, 0, 0, 0, 0, 0, 0, 31, 81, 27, 189, 109, 79, 238, 63, 1, 73, 187, 61, 232, 246, 124, 0, 124, 0, 24, 127, 253, 54, 55, 56, 132, 0, 0, 0, 255, 255, 0, 0, 0, 0, 0, 0, 136, 226, 72, 189, 119, 184, 237, 63, 254, 11, 167, 61, 148, 211, 47, 0, 54, 247, 114, 127, 63, 50, 4, 57, 132, 0, 0, 0, 255, 255, 0, 0, 0, 0, 0, 0, 68, 208, 197, 188, 42, 22, 237, 63, 94, 38, 141, 61, 88, 168, 232, 0, 11, 44, 138, 127, 177, 58, 174, 58, 132, 0, 0, 0, 255, 255, 0, 0, 0, 0, 0, 0, 118, 30, 15, 189, 17, 108, 240, 63, 253, 11, 167, 61, 0, 117, 47, 0, 126, 0, 0, 127, 3, 56, 100, 49, 132, 0, 0, 0, 255, 255, 0, 0, 0, 0, 0, 0 ),
"array_index_data": PoolByteArray( 0, 0, 2, 0, 1, 0, 3, 0, 5, 0, 4, 0, 6, 0, 2, 0, 7, 0, 6, 0, 9, 0, 8, 0, 10, 0, 12, 0, 11, 0, 13, 0, 15, 0, 14, 0, 16, 0, 18, 0, 17, 0, 19, 0, 20, 0, 9, 0, 21, 0, 3, 0, 22, 0, 23, 0, 5, 0, 24, 0, 25, 0, 16, 0, 26, 0, 26, 0, 28, 0, 27, 0, 0, 0, 30, 0, 29, 0, 31, 0, 32, 0, 25, 0, 33, 0, 35, 0, 34, 0, 36, 0, 20, 0, 37, 0, 38, 0, 40, 0, 39, 0, 41, 0, 43, 0, 42, 0, 8, 0, 44, 0, 2, 0, 45, 0, 21, 0, 46, 0, 47, 0, 48, 0, 45, 0, 35, 0, 11, 0, 49, 0, 13, 0, 51, 0, 50, 0, 52, 0, 47, 0, 45, 0, 53, 0, 28, 0, 47, 0, 9, 0, 54, 0, 8, 0, 20, 0, 55, 0, 9, 0, 44, 0, 57, 0, 56, 0, 17, 0, 59, 0, 58, 0, 44, 0, 33, 0, 34, 0, 60, 0, 3, 0, 61, 0, 62, 0, 31, 0, 25, 0, 63, 0, 27, 0, 53, 0, 64, 0, 27, 0, 65, 0, 20, 0, 46, 0, 66, 0, 17, 0, 68, 0, 67, 0, 32, 0, 38, 0, 18, 0, 40, 0, 69, 0, 39, 0, 70, 0, 50, 0, 40, 0, 61, 0, 4, 0, 12, 0, 71, 0, 73, 0, 72, 0, 74, 0, 31, 0, 75, 0, 38, 0, 68, 0, 18, 0, 73, 0, 38, 0, 76, 0, 47, 0, 58, 0, 77, 0, 78, 0, 79, 0, 23, 0, 59, 0, 80, 0, 78, 0, 31, 0, 73, 0, 76, 0, 2, 0, 56, 0, 1, 0, 30, 0, 56, 0, 81, 0, 71, 0, 41, 0, 42, 0, 57, 0, 83, 0, 82, 0, 42, 0, 70, 0, 73, 0, 83, 0, 84, 0, 15, 0, 64, 0, 25, 0, 26, 0, 43, 0, 13, 0, 50, 0, 85, 0, 86, 0, 36, 0, 67, 0, 87, 0, 59, 0, 88, 0, 81, 0, 41, 0, 52, 0, 46, 0, 86, 0, 89, 0, 7, 0, 0, 0, 90, 0, 72, 0, 74, 0, 89, 0, 6, 0, 7, 0, 89, 0, 19, 0, 6, 0, 89, 0, 37, 0, 19, 0, 89, 0, 36, 0, 37, 0, 89, 0, 85, 0, 36, 0, 89, 0, 63, 0, 85, 0, 89, 0, 65, 0, 63, 0, 89, 0, 64, 0, 65, 0, 89, 0, 62, 0, 64, 0, 89, 0, 75, 0, 62, 0, 89, 0, 74, 0, 75, 0, 89, 0, 90, 0, 74, 0, 89, 0, 91, 0, 90, 0, 89, 0, 29, 0, 91, 0, 81, 0, 57, 0, 82, 0, 91, 0, 30, 0, 88, 0, 63, 0, 52, 0, 85, 0, 89, 0, 0, 0, 29, 0, 77, 0, 59, 0, 78, 0, 48, 0, 78, 0, 23, 0, 68, 0, 69, 0, 92, 0, 55, 0, 22, 0, 60, 0, 60, 0, 10, 0, 33, 0, 16, 0, 58, 0, 28, 0, 93, 0, 49, 0, 84, 0, 50, 0, 94, 0, 40, 0, 66, 0, 21, 0, 22, 0, 82, 0, 13, 0, 95, 0, 54, 0, 60, 0, 33, 0, 34, 0, 93, 0, 57, 0, 90, 0, 88, 0, 71, 0, 48, 0, 24, 0, 21, 0, 67, 0, 92, 0, 96, 0, 41, 0, 82, 0, 95, 0, 97, 0, 99, 0, 98, 0, 100, 0, 102, 0, 101, 0, 103, 0, 97, 0, 104, 0, 105, 0, 103, 0, 104, 0, 106, 0, 108, 0, 107, 0, 109, 0, 111, 0, 110, 0, 112, 0, 114, 0, 113, 0, 115, 0, 116, 0, 105, 0, 117, 0, 102, 0, 118, 0, 119, 0, 100, 0, 120, 0, 121, 0, 114, 0, 122, 0, 123, 0, 124, 0, 114, 0, 99, 0, 125, 0, 98, 0, 126, 0, 122, 0, 127, 0, 128, 0, 129, 0, 108, 0, 130, 0, 115, 0, 131, 0, 132, 0, 134, 0, 133, 0, 135, 0, 137, 0, 136, 0, 104, 0, 139, 0, 138, 0, 140, 0, 117, 0, 141, 0, 142, 0, 141, 0, 143, 0, 107, 0, 129, 0, 144, 0, 111, 0, 145, 0, 110, 0, 142, 0, 146, 0, 140, 0, 124, 0, 147, 0, 142, 0, 105, 0, 138, 0, 148, 0, 115, 0, 148, 0, 149, 0, 139, 0, 151, 0, 150, 0, 113, 0, 153, 0, 152, 0, 128, 0, 139, 0, 150, 0, 102, 0, 155, 0, 154, 0, 126, 0, 156, 0, 121, 0, 157, 0, 158, 0, 147, 0, 159, 0, 157, 0, 123, 0, 160, 0, 115, 0, 149, 0, 161, 0, 113, 0, 152, 0, 134, 0, 122, 0, 112, 0, 132, 0, 163, 0, 162, 0, 164, 0, 165, 0, 132, 0, 101, 0, 154, 0, 106, 0, 166, 0, 168, 0, 167, 0, 169, 0, 126, 0, 170, 0, 134, 0, 161, 0, 133, 0, 168, 0, 134, 0, 165, 0, 171, 0, 142, 0, 143, 0, 172, 0, 120, 0, 173, 0, 153, 0, 173, 0, 174, 0, 168, 0, 126, 0, 127, 0, 97, 0, 175, 0, 139, 0, 175, 0, 125, 0, 176, 0, 135, 0, 166, 0, 167, 0, 151, 0, 178, 0, 177, 0, 167, 0, 165, 0, 137, 0, 179, 0, 178, 0, 109, 0, 121, 0, 159, 0, 123, 0, 111, 0, 137, 0, 164, 0, 180, 0, 131, 0, 146, 0, 152, 0, 174, 0, 181, 0, 176, 0, 182, 0, 135, 0, 146, 0, 160, 0, 140, 0, 183, 0, 99, 0, 184, 0, 185, 0, 170, 0, 166, 0, 183, 0, 184, 0, 103, 0, 183, 0, 103, 0, 116, 0, 183, 0, 116, 0, 186, 0, 183, 0, 186, 0, 130, 0, 183, 0, 130, 0, 180, 0, 183, 0, 180, 0, 158, 0, 183, 0, 158, 0, 187, 0, 183, 0, 187, 0, 159, 0, 183, 0, 159, 0, 156, 0, 183, 0, 156, 0, 188, 0, 183, 0, 188, 0, 169, 0, 183, 0, 169, 0, 185, 0, 183, 0, 185, 0, 189, 0, 183, 0, 189, 0, 190, 0, 151, 0, 176, 0, 191, 0, 125, 0, 189, 0, 182, 0, 158, 0, 146, 0, 147, 0, 183, 0, 190, 0, 99, 0, 153, 0, 143, 0, 172, 0, 172, 0, 141, 0, 119, 0, 163, 0, 161, 0, 192, 0, 193, 0, 148, 0, 155, 0, 155, 0, 108, 0, 154, 0, 114, 0, 171, 0, 113, 0, 144, 0, 177, 0, 179, 0, 164, 0, 162, 0, 145, 0, 117, 0, 149, 0, 193, 0, 191, 0, 111, 0, 178, 0, 155, 0, 138, 0, 128, 0, 150, 0, 177, 0, 129, 0, 182, 0, 185, 0, 166, 0, 141, 0, 118, 0, 119, 0, 192, 0, 152, 0, 181, 0, 191, 0, 135, 0, 136, 0, 7, 0, 2, 0, 0, 0, 24, 0, 5, 0, 3, 0, 8, 0, 2, 0, 6, 0, 19, 0, 9, 0, 6, 0, 61, 0, 12, 0, 10, 0, 83, 0, 15, 0, 13, 0, 32, 0, 18, 0, 16, 0, 37, 0, 20, 0, 19, 0, 24, 0, 3, 0, 21, 0, 79, 0, 5, 0, 23, 0, 32, 0, 16, 0, 25, 0, 16, 0, 28, 0, 26, 0, 1, 0, 30, 0, 0, 0, 76, 0, 32, 0, 31, 0, 10, 0, 35, 0, 33, 0, 86, 0, 20, 0, 36, 0, 70, 0, 40, 0, 38, 0, 95, 0, 43, 0, 41, 0, 54, 0, 44, 0, 8, 0, 48, 0, 21, 0, 45, 0, 77, 0, 48, 0, 47, 0, 10, 0, 11, 0, 35, 0, 14, 0, 51, 0, 13, 0, 53, 0, 47, 0, 52, 0, 27, 0, 28, 0, 53, 0, 55, 0, 54, 0, 9, 0, 66, 0, 55, 0, 20, 0, 34, 0, 57, 0, 44, 0, 67, 0, 59, 0, 17, 0, 54, 0, 33, 0, 44, 0, 22, 0, 3, 0, 60, 0, 75, 0, 31, 0, 62, 0, 65, 0, 27, 0, 63, 0, 26, 0, 27, 0, 64, 0, 86, 0, 46, 0, 20, 0, 18, 0, 68, 0, 17, 0, 76, 0, 38, 0, 32, 0, 94, 0, 69, 0, 40, 0, 43, 0, 50, 0, 70, 0, 3, 0, 4, 0, 61, 0, 42, 0, 73, 0, 71, 0, 72, 0, 31, 0, 74, 0, 39, 0, 68, 0, 38, 0, 70, 0, 38, 0, 73, 0, 28, 0, 58, 0, 47, 0, 80, 0, 79, 0, 78, 0, 87, 0, 80, 0, 59, 0, 72, 0, 73, 0, 31, 0, 44, 0, 56, 0, 2, 0, 1, 0, 56, 0, 30, 0, 88, 0, 41, 0, 71, 0, 93, 0, 83, 0, 57, 0, 43, 0, 70, 0, 42, 0, 93, 0, 84, 0, 83, 0, 62, 0, 25, 0, 64, 0, 95, 0, 13, 0, 43, 0, 52, 0, 86, 0, 85, 0, 96, 0, 87, 0, 67, 0, 30, 0, 81, 0, 88, 0, 45, 0, 46, 0, 52, 0, 71, 0, 72, 0, 90, 0, 56, 0, 57, 0, 81, 0, 29, 0, 30, 0, 91, 0, 53, 0, 52, 0, 63, 0, 58, 0, 59, 0, 77, 0, 77, 0, 78, 0, 48, 0, 39, 0, 69, 0, 68, 0, 66, 0, 22, 0, 55, 0, 61, 0, 10, 0, 60, 0, 17, 0, 58, 0, 16, 0, 35, 0, 49, 0, 93, 0, 51, 0, 94, 0, 50, 0, 46, 0, 21, 0, 66, 0, 83, 0, 13, 0, 82, 0, 55, 0, 60, 0, 54, 0, 35, 0, 93, 0, 34, 0, 91, 0, 88, 0, 90, 0, 23, 0, 24, 0, 48, 0, 68, 0, 92, 0, 67, 0, 81, 0, 82, 0, 41, 0, 184, 0, 99, 0, 97, 0, 118, 0, 102, 0, 100, 0, 184, 0, 97, 0, 103, 0, 116, 0, 103, 0, 105, 0, 154, 0, 108, 0, 106, 0, 178, 0, 111, 0, 109, 0, 122, 0, 114, 0, 112, 0, 186, 0, 116, 0, 115, 0, 193, 0, 102, 0, 117, 0, 118, 0, 100, 0, 119, 0, 123, 0, 114, 0, 121, 0, 157, 0, 124, 0, 123, 0, 190, 0, 125, 0, 99, 0, 121, 0, 122, 0, 126, 0, 150, 0, 129, 0, 128, 0, 186, 0, 115, 0, 130, 0, 165, 0, 134, 0, 132, 0, 167, 0, 137, 0, 135, 0, 97, 0, 139, 0, 104, 0, 160, 0, 117, 0, 140, 0, 140, 0, 141, 0, 142, 0, 108, 0, 129, 0, 107, 0, 164, 0, 145, 0, 111, 0, 147, 0, 146, 0, 142, 0, 157, 0, 147, 0, 124, 0, 104, 0, 138, 0, 105, 0, 105, 0, 148, 0, 115, 0, 175, 0, 151, 0, 139, 0, 171, 0, 153, 0, 113, 0, 138, 0, 139, 0, 128, 0, 193, 0, 155, 0, 102, 0, 188, 0, 156, 0, 126, 0, 187, 0, 158, 0, 157, 0, 187, 0, 157, 0, 159, 0, 131, 0, 115, 0, 160, 0, 112, 0, 113, 0, 161, 0, 127, 0, 122, 0, 134, 0, 133, 0, 163, 0, 132, 0, 137, 0, 165, 0, 164, 0, 102, 0, 154, 0, 101, 0, 170, 0, 168, 0, 166, 0, 188, 0, 126, 0, 169, 0, 112, 0, 161, 0, 134, 0, 127, 0, 134, 0, 168, 0, 124, 0, 142, 0, 171, 0, 119, 0, 120, 0, 172, 0, 172, 0, 173, 0, 153, 0, 170, 0, 126, 0, 168, 0, 98, 0, 175, 0, 97, 0, 98, 0, 125, 0, 175, 0, 182, 0, 166, 0, 135, 0, 191, 0, 178, 0, 151, 0, 168, 0, 165, 0, 167, 0, 177, 0, 178, 0, 179, 0, 156, 0, 159, 0, 121, 0, 136, 0, 137, 0, 111, 0, 130, 0, 131, 0, 180, 0, 153, 0, 174, 0, 152, 0, 125, 0, 182, 0, 176, 0, 131, 0, 160, 0, 146, 0, 169, 0, 170, 0, 185, 0, 175, 0, 176, 0, 151, 0, 190, 0, 189, 0, 125, 0, 180, 0, 146, 0, 158, 0, 171, 0, 143, 0, 153, 0, 143, 0, 141, 0, 172, 0, 133, 0, 161, 0, 163, 0, 149, 0, 148, 0, 193, 0, 128, 0, 108, 0, 155, 0, 124, 0, 171, 0, 114, 0, 129, 0, 177, 0, 144, 0, 132, 0, 162, 0, 164, 0, 160, 0, 149, 0, 117, 0, 136, 0, 111, 0, 191, 0, 148, 0, 138, 0, 155, 0, 151, 0, 177, 0, 150, 0, 189, 0, 185, 0, 182, 0, 117, 0, 118, 0, 141, 0, 161, 0, 152, 0, 192, 0, 176, 0, 135, 0, 191, 0 ),
"blend_shape_data": [  ],
"format": 97751,
"index_count": 1056,
"material": ExtResource( 1 ),
"primitive": 4,
"skeleton_aabb": [ AABB( 0, 0, 0, -1, -1, -1 ), AABB( 0, 0, 0, -1, -1, -1 ), AABB( 0, 0, 0, -1, -1, -1 ), AABB( 0, 0, 0, -1, -1, -1 ), AABB( 0, 0, 0, -1, -1, -1 ), AABB( 0, 0, 0, -1, -1, -1 ), AABB( 0, 0, 0, -1, -1, -1 ), AABB( 0, 0, 0, -1, -1, -1 ), AABB( 0, 0, 0, -1, -1, -1 ), AABB( 0, 0, 0, -1, -1, -1 ), AABB( 0, 0, 0, -1, -1, -1 ), AABB( 0, 0, 0, -1, -1, -1 ), AABB( 0, 0, 0, -1, -1, -1 ), AABB( 0, 0, 0, -1, -1, -1 ), AABB( 0, 0, 0, -1, -1, -1 ), AABB( 0, 0, 0, -1, -1, -1 ), AABB( 0, 0, 0, -1, -1, -1 ), AABB( 0, 0, 0, -1, -1, -1 ), AABB( 0, 0, 0, -1, -1, -1 ), AABB( 0, 0, 0, -1, -1, -1 ), AABB( 0, 0, 0, -1, -1, -1 ), AABB( 0, 0, 0, -1, -1, -1 ), AABB( 0, 0, 0, -1, -1, -1 ), AABB( 0, 0, 0, -1, -1, -1 ), AABB( 0, 0, 0, -1, -1, -1 ), AABB( 0, 0, 0, -1, -1, -1 ), AABB( 0, 0, 0, -1, -1, -1 ), AABB( 0, 0, 0, -1, -1, -1 ), AABB( 0, 0, 0, -1, -1, -1 ), AABB( 0, 0, 0, -1, -1, -1 ), AABB( 0, 0, 0, -1, -1, -1 ), AABB( 0, 0, 0, -1, -1, -1 ), AABB( 0, 0, 0, -1, -1, -1 ), AABB( 0, 0, 0, -1, -1, -1 ), AABB( 0, 0, 0, -1, -1, -1 ), AABB( 0, 0, 0, -1, -1, -1 ), AABB( 0, 0, 0, -1, -1, -1 ), AABB( 0, 0, 0, -1, -1, -1 ), AABB( 0, 0, 0, -1, -1, -1 ), AABB( 0, 0, 0, -1, -1, -1 ), AABB( 0, 0, 0, -1, -1, -1 ), AABB( 0, 0, 0, -1, -1, -1 ), AABB( 0, 0, 0, -1, -1, -1 ), AABB( 0, 0, 0, -1, -1, -1 ), AABB( 0, 0, 0, -1, -1, -1 ), AABB( 0, 0, 0, -1, -1, -1 ), AABB( 0, 0, 0, -1, -1, -1 ), AABB( 0, 0, 0, -1, -1, -1 ), AABB( 0, 0, 0, -1, -1, -1 ), AABB( 0, 0, 0, -1, -1, -1 ), AABB( 0, 0, 0, -1, -1, -1 ), AABB( 0, 0, 0, -1, -1, -1 ), AABB( 0, 0, 0, -1, -1, -1 ), AABB( 0, 0, 0, -1, -1, -1 ), AABB( 0, 0, 0, -1, -1, -1 ), AABB( 0, 0, 0, -1, -1, -1 ), AABB( 0, 0, 0, -1, -1, -1 ), AABB( 0, 0, 0, -1, -1, -1 ), AABB( 0, 0, 0, -1, -1, -1 ), AABB( 0, 0, 0, -1, -1, -1 ), AABB( 0, 0, 0, -1, -1, -1 ), AABB( 0, 0, 0, -1, -1, -1 ), AABB( 0, 0, 0, -1, -1, -1 ), AABB( 0, 0, 0, -1, -1, -1 ), AABB( 0, 0, 0, -1, -1, -1 ), AABB( 0, 0, 0, -1, -1, -1 ), AABB( 0, 0, 0, -1, -1, -1 ), AABB( 0, 0, 0, -1, -1, -1 ), AABB( 0, 0, 0, -1, -1, -1 ), AABB( 0, 0, 0, -1, -1, -1 ), AABB( 0, 0, 0, -1, -1, -1 ), AABB( 0, 0, 0, -1, -1, -1 ), AABB( 0, 0, 0, -1, -1, -1 ), AABB( 0, 0, 0, -1, -1, -1 ), AABB( 0, 0, 0, -1, -1, -1 ), AABB( 0, 0, 0, -1, -1, -1 ), AABB( 0, 0, 0, -1, -1, -1 ), AABB( 0, 0, 0, -1, -1, -1 ), AABB( 0, 0, 0, -1, -1, -1 ), AABB( 0, 0, 0, -1, -1, -1 ), AABB( 0, 0, 0, -1, -1, -1 ), AABB( 0, 0, 0, -1, -1, -1 ), AABB( 0, 0, 0, -1, -1, -1 ), AABB( 0, 0, 0, -1, -1, -1 ), AABB( 0, 0, 0, -1, -1, -1 ), AABB( 0, 0, 0, -1, -1, -1 ), AABB( 0, 0, 0, -1, -1, -1 ), AABB( 0, 0, 0, -1, -1, -1 ), AABB( 0, 0, 0, -1, -1, -1 ), AABB( 0, 0, 0, -1, -1, -1 ), AABB( 0, 0, 0, -1, -1, -1 ), AABB( 0, 0, 0, -1, -1, -1 ), AABB( 0, 0, 0, -1, -1, -1 ), AABB( 0, 0, 0, -1, -1, -1 ), AABB( 0, 0, 0, -1, -1, -1 ), AABB( 0, 0, 0, -1, -1, -1 ), AABB( 0, 0, 0, -1, -1, -1 ), AABB( 0, 0, 0, -1, -1, -1 ), AABB( 0, 0, 0, -1, -1, -1 ), AABB( 0, 0, 0, -1, -1, -1 ), AABB( 0, 0, 0, -1, -1, -1 ), AABB( 0, 0, 0, -1, -1, -1 ), AABB( 0, 0, 0, -1, -1, -1 ), AABB( 0, 0, 0, -1, -1, -1 ), AABB( 0, 0, 0, -1, -1, -1 ), AABB( 0, 0, 0, -1, -1, -1 ), AABB( 0, 0, 0, -1, -1, -1 ), AABB( 0, 0, 0, -1, -1, -1 ), AABB( 0, 0, 0, -1, -1, -1 ), AABB( 0, 0, 0, -1, -1, -1 ), AABB( 0, 0, 0, -1, -1, -1 ), AABB( 0, 0, 0, -1, -1, -1 ), AABB( 0, 0, 0, -1, -1, -1 ), AABB( 0, 0, 0, -1, -1, -1 ), AABB( 0, 0, 0, -1, -1, -1 ), AABB( 0, 0, 0, -1, -1, -1 ), AABB( 0, 0, 0, -1, -1, -1 ), AABB( 0, 0, 0, -1, -1, -1 ), AABB( 0, 0, 0, -1, -1, -1 ), AABB( 0, 0, 0, -1, -1, -1 ), AABB( 0, 0, 0, -1, -1, -1 ), AABB( 0, 0, 0, -1, -1, -1 ), AABB( 0, 0, 0, -1, -1, -1 ), AABB( 0, 0, 0, -1, -1, -1 ), AABB( 0, 0, 0, -1, -1, -1 ), AABB( 0.0184182, 1.84651, 0.0689208, 0.033046, 0.0330459, 0.022845 ), AABB( 0, 0, 0, -1, -1, -1 ), AABB( 0, 0, 0, -1, -1, -1 ), AABB( 0, 0, 0, -1, -1, -1 ), AABB( 0, 0, 0, -1, -1, -1 ), AABB( 0, 0, 0, -1, -1, -1 ), AABB( 0, 0, 0, -1, -1, -1 ), AABB( -0.0514642, 1.84651, 0.0689208, 0.033046, 0.0330459, 0.022845 ) ],
"vertex_count": 194
}

[sub_resource type="Skin" id=2]
resource_name = "Skin"
bind_count = 156
bind/0/name = "global"
bind/0/bone = -1
bind/0/pose = Transform( 1, 1.23313e-13, -7.2267e-07, 1.66723e-13, 1, 4.01339e-07, 7.2267e-07, -4.01339e-07, 1, -6.97974e-09, 0.0114655, 0.01051 )
bind/1/name = "position"
bind/1/bone = -1
bind/1/pose = Transform( 1, 1.19153e-13, -7.1277e-07, 1.66909e-13, 1, 4.01339e-07, 7.1277e-07, -4.01339e-07, 1, -6.87569e-09, 0.0114655, 0.01051 )
bind/2/name = "hips"
bind/2/bone = -1
bind/2/pose = Transform( 1, 5.13178e-08, -6.3035e-07, 1.85521e-08, 0.993893, 0.110346, 6.32164e-07, -0.110346, 0.993893, -7.12523e-08, -1.0268, 0.133055 )
bind/3/name = "lower_back"
bind/3/bone = -1
bind/3/pose = Transform( 1, -1.35904e-08, -7.5413e-07, -2.26092e-08, 0.998848, -0.047981, 7.53914e-07, 0.047981, 0.998848, -2.19086e-09, -1.08813, -0.0392615 )
bind/4/name = "lower_back_adjust"
bind/4/bone = -1
bind/4/pose = Transform( 1, -1.5719e-08, -7.98442e-07, -2.26092e-08, 0.998848, -0.047981, 7.98277e-07, 0.047981, 0.998848, -4.4906e-10, -1.1418, -0.0392616 )
bind/5/name = "lower_back_belly"
bind/5/bone = -1
bind/5/pose = Transform( 1, -2.17043e-08, -9.23042e-07, -2.26092e-08, 0.998848, -0.047981, 9.2302e-07, 0.047981, 0.998848, 4.44857e-09, -1.17677, -0.0392616 )
bind/6/name = "spine"
bind/6/bone = -1
bind/6/pose = Transform( 1, 1.01402e-07, 2.98477e-07, -3.32301e-08, 0.975484, -0.220071, -3.13475e-07, 0.220071, 0.975484, -1.28922e-07, -1.25481, -0.260157 )
bind/7/name = "spine_adjust"
bind/7/bone = -1
bind/7/pose = Transform( 1, 1.13304e-07, 3.51233e-07, -3.32301e-08, 0.975484, -0.220071, -3.67557e-07, 0.220071, 0.975484, -1.42942e-07, -1.29232, -0.26006 )
bind/8/name = "spine_1"
bind/8/bone = -1
bind/8/pose = Transform( 1, -6.51205e-14, -6.23173e-07, -7.1882e-13, 1, -1.2219e-06, 6.23173e-07, 1.2219e-06, 1, -3.87145e-08, -1.46054, 0.0628258 )
bind/9/name = "spine_1_adjust"
bind/9/bone = -1
bind/9/pose = Transform( 1, -1.39829e-13, -6.86461e-07, -7.21441e-13, 1, -1.2219e-06, 6.8646e-07, 1.2219e-06, 1, -4.26906e-08, -1.50252, 0.0628258 )
bind/10/name = "right_outer_breast"
bind/10/bone = -1
bind/10/pose = Transform( 0.941961, -0.0140017, 0.335431, -0.335612, -0.0136156, 0.941902, -0.00862121, -0.999809, -0.0175246, 0.0648618, -0.0507378, 1.5043 )
bind/11/name = "right_inner_breast"
bind/11/bone = -1
bind/11/pose = Transform( 0.935579, -0.0646256, 0.347153, -0.34228, 0.0757229, 0.936542, -0.0868121, -0.995032, 0.0487247, 0.13917, -0.243545, 1.48336 )
bind/12/name = "left_outer_breast"
bind/12/bone = -1
bind/12/pose = Transform( 0.941961, 0.0140016, -0.335431, 0.335612, -0.0136156, 0.941902, 0.00862107, -0.999809, -0.0175245, -0.0648617, -0.0507379, 1.5043 )
bind/13/name = "left_inner_breast"
bind/13/bone = -1
bind/13/pose = Transform( 0.935579, 0.0646256, -0.347153, 0.34228, 0.0757229, 0.936542, 0.086812, -0.995032, 0.0487247, -0.13917, -0.243545, 1.48336 )
bind/14/name = "left_shoulder"
bind/14/bone = -1
bind/14/pose = Transform( -0.294711, -0.955574, 0.00491031, 0.950546, -0.29368, -0.101066, 0.0980178, -0.0251178, 0.994868, 1.59292, 0.428172, 0.0954396 )
bind/15/name = "left_arm"
bind/15/bone = -1
bind/15/pose = Transform( -0.693215, -0.713776, 0.099886, 0.69847, -0.6995, -0.15113, 0.177743, -0.034998, 0.983455, 1.29507, 0.96523, 0.0938936 )
bind/16/name = "left_fore_arm"
bind/16/bone = -1
bind/16/pose = Transform( -0.620395, -0.784275, 0.0047373, 0.782681, -0.618725, 0.0677456, -0.0502, 0.0457368, 0.997692, 1.35395, 0.565521, 0.0732766 )
bind/17/name = "left_hand"
bind/17/bone = -1
bind/17/pose = Transform( -0.0493084, 0.0940457, 0.994346, 0.770607, -0.629765, 0.097777, 0.6354, 0.771072, -0.0414196, 0.0127393, 0.309062, -1.35058 )
bind/18/name = "left_hand_finger_5_1"
bind/18/bone = -1
bind/18/pose = Transform( -0.992545, -0.118866, -0.0269389, 0.0743453, -0.765607, 0.638999, -0.09658, 0.632232, 0.768736, 0.776523, 0.90826, -0.658291 )
bind/19/name = "left_hand_finger_5_2"
bind/19/bone = -1
bind/19/pose = Transform( -0.992854, -0.0966306, 0.0700259, 0.119285, -0.786343, 0.606166, -0.00350981, 0.610187, 0.79225, 0.753635, 0.869484, -0.691319 )
bind/20/name = "left_hand_finger_5_3"
bind/20/bone = -1
bind/20/pose = Transform( -0.984252, -0.167113, 0.0576331, 0.170923, -0.816509, 0.551451, -0.0450965, 0.552618, 0.832214, 0.828862, 0.831322, -0.598006 )
bind/21/name = "left_hand_finger_1_1"
bind/21/bone = -1
bind/21/pose = Transform( 0.390028, 0.234283, 0.8905, 0.646904, -0.757939, -0.0839282, 0.655282, 0.608802, -0.447176, -0.429601, 0.434953, -1.2166 )
bind/22/name = "left_hand_finger_1_2"
bind/22/bone = -1
bind/22/pose = Transform( 0.385461, 0.193311, 0.902248, 0.466129, -0.884665, -0.00959764, 0.796332, 0.424263, -0.431112, -0.378145, 0.676316, -1.10431 )
bind/23/name = "left_hand_finger_1_3"
bind/23/bone = -1
bind/23/pose = Transform( 0.433326, 0.223098, 0.873188, 0.393041, -0.918665, 0.0396674, 0.811016, 0.32601, -0.485768, -0.449719, 0.748869, -1.01206 )
bind/24/name = "left_hand_finger_2_1"
bind/24/bone = -1
bind/24/pose = Transform( 0.220196, 0.222111, 0.949832, 0.62787, -0.777474, 0.0362494, 0.746521, 0.588389, -0.310653, -0.314734, 0.48206, -1.24251 )
bind/25/name = "left_hand_finger_2_2"
bind/25/bone = -1
bind/25/pose = Transform( 0.207569, 0.223243, 0.952407, 0.505083, -0.85825, 0.0910942, 0.837739, 0.462136, -0.290902, -0.306657, 0.625711, -1.16201 )
bind/26/name = "left_hand_finger_2_3"
bind/26/bone = -1
bind/26/pose = Transform( 0.194864, 0.215056, 0.956964, 0.366724, -0.920879, 0.132272, 0.909693, 0.325166, -0.258313, -0.28771, 0.766354, -1.0596 )
bind/27/name = "left_hand_finger_3_1"
bind/27/bone = -1
bind/27/pose = Transform( 0.0576452, 0.206654, 0.976715, 0.678938, -0.725385, 0.113407, 0.731929, 0.656591, -0.18212, -0.208506, 0.389966, -1.29803 )
bind/28/name = "left_hand_finger_3_2"
bind/28/bone = -1
bind/28/pose = Transform( 0.079894, 0.149245, 0.985568, 0.559624, -0.82492, 0.0795528, 0.824887, 0.545192, -0.149427, -0.158784, 0.535091, -1.23696 )
bind/29/name = "left_hand_finger_3_3"
bind/29/bone = -1
bind/29/pose = Transform( 0.0320837, 0.161219, 0.986397, 0.480479, -0.867876, 0.12622, 0.87642, 0.469893, -0.105307, -0.135727, 0.602722, -1.18989 )
bind/30/name = "left_hand_finger_4_1"
bind/30/bone = -1
bind/30/pose = Transform( -0.0551933, 0.194053, 0.979437, 0.73433, -0.656769, 0.171505, 0.676545, 0.728696, -0.10625, -0.141596, 0.276016, -1.33479 )
bind/31/name = "left_hand_finger_4_2"
bind/31/bone = -1
bind/31/pose = Transform( -0.0678895, 0.202986, 0.976826, 0.608335, -0.7676, 0.201788, 0.790772, 0.607936, -0.0713714, -0.142549, 0.436546, -1.27963 )
bind/32/name = "left_hand_finger_4_3"
bind/32/bone = -1
bind/32/pose = Transform( -0.0567189, 0.193731, 0.979414, 0.488109, -0.850381, 0.196475, 0.870938, 0.489204, -0.046329, -0.140625, 0.583741, -1.20732 )
bind/33/name = "left_fore_arm_adjust"
bind/33/bone = -1
bind/33/pose = Transform( -0.620395, -0.784275, 0.00473677, 0.782681, -0.618726, 0.0677456, -0.0502004, 0.0457364, 0.997692, 1.35395, 0.530452, 0.0732774 )
bind/34/name = "left_fore_arm_twist"
bind/34/bone = -1
bind/34/pose = Transform( -0.620395, -0.784275, 0.00473646, 0.782681, -0.618726, 0.0677456, -0.0502006, 0.0457362, 0.997692, 1.35395, 0.425245, 0.0732778 )
bind/35/name = "left_fore_arm_twist_adjust"
bind/35/bone = -1
bind/35/pose = Transform( -0.620395, -0.784275, 0.00473656, 0.782681, -0.618726, 0.0677456, -0.0502005, 0.0457363, 0.997692, 1.35395, 0.390176, 0.0732777 )
bind/36/name = "left_arm_adjust"
bind/36/bone = -1
bind/36/pose = Transform( -0.69687, -0.616763, -0.366026, 0.69847, -0.6995, -0.15113, -0.162823, -0.360976, 0.918251, 1.105, 0.895739, 0.681902 )
bind/37/name = "left_shoulder_adjust"
bind/37/bone = -1
bind/37/pose = Transform( -0.310472, -0.907222, -0.283823, 0.950546, -0.29368, -0.101066, 0.00833579, -0.301165, 0.953536, 1.49678, 0.387746, 0.553302 )
bind/38/name = "left_trapezius"
bind/38/bone = -1
bind/38/pose = Transform( 3.50178e-07, 1.39326e-06, -1, 1, -5.93724e-08, 3.8743e-07, -1.13854e-07, -1, -1.34483e-06, -0.0995377, -0.0937125, 1.67642 )
bind/39/name = "right_shoulder"
bind/39/bone = -1
bind/39/pose = Transform( -0.294712, 0.955574, -0.00491025, -0.950546, -0.29368, -0.101066, -0.0980178, -0.0251179, 0.994868, -1.59292, 0.428172, 0.0954397 )
bind/40/name = "right_arm"
bind/40/bone = -1
bind/40/pose = Transform( -0.693215, 0.713775, -0.0998861, -0.69847, -0.6995, -0.15113, -0.177743, -0.0349981, 0.983455, -1.29507, 0.96523, 0.0938936 )
bind/41/name = "right_fore_arm"
bind/41/bone = -1
bind/41/pose = Transform( -0.620396, 0.784275, -0.00473712, -0.782681, -0.618726, 0.0677456, 0.0502001, 0.0457367, 0.997692, -1.35394, 0.565522, 0.0732768 )
bind/42/name = "right_hand"
bind/42/bone = -1
bind/42/pose = Transform( -0.0493084, -0.0940455, -0.994346, -0.770607, -0.629765, 0.0977769, -0.6354, 0.771071, -0.0414194, -0.0127396, 0.309062, -1.35058 )
bind/43/name = "right_hand_finger_5_1"
bind/43/bone = -1
bind/43/pose = Transform( -0.992545, 0.118866, 0.0269392, -0.074345, -0.765606, 0.639, 0.0965804, 0.632233, 0.768735, -0.776523, 0.908258, -0.658292 )
bind/44/name = "right_hand_finger_5_2"
bind/44/bone = -1
bind/44/pose = Transform( -0.992854, 0.0966343, -0.0700226, -0.119285, -0.786342, 0.606167, 0.0035148, 0.610188, 0.792249, -0.753639, 0.869482, -0.691317 )
bind/45/name = "right_hand_finger_5_3"
bind/45/bone = -1
bind/45/pose = Transform( -0.984253, 0.167112, -0.0576316, -0.170921, -0.816508, 0.551454, 0.0450981, 0.552621, 0.832212, -0.828862, 0.83132, -0.598009 )
bind/46/name = "right_hand_finger_1_1"
bind/46/bone = -1
bind/46/pose = Transform( 0.390027, -0.234283, -0.8905, -0.646904, -0.757939, -0.0839273, -0.655282, 0.608802, -0.447176, 0.429601, 0.434953, -1.2166 )
bind/47/name = "right_hand_finger_1_2"
bind/47/bone = -1
bind/47/pose = Transform( 0.385461, -0.193311, -0.902248, -0.466129, -0.884665, -0.00959708, -0.796332, 0.424263, -0.431111, 0.378145, 0.676315, -1.10431 )
bind/48/name = "right_hand_finger_1_3"
bind/48/bone = -1
bind/48/pose = Transform( 0.433325, -0.223098, -0.873188, -0.393041, -0.918665, 0.0396678, -0.811017, 0.32601, -0.485767, 0.449719, 0.748869, -1.01206 )
bind/49/name = "right_hand_finger_2_1"
bind/49/bone = -1
bind/49/pose = Transform( 0.220195, -0.222111, -0.949832, -0.62787, -0.777474, 0.0362505, -0.746521, 0.588389, -0.310653, 0.314734, 0.48206, -1.24251 )
bind/50/name = "right_hand_finger_2_2"
bind/50/bone = -1
bind/50/pose = Transform( 0.207569, -0.223244, -0.952406, -0.505083, -0.85825, 0.0910953, -0.837739, 0.462135, -0.290902, 0.306659, 0.625711, -1.16201 )
bind/51/name = "right_hand_finger_2_3"
bind/51/bone = -1
bind/51/pose = Transform( 0.194864, -0.215058, -0.956963, -0.366726, -0.920878, 0.132273, -0.909692, 0.325168, -0.258313, 0.287713, 0.76635, -1.0596 )
bind/52/name = "right_hand_finger_3_1"
bind/52/bone = -1
bind/52/pose = Transform( 0.0576447, -0.206655, -0.976715, -0.678938, -0.725385, 0.113408, -0.73193, 0.656591, -0.18212, 0.208507, 0.389966, -1.29803 )
bind/53/name = "right_hand_finger_3_2"
bind/53/bone = -1
bind/53/pose = Transform( 0.0798938, -0.149246, -0.985567, -0.559624, -0.82492, 0.0795536, -0.824887, 0.545191, -0.149428, 0.158785, 0.535091, -1.23696 )
bind/54/name = "right_hand_finger_3_3"
bind/54/bone = -1
bind/54/pose = Transform( 0.0320831, -0.16122, -0.986397, -0.480478, -0.867876, 0.126221, -0.87642, 0.469893, -0.105307, 0.135728, 0.602722, -1.18989 )
bind/55/name = "right_hand_finger_4_1"
bind/55/bone = -1
bind/55/pose = Transform( -0.055194, -0.194054, -0.979437, -0.73433, -0.656769, 0.171506, -0.676545, 0.728696, -0.10625, 0.141597, 0.276015, -1.33479 )
bind/56/name = "right_hand_finger_4_2"
bind/56/bone = -1
bind/56/pose = Transform( -0.0678897, -0.202987, -0.976825, -0.608335, -0.7676, 0.201789, -0.790772, 0.607936, -0.0713718, 0.142551, 0.436545, -1.27963 )
bind/57/name = "right_hand_finger_4_3"
bind/57/bone = -1
bind/57/pose = Transform( -0.0567189, -0.193732, -0.979414, -0.488109, -0.850381, 0.196475, -0.870938, 0.489204, -0.0463294, 0.140627, 0.58374, -1.20732 )
bind/58/name = "right_fore_arm_adjust"
bind/58/bone = -1
bind/58/pose = Transform( -0.620396, 0.784275, -0.00473666, -0.782681, -0.618726, 0.0677456, 0.0502004, 0.0457363, 0.997692, -1.35394, 0.530453, 0.0732776 )
bind/59/name = "right_fore_arm_twist"
bind/59/bone = -1
bind/59/pose = Transform( -0.620396, 0.784275, -0.00473627, -0.782681, -0.618726, 0.0677456, 0.0502007, 0.045736, 0.997692, -1.35394, 0.425246, 0.0732781 )
bind/60/name = "right_fore_arm_twist_adjust"
bind/60/bone = -1
bind/60/pose = Transform( -0.620396, 0.784275, -0.0047365, -0.782681, -0.618726, 0.0677456, 0.0502005, 0.0457362, 0.997692, -1.35394, 0.390177, 0.0732778 )
bind/61/name = "right_arm_adjust"
bind/61/bone = -1
bind/61/pose = Transform( -0.696871, 0.616762, 0.366027, -0.69847, -0.6995, -0.15113, 0.162825, -0.360976, 0.918251, -1.105, 0.89574, 0.681904 )
bind/62/name = "right_shoulder_adjust"
bind/62/bone = -1
bind/62/pose = Transform( -0.310472, 0.907222, 0.283823, -0.950546, -0.29368, -0.101066, -0.00833586, -0.301165, 0.953536, -1.49678, 0.387746, 0.553302 )
bind/63/name = "right_trapezius"
bind/63/bone = -1
bind/63/pose = Transform( 3.57628e-07, -1.35787e-06, 1, -1, -7.73003e-08, 3.57628e-07, 9.12692e-08, -1, -1.30758e-06, 0.0995377, -0.0937124, 1.67642 )
bind/64/name = "neck"
bind/64/bone = -1
bind/64/pose = Transform( 1, -4.55301e-09, 3.79311e-09, 3.7926e-09, 0.983539, 0.180697, -4.5536e-09, -0.180697, 0.983539, 8.22354e-09, -1.619, 0.361323 )
bind/65/name = "neck_adjust"
bind/65/bone = -1
bind/65/pose = Transform( 1, 1.51894e-07, -8.47755e-07, 3.79278e-09, 0.983539, 0.180697, 8.61246e-07, -0.180697, 0.983539, -3.0461e-07, -1.65456, 0.361323 )
bind/66/name = "head"
bind/66/bone = -1
bind/66/pose = Transform( 1, -2.29015e-08, -2.61161e-07, 2.68635e-08, 0.999885, 0.015181, 2.60783e-07, -0.015181, 0.999885, 2.87331e-08, -1.75734, 0.071037 )
bind/67/name = "head_adjust"
bind/67/bone = -1
bind/67/pose = Transform( 1, -2.4408e-08, -1.61938e-07, 2.68635e-08, 0.999885, 0.015181, 1.61548e-07, -0.015181, 0.999885, 3.57824e-08, -1.80929, 0.071037 )
bind/68/name = "mandible"
bind/68/bone = -1
bind/68/pose = Transform( -1, -2.73826e-09, 5.96829e-08, 5.24514e-08, -0.518552, 0.855047, 2.86072e-08, 0.855046, 0.518552, 9.39464e-05, 0.925702, -1.54558 )
bind/69/name = "left_lips"
bind/69/bone = -1
bind/69/pose = Transform( -0.986748, 3.86967e-08, 0.162262, 0.162262, 1.14447e-07, 0.986748, 2.53568e-08, 1, -3.96803e-07, 0.0109806, -0.0903346, -1.78282 )
bind/70/name = "left_lips_adjust"
bind/70/bone = -1
bind/70/pose = Transform( -0.986748, 2.8749e-08, 0.162262, 0.162262, 1.14447e-07, 0.986748, 1.55409e-08, 1, -3.95189e-07, 0.0109806, -0.0903346, -1.78282 )
bind/71/name = "right_lips"
bind/71/bone = -1
bind/71/pose = Transform( -0.986748, -2.41686e-08, -0.162262, -0.162262, 2.67849e-07, 0.986748, 4.77689e-08, 1, -5.65994e-07, -0.0109807, -0.0903349, -1.78282 )
bind/72/name = "right_lips_adjust"
bind/72/bone = -1
bind/72/pose = Transform( -0.986748, -9.40746e-09, -0.162262, -0.162262, 2.67849e-07, 0.986748, 6.23344e-08, 1, -5.63599e-07, -0.0109807, -0.0903349, -1.78282 )
bind/73/name = "mandible_adjust"
bind/73/bone = -1
bind/73/pose = Transform( -1, 1.45332e-07, 1.49482e-07, 5.24514e-08, -0.518552, 0.855047, 2.0178e-07, 0.855046, 0.518552, 9.36788e-05, 0.925702, -1.54558 )
bind/74/name = "tongue_1"
bind/74/bone = -1
bind/74/pose = Transform( -1, -4.23179e-06, 4.17702e-07, 5.95598e-07, -0.0421259, 0.999112, -4.21044e-06, 0.999112, 0.0421257, 7.64917e-06, 0.0560116, -1.77506 )
bind/75/name = "tongue_2"
bind/75/bone = -1
bind/75/pose = Transform( 1, -1.0209e-05, -1.15225e-07, 6.01607e-07, 0.0476552, 0.998864, -1.01919e-05, -0.998864, 0.0476555, 1.79637e-05, -0.13178, 1.77037 )
bind/76/name = "left_low_maxilar"
bind/76/bone = -1
bind/76/pose = Transform( -0.894858, 0.134607, -0.425571, -0.44625, -0.290154, 0.846565, -0.00952784, 0.947466, 0.319715, -0.176921, 0.519427, -1.67629 )
bind/77/name = "left_low_maxilar_adjust"
bind/77/bone = -1
bind/77/pose = Transform( -0.894858, 0.134607, -0.425571, -0.44625, -0.290154, 0.846565, -0.0095272, 0.947466, 0.319715, -0.176922, 0.519427, -1.67629 )
bind/78/name = "right_low_maxilar"
bind/78/bone = -1
bind/78/pose = Transform( -0.894857, -0.134607, 0.425572, 0.44625, -0.290154, 0.846564, 0.00952809, 0.947466, 0.319715, 0.176921, 0.519427, -1.67629 )
bind/79/name = "right_low_maxilar_adjust"
bind/79/bone = -1
bind/79/pose = Transform( -0.894857, -0.134608, 0.425571, 0.44625, -0.290154, 0.846564, 0.00952744, 0.947466, 0.319715, 0.176922, 0.519427, -1.67629 )
bind/80/name = "lips_inferior"
bind/80/bone = -1
bind/80/pose = Transform( -1, -5.06626e-08, 1.88861e-07, 1.94989e-07, -0.186005, 0.982549, -1.46495e-08, 0.982549, 0.186004, 9.4037e-05, 0.234461, -1.7686 )
bind/81/name = "lips_inferior_adjust"
bind/81/bone = -1
bind/81/pose = Transform( -1, 6.6062e-07, 3.23522e-07, 1.94997e-07, -0.186005, 0.982549, 7.09268e-07, 0.982549, 0.186004, 9.27567e-05, 0.234461, -1.7686 )
bind/82/name = "left_lips_inferior"
bind/82/bone = -1
bind/82/pose = Transform( -0.991093, -0.0318637, 0.129303, 0.133124, -0.211102, 0.968357, -0.00355928, 0.976945, 0.213463, 0.0545967, 0.280519, -1.76151 )
bind/83/name = "left_lips_inferior_adjust"
bind/83/bone = -1
bind/83/pose = Transform( -0.991093, -0.0318646, 0.129303, 0.133124, -0.211102, 0.968357, -0.00356014, 0.976944, 0.213463, 0.0545982, 0.280519, -1.76151 )
bind/84/name = "right_lips_inferior"
bind/84/bone = -1
bind/84/pose = Transform( -0.991093, 0.0318637, -0.129303, -0.133124, -0.211102, 0.968357, 0.00355929, 0.976945, 0.213463, -0.0545966, 0.280519, -1.76151 )
bind/85/name = "right_lips_inferior_adjust"
bind/85/bone = -1
bind/85/pose = Transform( -0.991093, 0.0318645, -0.129303, -0.133124, -0.211102, 0.968357, 0.00356015, 0.976945, 0.213463, -0.0545981, 0.280519, -1.76151 )
bind/86/name = "left_cheek"
bind/86/bone = -1
bind/86/pose = Transform( -0.62841, -0.00526736, 0.777864, 0.777875, 1.68337e-07, 0.628419, -0.00331028, 0.999986, 0.00409717, -0.0263445, -0.0719784, -1.83719 )
bind/87/name = "left_cheek_adjust"
bind/87/bone = -1
bind/87/pose = Transform( -0.62841, -0.00526735, 0.777864, 0.777875, 1.68337e-07, 0.628419, -0.00331027, 0.999986, 0.00409716, -0.0263445, -0.0719783, -1.83719 )
bind/88/name = "lips_superior"
bind/88/bone = -1
bind/88/pose = Transform( -1, -4.65178e-07, 2.68302e-07, 1.47254e-07, 0.242938, 0.970042, -5.16423e-07, 0.970042, -0.242938, 9.4758e-05, -0.533429, -1.71113 )
bind/89/name = "lips_superior_adjust"
bind/89/bone = -1
bind/89/pose = Transform( -1, 1.03646e-06, -1.07753e-07, 1.47271e-07, 0.242938, 0.970042, 1.03159e-06, 0.970042, -0.242938, 9.21091e-05, -0.533429, -1.71113 )
bind/90/name = "left_lips_superior_middle"
bind/90/bone = -1
bind/90/pose = Transform( -0.98569, 0.0412875, 0.163434, 0.168565, 0.247231, 0.954182, -0.00101022, 0.968077, -0.250653, -0.0795088, -0.53944, -1.70669 )
bind/91/name = "left_lips_superior_middle_adjust"
bind/91/bone = -1
bind/91/pose = Transform( -0.98569, 0.0415322, 0.163371, 0.168565, 0.247231, 0.954182, -0.000761051, 0.968066, -0.250694, -0.0799402, -0.53944, -1.70667 )
bind/92/name = "right_lips_superior_middle"
bind/92/bone = -1
bind/92/pose = Transform( -0.98569, -0.0412874, -0.163434, -0.168565, 0.247231, 0.954182, 0.00101028, 0.968077, -0.250653, 0.0795086, -0.53944, -1.70669 )
bind/93/name = "right_lips_superior_middle_adjust"
bind/93/bone = -1
bind/93/pose = Transform( -0.985691, -0.0415322, -0.163371, -0.168565, 0.247231, 0.954182, 0.000761033, 0.968066, -0.250694, 0.0799402, -0.53944, -1.70667 )
bind/94/name = "upper_lips"
bind/94/bone = -1
bind/94/pose = Transform( -1, 1.55524e-07, 2.40901e-09, 4.76759e-11, -0.0151799, 0.999885, 1.55543e-07, 0.999885, 0.0151799, 9.3669e-05, -0.0461554, -1.80173 )
bind/95/name = "upper_lips_adjust"
bind/95/bone = -1
bind/95/pose = Transform( -1, 1.50978e-07, 2.34001e-09, 4.76905e-11, -0.0151799, 0.999885, 1.50996e-07, 0.999885, 0.0151799, 9.36772e-05, -0.0461554, -1.80173 )
bind/96/name = "nose_base"
bind/96/bone = -1
bind/96/pose = Transform( -1, 3.81869e-07, -5.9678e-09, -1.22106e-08, -0.0163496, 0.999866, 3.8172e-07, 0.999866, 0.0163496, 9.32541e-05, -0.0742602, -1.8251 )
bind/97/name = "nose_base_adjust"
bind/97/bone = -1
bind/97/pose = Transform( -1, 3.46476e-07, -1.92426e-08, -2.53712e-08, -0.0176964, 0.999843, 3.4608e-07, 0.999843, 0.0176964, 9.332e-05, -0.0718018, -1.8252 )
bind/98/name = "nose_middle"
bind/98/bone = -1
bind/98/pose = Transform( -0.999991, -0.00117195, 0.00416679, 0.00418352, -0.0146551, 0.999884, -0.00111075, 0.999892, 0.0146598, 0.00175281, -0.0713848, -1.8469 )
bind/99/name = "nose_middle_adjust"
bind/99/bone = -1
bind/99/pose = Transform( -0.999981, -0.00121503, 0.00598702, 0.00600305, -0.0136484, 0.999889, -0.00113319, 0.999906, 0.0136554, 0.00165312, -0.0732433, -1.84683 )
bind/100/name = "nose_top"
bind/100/bone = -1
bind/100/pose = Transform( -0.999873, 0.0158391, 0.00184587, 0.00160527, -0.0151894, 0.999883, 0.0158653, 0.999759, 0.015162, -0.0298296, -0.0499751, -1.87488 )
bind/101/name = "nose_top_adjust"
bind/101/bone = -1
bind/101/pose = Transform( -0.999873, 0.0158387, 0.00184587, 0.00160527, -0.0151894, 0.999883, 0.0158649, 0.999759, 0.015162, -0.0298288, -0.049975, -1.87488 )
bind/102/name = "right_cheek"
bind/102/bone = -1
bind/102/pose = Transform( -0.628412, 0.00526764, -0.777863, -0.777874, 1.47382e-07, 0.62842, 0.00331045, 0.999986, 0.00409739, 0.0263439, -0.0719783, -1.83719 )
bind/103/name = "right_cheek_adjust"
bind/103/bone = -1
bind/103/pose = Transform( -0.628412, 0.00526743, -0.777863, -0.777874, 1.47615e-07, 0.62842, 0.00331032, 0.999986, 0.00409723, 0.0263443, -0.0719783, -1.83719 )
bind/104/name = "left_low_cheek"
bind/104/bone = -1
bind/104/pose = Transform( -0.76728, -0.0205127, 0.640984, 0.641312, -0.0244448, 0.76689, -6.22346e-05, 0.999491, 0.031911, 0.024217, -0.0300466, -1.78866 )
bind/105/name = "left_low_cheek_adjust"
bind/105/bone = -1
bind/105/pose = Transform( -0.76728, -0.0205121, 0.640984, 0.641312, -0.0244448, 0.76689, -6.18118e-05, 0.99949, 0.0319107, 0.024216, -0.0300466, -1.78866 )
bind/106/name = "right_low_cheek"
bind/106/bone = -1
bind/106/pose = Transform( -0.76728, 0.0205122, -0.640984, -0.641312, -0.0244438, 0.766891, 6.24247e-05, 0.999491, 0.0319099, -0.0242161, -0.0300484, -1.78866 )
bind/107/name = "right_low_cheek_adjust"
bind/107/bone = -1
bind/107/pose = Transform( -0.76728, 0.020512, -0.640984, -0.641312, -0.0244438, 0.766891, 6.2298e-05, 0.999491, 0.0319098, -0.0242158, -0.0300485, -1.78866 )
bind/108/name = "left_eyebrow_low"
bind/108/bone = -1
bind/108/pose = Transform( -1, 1.49693e-07, -2.68644e-07, -2.34726e-07, 0.192885, 0.981221, 1.98699e-07, 0.981221, -0.192885, 0.0190228, -0.399827, -1.82152 )
bind/109/name = "left_eyebrow_low_adjust"
bind/109/bone = -1
bind/109/pose = Transform( -1, 2.23224e-07, -2.83099e-07, -2.34726e-07, 0.192885, 0.981221, 2.73638e-07, 0.981221, -0.192885, 0.0190227, -0.399827, -1.82152 )
bind/110/name = "right_eyebrow_low"
bind/110/bone = -1
bind/110/pose = Transform( -1, -1.25259e-07, 2.90286e-07, 2.60674e-07, 0.192885, 0.981221, -1.78898e-07, 0.981221, -0.192885, -0.0190228, -0.399827, -1.82152 )
bind/111/name = "right_eyebrow_low_adjust"
bind/111/bone = -1
bind/111/pose = Transform( -1, -1.31333e-07, 2.9148e-07, 2.60674e-07, 0.192885, 0.981221, -1.85089e-07, 0.981221, -0.192885, -0.0190228, -0.399827, -1.82152 )
bind/112/name = "left_eyebrow_middle"
bind/112/bone = -1
bind/112/pose = Transform( -1, -2.98874e-08, -1.77245e-07, -1.79682e-07, 0.192881, 0.981222, 4.8612e-09, 0.981222, -0.192881, 0.0366719, -0.398369, -1.82663 )
bind/113/name = "left_eyebrow_middle_adjust"
bind/113/bone = -1
bind/113/pose = Transform( -1, -1.41558e-10, -1.83093e-07, -1.79682e-07, 0.192881, 0.981222, 3.51763e-08, 0.981222, -0.192881, 0.0366718, -0.398369, -1.82663 )
bind/114/name = "right_eyebrow_middle"
bind/114/bone = -1
bind/114/pose = Transform( -1, 2.79785e-07, 3.22861e-07, 3.70763e-07, 0.192882, 0.981222, 2.12257e-07, 0.981222, -0.192882, -0.0366723, -0.398369, -1.82663 )
bind/115/name = "right_eyebrow_middle_adjust"
bind/115/bone = -1
bind/115/pose = Transform( -1, -2.31511e-08, 3.8241e-07, 3.70764e-07, 0.192882, 0.981222, -9.64762e-08, 0.981222, -0.192882, -0.0366718, -0.398369, -1.82663 )
bind/116/name = "left_eyebrow_up"
bind/116/bone = -1
bind/116/pose = Transform( -0.999997, -0.000412833, -0.0022168, -0.0022548, 0.173138, 0.984895, -2.27854e-05, 0.984898, -0.173138, 0.0527136, -0.351196, -1.83566 )
bind/117/name = "left_eyebrow_up_adjust"
bind/117/bone = -1
bind/117/pose = Transform( -0.999997, -0.000412621, -0.00221684, -0.0022548, 0.173138, 0.984895, -2.25698e-05, 0.984898, -0.173138, 0.0527132, -0.351196, -1.83566 )
bind/118/name = "right_eyebrow_up"
bind/118/bone = -1
bind/118/pose = Transform( -0.999997, 0.000412864, 0.00221755, 0.00225555, 0.173138, 0.984895, 2.26852e-05, 0.984897, -0.173138, -0.0527136, -0.351196, -1.83566 )
bind/119/name = "right_eyebrow_up_adjust"
bind/119/bone = -1
bind/119/pose = Transform( -0.999997, 0.000413169, 0.0022175, 0.00225555, 0.173138, 0.984895, 2.2994e-05, 0.984897, -0.173138, -0.0527142, -0.351196, -1.83566 )
bind/120/name = "left_ear"
bind/120/bone = -1
bind/120/pose = Transform( 0.96106, -0.0084261, 0.276212, 0.26164, 0.349411, -0.899698, -0.0889305, 0.936931, 0.33801, -0.0628492, -0.650023, -1.7092 )
bind/121/name = "left_ear_adjust"
bind/121/bone = -1
bind/121/pose = Transform( 0.96106, -0.00842586, 0.276212, 0.26164, 0.349411, -0.899698, -0.0889308, 0.936932, 0.33801, -0.0628497, -0.650023, -1.7092 )
bind/122/name = "right_ear"
bind/122/bone = -1
bind/122/pose = Transform( 0.96106, 0.00842602, -0.276211, -0.261639, 0.349411, -0.899698, 0.0889305, 0.936932, 0.33801, 0.0628495, -0.650023, -1.7092 )
bind/123/name = "right_ear_adjust"
bind/123/bone = -1
bind/123/pose = Transform( 0.96106, 0.00842547, -0.276211, -0.261639, 0.349411, -0.899698, 0.088931, 0.936932, 0.33801, 0.0628505, -0.650023, -1.7092 )
bind/124/name = "left_eye"
bind/124/bone = -1
bind/124/pose = Transform( -1, -1.02585e-05, 1.83709e-06, 1.83702e-06, 7.36585e-06, 1, -1.02585e-05, 1, -7.36581e-06, 0.0349601, -0.0752557, -1.86303 )
bind/125/name = "left_eye_globe"
bind/125/bone = -1
bind/125/pose = Transform( -1, -1.89614e-05, 1.83715e-06, 1.83702e-06, 7.36584e-06, 1, -1.89614e-05, 1, -7.36578e-06, 0.0349762, -0.0752556, -1.86303 )
bind/126/name = "left_eye_adjust"
bind/126/bone = -1
bind/126/pose = Transform( -1, -1.45321e-05, 1.83718e-06, 1.83708e-06, 7.36584e-06, 1, -1.45321e-05, 1, -7.3658e-06, 0.0349679, -0.0752555, -1.86303 )
bind/127/name = "left_upper_lid"
bind/127/bone = -1
bind/127/pose = Transform( -1, 0.000691709, -0.000110502, 1.60862e-05, 0.180387, 0.983596, 0.000700295, 0.983595, -0.180387, 0.0336606, -0.410075, -1.81892 )
bind/128/name = "left_upper_lid_adjust"
bind/128/bone = -1
bind/128/pose = Transform( -0.999999, 0.0013918, -0.000165793, 8.89923e-05, 0.181093, 0.983466, 0.0013988, 0.983465, -0.181093, 0.0323604, -0.411383, -1.81865 )
bind/129/name = "left_lower_lid"
bind/129/bone = -1
bind/129/pose = Transform( -1, -0.000548437, -0.000118918, 8.2731e-05, -0.353666, 0.935372, -0.00055505, 0.935372, 0.353666, 0.0359717, 0.588509, -1.76922 )
bind/130/name = "left_lower_lid_adjust"
bind/130/bone = -1
bind/130/pose = Transform( -0.999999, -0.00109548, -0.000246984, 0.000157449, -0.354539, 0.935042, -0.00111188, 0.935041, 0.354539, 0.0370004, 0.590158, -1.76865 )
bind/131/name = "right_eye"
bind/131/bone = -1
bind/131/pose = Transform( -1, 1.02709e-05, -8.64524e-07, -8.64447e-07, 7.58936e-06, 1, 1.02709e-05, 1, -7.58934e-06, -0.0349601, -0.075256, -1.86303 )
bind/132/name = "right_eye_globe"
bind/132/bone = -1
bind/132/pose = Transform( -1, 1.90106e-05, -8.6459e-07, -8.64447e-07, 7.58935e-06, 1, 1.90106e-05, 1, -7.58933e-06, -0.0349763, -0.0752559, -1.86303 )
bind/133/name = "right_eye_adjust"
bind/133/bone = -1
bind/133/pose = Transform( -1, 1.45321e-05, -8.64618e-07, -8.64508e-07, 7.58935e-06, 1, 1.45321e-05, 1, -7.58933e-06, -0.034968, -0.0752559, -1.86303 )
bind/134/name = "right_upper_lid"
bind/134/bone = -1
bind/134/pose = Transform( -1, -0.000691411, 0.000113577, -1.30069e-05, 0.180386, 0.983596, -0.000700557, 0.983596, -0.180386, -0.0336614, -0.410074, -1.81892 )
bind/135/name = "right_upper_lid_adjust"
bind/135/bone = -1
bind/135/pose = Transform( -0.999999, -0.00139197, 0.000168769, -8.60983e-05, 0.181093, 0.983466, -0.00139952, 0.983465, -0.181093, -0.0323603, -0.411383, -1.81865 )
bind/136/name = "right_lower_lid"
bind/136/bone = -1
bind/136/pose = Transform( -1, 0.000547822, 0.000120586, -8.09525e-05, -0.353665, 0.935372, 0.000555064, 0.935372, 0.353665, -0.0359707, 0.588508, -1.76922 )
bind/137/name = "right_lower_lid_adjust"
bind/137/bone = -1
bind/137/pose = Transform( -0.999999, 0.00109489, 0.00024865, -0.000155667, -0.354526, 0.935046, 0.00111192, 0.935045, 0.354526, -0.0369995, 0.590133, -1.76866 )
bind/138/name = "left_nose"
bind/138/bone = -1
bind/138/pose = Transform( -0.999958, 0.00799045, -0.00448609, -0.00456708, -0.0101465, 0.999938, 0.00794444, 0.999917, 0.0101826, 0.012095, -0.0412429, -1.81497 )
bind/139/name = "left_nose_adjust"
bind/139/bone = -1
bind/139/pose = Transform( -0.999958, 0.00799063, -0.00448608, -0.00456708, -0.0101465, 0.999938, 0.00794462, 0.999917, 0.0101826, 0.0120947, -0.0412428, -1.81497 )
bind/140/name = "right_nose"
bind/140/bone = -1
bind/140/pose = Transform( -0.999958, -0.00799071, 0.00448606, 0.00456705, -0.0101466, 0.999938, -0.0079447, 0.999917, 0.0101826, -0.0120945, -0.0412428, -1.81497 )
bind/141/name = "right_nose_adjust"
bind/141/bone = -1
bind/141/pose = Transform( -0.999958, -0.00799045, 0.00448606, 0.00456705, -0.0101466, 0.999938, -0.00794444, 0.999917, 0.0101826, -0.012095, -0.0412429, -1.81497 )
bind/142/name = "left_up_leg"
bind/142/bone = -1
bind/142/pose = Transform( -0.982549, -0.114902, 0.146273, 0.11672, -0.993157, 0.00388103, 0.144826, 0.0208863, 0.989237, 0.227313, 0.997692, -0.0196003 )
bind/143/name = "left_leg"
bind/143/bone = -1
bind/143/pose = Transform( -0.959941, -0.159197, 0.230587, 0.143454, -0.986119, -0.0836104, 0.240696, -0.0471824, 0.969453, 0.251109, 0.555909, 0.00477933 )
bind/144/name = "left_foot"
bind/144/bone = -1
bind/144/pose = Transform( 0.921948, 0.116266, -0.36945, 0.374675, -0.5094, 0.774681, -0.0981285, -0.85264, -0.513202, -0.245064, 0.0184409, 0.0954674 )
bind/145/name = "left_toe_base"
bind/145/bone = -1
bind/145/pose = Transform( 0.92968, -0.0170783, -0.367972, 0.3634, -0.120986, 0.923744, -0.0602956, -0.992507, -0.106273, -0.244074, -0.184941, 0.0525591 )
bind/146/name = "left_leg_adjust"
bind/146/bone = -1
bind/146/pose = Transform( -0.959941, -0.159197, 0.230587, 0.143454, -0.986119, -0.0836104, 0.240696, -0.0471824, 0.969453, 0.251109, 0.436982, 0.0047793 )
bind/147/name = "left_up_leg_adjust"
bind/147/bone = -1
bind/147/pose = Transform( -0.970708, -0.113254, 0.211893, 0.11672, -0.993157, 0.00388103, 0.210003, 0.0284995, 0.977285, 0.225501, 0.889703, -0.0347099 )
bind/148/name = "left_gluteus"
bind/148/bone = -1
bind/148/pose = Transform( -1, -4.53839e-07, -3.65731e-07, 2.38238e-07, 0.565907, -0.824469, 8.6416e-07, -0.824469, -0.565907, 0.109735, -0.59037, 0.828775 )
bind/149/name = "right_up_leg"
bind/149/bone = -1
bind/149/pose = Transform( -0.982549, 0.114902, -0.146272, -0.11672, -0.993157, 0.00388099, -0.144826, 0.0208862, 0.989237, -0.227313, 0.997692, -0.0196002 )
bind/150/name = "right_leg"
bind/150/bone = -1
bind/150/pose = Transform( -0.959941, 0.159196, -0.230587, -0.143454, -0.986119, -0.08361, -0.240697, -0.047182, 0.969453, -0.251109, 0.555909, 0.00477914 )
bind/151/name = "right_foot"
bind/151/bone = -1
bind/151/pose = Transform( 0.921948, -0.116266, 0.36945, -0.374676, -0.509399, 0.774681, 0.0981288, -0.85264, -0.513202, 0.245063, 0.0184405, 0.0954674 )
bind/152/name = "right_toe_base"
bind/152/bone = -1
bind/152/pose = Transform( 0.92968, 0.0170778, 0.367973, -0.363401, -0.120987, 0.923744, 0.0602954, -0.992507, -0.106273, 0.244073, -0.184941, 0.0525589 )
bind/153/name = "right_leg_adjust"
bind/153/bone = -1
bind/153/pose = Transform( -0.959941, 0.159196, -0.230587, -0.143454, -0.986119, -0.08361, -0.240697, -0.047182, 0.969453, -0.251109, 0.436981, 0.00477913 )
bind/154/name = "right_up_leg_adjust"
bind/154/bone = -1
bind/154/pose = Transform( -0.970709, 0.113254, -0.211893, -0.11672, -0.993157, 0.00388099, -0.210003, 0.0284994, 0.977285, -0.225501, 0.889703, -0.0347097 )
bind/155/name = "right_gluteus"
bind/155/bone = -1
bind/155/pose = Transform( -1, 3.26767e-07, 2.87547e-07, 5.90741e-08, 0.565907, -0.824469, -3.75711e-07, -0.824469, -0.565907, -0.109735, -0.59037, 0.828774 )

[node name="UMA_Human_Male_Eyes" type="MeshInstance"]
mesh = SubResource( 1 )
skin = SubResource( 2 )
material/0 = null
script = ExtResource( 2 )
