[gd_scene load_steps=4 format=2]

[ext_resource path="res://addons/uma/data/Core/Hair/HairMaterial.tres" type="Material" id=1]

[sub_resource type="ArrayMesh" id=1]
resource_name = "Hair06"
surfaces/0 = {
"aabb": AABB( -0.11538, 1.63642, 0.000647988, 0.23076, 0.256086, 0.096802 ),
"array_data": PoolByteArray( 128, 133, 204, 61, 132, 100, 221, 63, 123, 166, 30, 61, 119, 232, 36, 0, 28, 222, 138, 127, 106, 58, 226, 59, 67, 0, 0, 0, 255, 255, 0, 0, 0, 0, 0, 0, 19, 218, 210, 61, 94, 214, 220, 63, 153, 17, 236, 60, 119, 232, 36, 0, 25, 209, 141, 127, 237, 59, 226, 59, 67, 0, 0, 0, 255, 255, 0, 0, 0, 0, 0, 0, 240, 223, 220, 61, 10, 47, 223, 63, 71, 112, 177, 60, 125, 2, 21, 0, 21, 237, 133, 127, 237, 59, 156, 58, 67, 0, 0, 0, 255, 255, 0, 0, 0, 0, 0, 0, 159, 7, 215, 61, 144, 159, 223, 63, 6, 46, 22, 61, 125, 3, 20, 0, 21, 244, 132, 127, 106, 58, 125, 58, 67, 0, 0, 0, 255, 255, 0, 0, 0, 0, 0, 0, 12, 90, 200, 61, 77, 133, 228, 63, 36, 243, 100, 60, 126, 13, 4, 0, 5, 249, 130, 127, 237, 59, 72, 56, 67, 0, 0, 0, 255, 255, 0, 0, 0, 0, 0, 0, 143, 230, 200, 61, 129, 146, 228, 63, 80, 25, 6, 61, 125, 15, 4, 0, 5, 249, 130, 127, 106, 58, 82, 56, 67, 0, 0, 0, 255, 255, 0, 0, 0, 0, 0, 0, 91, 160, 189, 61, 11, 42, 236, 63, 253, 218, 1, 61, 122, 24, 22, 0, 24, 252, 132, 127, 106, 58, 193, 49, 67, 0, 0, 0, 255, 255, 0, 0, 0, 0, 0, 0, 124, 136, 198, 61, 213, 7, 232, 63, 83, 91, 248, 60, 126, 7, 8, 0, 9, 250, 130, 127, 106, 58, 6, 54, 67, 0, 0, 0, 255, 255, 0, 0, 0, 0, 0, 0, 13, 198, 200, 61, 163, 7, 232, 63, 77, 226, 72, 60, 126, 7, 9, 0, 9, 250, 130, 127, 237, 59, 238, 53, 67, 0, 0, 0, 255, 255, 0, 0, 0, 0, 0, 0, 192, 9, 197, 61, 181, 51, 236, 63, 208, 99, 48, 60, 122, 24, 22, 0, 23, 0, 132, 127, 237, 59, 146, 49, 67, 0, 0, 0, 255, 255, 0, 0, 0, 0, 0, 0, 152, 83, 162, 61, 117, 32, 241, 63, 199, 29, 253, 60, 117, 36, 30, 0, 27, 14, 133, 127, 106, 58, 33, 34, 67, 0, 0, 0, 255, 255, 0, 0, 0, 0, 0, 0, 53, 36, 174, 61, 210, 167, 241, 63, 43, 182, 30, 60, 117, 36, 30, 0, 24, 21, 134, 127, 237, 59, 33, 34, 67, 0, 0, 0, 255, 255, 0, 0, 0, 0, 0, 0, 146, 96, 170, 61, 116, 124, 218, 63, 190, 254, 107, 61, 90, 56, 69, 0, 69, 17, 152, 127, 243, 57, 174, 57, 67, 0, 0, 0, 255, 255, 0, 0, 0, 0, 0, 0, 102, 226, 182, 61, 5, 223, 216, 63, 14, 234, 130, 61, 86, 74, 55, 0, 61, 10, 146, 127, 243, 57, 33, 58, 67, 0, 0, 0, 255, 255, 0, 0, 0, 0, 0, 0, 215, 171, 200, 61, 184, 7, 217, 63, 39, 250, 67, 61, 89, 77, 47, 0, 58, 1, 144, 127, 239, 59, 33, 58, 67, 0, 0, 0, 255, 255, 0, 0, 0, 0, 0, 0, 74, 14, 184, 61, 24, 147, 218, 63, 106, 106, 32, 61, 116, 17, 47, 0, 48, 248, 140, 127, 239, 59, 174, 57, 67, 0, 0, 0, 255, 255, 0, 0, 0, 0, 0, 0, 225, 187, 141, 61, 68, 139, 218, 63, 219, 212, 128, 61, 19, 71, 102, 0, 118, 22, 218, 127, 147, 58, 137, 57, 67, 0, 0, 0, 255, 255, 0, 0, 0, 0, 0, 0, 144, 203, 152, 61, 168, 197, 216, 63, 222, 185, 151, 61, 39, 72, 96, 0, 110, 18, 197, 127, 147, 58, 59, 58, 67, 0, 0, 0, 255, 255, 0, 0, 0, 0, 0, 0, 97, 58, 173, 61, 48, 242, 216, 63, 146, 164, 139, 61, 53, 73, 88, 0, 105, 7, 187, 127, 216, 59, 59, 58, 67, 0, 0, 0, 255, 255, 0, 0, 0, 0, 0, 0, 206, 58, 163, 61, 209, 203, 218, 63, 92, 39, 117, 61, 44, 64, 99, 0, 110, 17, 196, 127, 216, 59, 137, 57, 67, 0, 0, 0, 255, 255, 0, 0, 0, 0, 0, 0, 97, 58, 173, 61, 48, 242, 216, 63, 146, 164, 139, 61, 53, 73, 88, 0, 110, 252, 194, 127, 165, 58, 230, 59, 67, 0, 0, 0, 255, 255, 0, 0, 0, 0, 0, 0, 102, 226, 182, 61, 5, 223, 216, 63, 14, 234, 130, 61, 86, 74, 55, 0, 81, 233, 162, 127, 221, 59, 230, 59, 67, 0, 0, 0, 255, 255, 0, 0, 0, 0, 0, 0, 146, 96, 170, 61, 116, 124, 218, 63, 190, 254, 107, 61, 90, 56, 69, 0, 89, 195, 191, 127, 221, 59, 253, 58, 67, 0, 0, 0, 255, 255, 0, 0, 0, 0, 0, 0, 206, 58, 163, 61, 209, 203, 218, 63, 92, 39, 117, 61, 44, 64, 99, 0, 117, 215, 231, 127, 165, 58, 253, 58, 67, 0, 0, 0, 255, 255, 0, 0, 0, 0, 0, 0, 157, 135, 179, 61, 223, 49, 220, 63, 124, 238, 75, 61, 95, 18, 81, 0, 83, 242, 162, 127, 243, 57, 55, 57, 67, 0, 0, 0, 255, 255, 0, 0, 0, 0, 0, 0, 89, 115, 192, 61, 89, 162, 219, 63, 242, 180, 3, 61, 116, 236, 45, 0, 40, 228, 140, 127, 239, 59, 55, 57, 67, 0, 0, 0, 255, 255, 0, 0, 0, 0, 0, 0, 32, 102, 143, 61, 161, 217, 219, 63, 18, 3, 100, 61, 245, 69, 105, 0, 109, 59, 230, 127, 147, 58, 224, 56, 67, 0, 0, 0, 255, 255, 0, 0, 0, 0, 0, 0, 160, 116, 162, 61, 140, 159, 220, 63, 134, 235, 88, 61, 13, 67, 106, 0, 111, 44, 215, 127, 216, 59, 224, 56, 67, 0, 0, 0, 255, 255, 0, 0, 0, 0, 0, 0, 157, 135, 179, 61, 223, 49, 220, 63, 124, 238, 75, 61, 95, 18, 81, 0, 79, 199, 176, 127, 221, 59, 39, 58, 67, 0, 0, 0, 255, 255, 0, 0, 0, 0, 0, 0, 160, 116, 162, 61, 140, 159, 220, 63, 134, 235, 88, 61, 13, 67, 106, 0, 125, 238, 253, 127, 165, 58, 39, 58, 67, 0, 0, 0, 255, 255, 0, 0, 0, 0, 0, 0, 60, 223, 175, 61, 114, 82, 218, 63, 164, 95, 233, 60, 80, 210, 170, 0, 98, 42, 68, 129, 217, 59, 37, 58, 67, 0, 0, 0, 255, 255, 0, 0, 0, 0, 0, 0, 117, 31, 160, 61, 199, 214, 217, 63, 174, 86, 180, 60, 80, 205, 173, 0, 98, 40, 69, 129, 143, 58, 37, 58, 67, 0, 0, 0, 255, 255, 0, 0, 0, 0, 0, 0, 101, 85, 164, 61, 138, 233, 218, 63, 68, 89, 134, 60, 69, 177, 186, 0, 105, 39, 59, 129, 143, 58, 196, 57, 67, 0, 0, 0, 255, 255, 0, 0, 0, 0, 0, 0, 22, 107, 184, 61, 145, 99, 219, 63, 250, 80, 176, 60, 67, 176, 184, 0, 107, 42, 52, 129, 217, 59, 196, 57, 67, 0, 0, 0, 255, 255, 0, 0, 0, 0, 0, 0, 244, 65, 207, 61, 222, 176, 209, 63, 12, 46, 189, 61, 99, 45, 65, 0, 69, 156, 221, 127, 243, 57, 221, 59, 67, 0, 0, 0, 255, 255, 0, 0, 0, 0, 0, 0, 192, 107, 208, 61, 71, 118, 209, 63, 174, 2, 188, 61, 99, 45, 65, 0, 63, 148, 235, 127, 239, 59, 221, 59, 67, 0, 0, 0, 255, 255, 0, 0, 0, 0, 0, 0, 240, 141, 225, 61, 193, 170, 210, 63, 253, 206, 150, 61, 97, 38, 71, 0, 79, 188, 185, 127, 239, 59, 122, 59, 67, 0, 0, 0, 255, 255, 0, 0, 0, 0, 0, 0, 95, 22, 211, 61, 2, 97, 211, 63, 136, 233, 162, 61, 98, 40, 69, 0, 79, 188, 185, 127, 243, 57, 122, 59, 67, 0, 0, 0, 255, 255, 0, 0, 0, 0, 0, 0, 90, 76, 236, 61, 101, 109, 211, 63, 225, 194, 129, 61, 99, 39, 68, 0, 77, 184, 186, 127, 239, 59, 54, 59, 67, 0, 0, 0, 255, 255, 0, 0, 0, 0, 0, 0, 50, 177, 217, 61, 76, 141, 212, 63, 76, 212, 146, 61, 99, 40, 67, 0, 78, 193, 180, 127, 243, 57, 54, 59, 67, 0, 0, 0, 255, 255, 0, 0, 0, 0, 0, 0, 234, 68, 226, 61, 86, 156, 214, 63, 35, 190, 90, 61, 96, 59, 57, 0, 76, 226, 160, 127, 239, 59, 159, 58, 67, 0, 0, 0, 255, 255, 0, 0, 0, 0, 0, 0, 7, 43, 206, 61, 77, 245, 214, 63, 11, 255, 137, 61, 94, 63, 56, 0, 70, 244, 152, 127, 243, 57, 159, 58, 67, 0, 0, 0, 255, 255, 0, 0, 0, 0, 0, 0, 167, 187, 171, 61, 135, 248, 211, 63, 220, 147, 199, 61, 49, 70, 93, 0, 116, 231, 214, 127, 147, 58, 238, 59, 67, 0, 0, 0, 255, 255, 0, 0, 0, 0, 0, 0, 180, 103, 175, 61, 65, 243, 211, 63, 19, 114, 197, 61, 49, 70, 93, 0, 116, 222, 220, 127, 216, 59, 233, 59, 67, 0, 0, 0, 255, 255, 0, 0, 0, 0, 0, 0, 187, 222, 182, 61, 39, 163, 214, 63, 132, 57, 161, 61, 48, 69, 94, 0, 109, 9, 193, 127, 216, 59, 250, 58, 67, 0, 0, 0, 255, 255, 0, 0, 0, 0, 0, 0, 213, 49, 167, 61, 118, 139, 214, 63, 116, 83, 170, 61, 48, 69, 94, 0, 109, 9, 192, 127, 147, 58, 250, 58, 67, 0, 0, 0, 255, 255, 0, 0, 0, 0, 0, 0, 143, 147, 226, 61, 184, 29, 212, 63, 19, 159, 66, 61, 74, 226, 158, 0, 102, 31, 68, 129, 217, 59, 174, 59, 67, 0, 0, 0, 255, 255, 0, 0, 0, 0, 0, 0, 39, 170, 215, 61, 161, 244, 211, 63, 226, 59, 56, 61, 71, 228, 155, 0, 104, 29, 65, 129, 143, 58, 174, 59, 67, 0, 0, 0, 255, 255, 0, 0, 0, 0, 0, 0, 115, 138, 206, 61, 223, 49, 214, 63, 81, 138, 29, 61, 62, 253, 146, 0, 107, 29, 60, 129, 143, 58, 46, 59, 67, 0, 0, 0, 255, 255, 0, 0, 0, 0, 0, 0, 175, 130, 216, 61, 66, 93, 214, 63, 212, 182, 40, 61, 62, 247, 147, 0, 108, 30, 59, 129, 217, 59, 46, 59, 67, 0, 0, 0, 255, 255, 0, 0, 0, 0, 0, 0, 222, 124, 227, 61, 12, 60, 211, 63, 145, 233, 87, 61, 84, 221, 168, 0, 95, 30, 78, 129, 217, 59, 229, 59, 67, 0, 0, 0, 255, 255, 0, 0, 0, 0, 0, 0, 227, 174, 222, 61, 56, 17, 211, 63, 242, 152, 72, 61, 84, 221, 168, 0, 95, 26, 79, 129, 143, 58, 229, 59, 67, 0, 0, 0, 255, 255, 0, 0, 0, 0, 0, 0, 20, 97, 195, 61, 181, 140, 216, 63, 96, 121, 23, 61, 68, 0, 150, 0, 101, 37, 65, 129, 217, 59, 173, 58, 67, 0, 0, 0, 255, 255, 0, 0, 0, 0, 0, 0, 220, 77, 176, 61, 20, 34, 216, 63, 154, 161, 255, 60, 73, 250, 153, 0, 100, 36, 68, 129, 143, 58, 173, 58, 67, 0, 0, 0, 255, 255, 0, 0, 0, 0, 0, 0, 140, 113, 190, 61, 116, 154, 221, 63, 199, 190, 43, 61, 95, 3, 83, 0, 78, 208, 169, 127, 243, 57, 192, 56, 67, 0, 0, 0, 255, 255, 0, 0, 0, 0, 0, 0, 99, 248, 200, 61, 122, 169, 220, 63, 213, 233, 206, 60, 118, 234, 41, 0, 31, 213, 142, 127, 239, 59, 192, 56, 67, 0, 0, 0, 255, 255, 0, 0, 0, 0, 0, 0, 115, 104, 209, 61, 233, 38, 223, 63, 122, 83, 159, 60, 124, 1, 22, 0, 22, 222, 136, 127, 239, 59, 7, 56, 67, 0, 0, 0, 255, 255, 0, 0, 0, 0, 0, 0, 129, 127, 202, 61, 75, 175, 223, 63, 184, 91, 25, 61, 101, 10, 74, 0, 75, 233, 157, 127, 243, 57, 7, 56, 67, 0, 0, 0, 255, 255, 0, 0, 0, 0, 0, 0, 208, 94, 189, 61, 56, 130, 228, 63, 252, 178, 80, 60, 126, 13, 4, 0, 5, 251, 130, 127, 239, 59, 178, 53, 67, 0, 0, 0, 255, 255, 0, 0, 0, 0, 0, 0, 134, 239, 189, 61, 168, 143, 228, 63, 157, 16, 1, 61, 117, 13, 47, 0, 47, 3, 139, 127, 243, 57, 178, 53, 67, 0, 0, 0, 255, 255, 0, 0, 0, 0, 0, 0, 208, 216, 183, 61, 241, 18, 236, 63, 154, 161, 255, 60, 112, 17, 57, 0, 55, 17, 143, 127, 243, 57, 120, 49, 67, 0, 0, 0, 255, 255, 0, 0, 0, 0, 0, 0, 74, 131, 187, 61, 121, 5, 232, 63, 35, 143, 238, 60, 120, 4, 41, 0, 41, 1, 136, 127, 243, 57, 81, 52, 67, 0, 0, 0, 255, 255, 0, 0, 0, 0, 0, 0, 85, 192, 189, 61, 71, 5, 232, 63, 78, 82, 53, 60, 126, 2, 9, 0, 9, 0, 130, 127, 239, 59, 81, 52, 67, 0, 0, 0, 255, 255, 0, 0, 0, 0, 0, 0, 187, 66, 191, 61, 155, 28, 236, 63, 14, 59, 40, 60, 123, 17, 23, 0, 22, 4, 132, 127, 239, 59, 120, 49, 67, 0, 0, 0, 255, 255, 0, 0, 0, 0, 0, 0, 16, 146, 165, 61, 95, 182, 241, 63, 102, 44, 111, 60, 118, 32, 30, 0, 18, 45, 139, 127, 64, 59, 253, 45, 67, 0, 0, 0, 255, 255, 0, 0, 0, 0, 0, 0, 135, 109, 171, 61, 180, 61, 242, 63, 106, 148, 159, 59, 119, 31, 29, 0, 17, 44, 139, 127, 239, 59, 253, 45, 67, 0, 0, 0, 255, 255, 0, 0, 0, 0, 0, 0, 129, 127, 202, 61, 75, 175, 223, 63, 184, 91, 25, 61, 101, 10, 74, 0, 68, 42, 158, 127, 150, 59, 142, 57, 67, 0, 0, 0, 255, 255, 0, 0, 0, 0, 0, 0, 134, 239, 189, 61, 168, 143, 228, 63, 157, 16, 1, 61, 117, 13, 47, 0, 41, 40, 143, 127, 36, 60, 216, 55, 67, 0, 0, 0, 255, 255, 0, 0, 0, 0, 0, 0, 116, 161, 178, 61, 222, 59, 228, 63, 33, 144, 18, 61, 72, 5, 103, 0, 96, 43, 186, 127, 206, 58, 216, 55, 67, 0, 0, 0, 255, 255, 0, 0, 0, 0, 0, 0, 226, 65, 179, 61, 14, 189, 231, 63, 187, 97, 34, 61, 56, 10, 113, 0, 105, 40, 200, 127, 206, 58, 233, 53, 67, 0, 0, 0, 255, 255, 0, 0, 0, 0, 0, 0, 74, 131, 187, 61, 121, 5, 232, 63, 35, 143, 238, 60, 120, 4, 41, 0, 39, 25, 138, 127, 36, 60, 233, 53, 67, 0, 0, 0, 255, 255, 0, 0, 0, 0, 0, 0, 113, 149, 167, 61, 252, 196, 235, 63, 250, 50, 24, 61, 61, 20, 109, 0, 104, 32, 192, 127, 206, 58, 5, 51, 67, 0, 0, 0, 255, 255, 0, 0, 0, 0, 0, 0, 208, 216, 183, 61, 241, 18, 236, 63, 154, 161, 255, 60, 112, 17, 57, 0, 53, 23, 144, 127, 36, 60, 5, 51, 67, 0, 0, 0, 255, 255, 0, 0, 0, 0, 0, 0, 172, 6, 161, 61, 5, 251, 239, 63, 149, 246, 13, 61, 78, 17, 98, 0, 97, 9, 176, 127, 206, 58, 229, 47, 67, 0, 0, 0, 255, 255, 0, 0, 0, 0, 0, 0, 34, 1, 163, 61, 43, 250, 239, 63, 91, 72, 7, 61, 103, 29, 67, 0, 69, 0, 150, 127, 36, 60, 229, 47, 67, 0, 0, 0, 255, 255, 0, 0, 0, 0, 0, 0, 240, 198, 162, 61, 246, 11, 222, 63, 134, 150, 60, 61, 252, 69, 106, 0, 126, 2, 3, 127, 165, 58, 82, 57, 67, 0, 0, 0, 255, 255, 0, 0, 0, 0, 0, 0, 140, 113, 190, 61, 116, 154, 221, 63, 199, 190, 43, 61, 95, 3, 83, 0, 80, 217, 166, 127, 221, 59, 82, 57, 67, 0, 0, 0, 255, 255, 0, 0, 0, 0, 0, 0, 129, 127, 202, 61, 75, 175, 223, 63, 184, 91, 25, 61, 101, 10, 74, 0, 75, 236, 157, 127, 221, 59, 81, 56, 67, 0, 0, 0, 255, 255, 0, 0, 0, 0, 0, 0, 49, 244, 168, 61, 189, 199, 223, 63, 171, 98, 49, 61, 41, 18, 118, 0, 119, 6, 213, 127, 165, 58, 81, 56, 67, 0, 0, 0, 255, 255, 0, 0, 0, 0, 0, 0, 116, 161, 178, 61, 222, 59, 228, 63, 33, 144, 18, 61, 72, 5, 103, 0, 87, 65, 192, 127, 221, 59, 143, 53, 67, 0, 0, 0, 255, 255, 0, 0, 0, 0, 0, 0, 1, 56, 150, 61, 113, 202, 226, 63, 74, 186, 45, 61, 50, 8, 116, 0, 91, 75, 211, 127, 165, 58, 143, 53, 67, 0, 0, 0, 255, 255, 0, 0, 0, 0, 0, 0, 186, 223, 161, 61, 87, 208, 230, 63, 49, 162, 52, 61, 39, 250, 120, 0, 97, 76, 228, 127, 165, 58, 7, 52, 67, 0, 0, 0, 255, 255, 0, 0, 0, 0, 0, 0, 226, 65, 179, 61, 14, 189, 231, 63, 187, 97, 34, 61, 56, 10, 113, 0, 86, 77, 206, 127, 221, 59, 7, 52, 67, 0, 0, 0, 255, 255, 0, 0, 0, 0, 0, 0, 106, 112, 155, 61, 160, 253, 234, 63, 134, 18, 244, 60, 211, 24, 116, 0, 101, 71, 25, 127, 165, 58, 66, 38, 67, 0, 0, 0, 255, 255, 0, 0, 0, 0, 0, 0, 113, 149, 167, 61, 252, 196, 235, 63, 250, 50, 24, 61, 61, 20, 109, 0, 26, 118, 220, 127, 221, 59, 66, 38, 67, 0, 0, 0, 255, 255, 0, 0, 0, 0, 0, 0, 15, 67, 203, 61, 85, 22, 223, 63, 12, 181, 66, 60, 58, 240, 145, 0, 109, 37, 51, 129, 217, 59, 158, 56, 67, 0, 0, 0, 255, 255, 0, 0, 0, 0, 0, 0, 225, 239, 183, 61, 21, 173, 222, 63, 153, 77, 241, 59, 57, 236, 145, 0, 110, 37, 49, 129, 143, 58, 158, 56, 67, 0, 0, 0, 255, 255, 0, 0, 0, 0, 0, 0, 58, 120, 166, 61, 124, 41, 228, 63, 184, 221, 41, 58, 58, 14, 145, 0, 105, 38, 60, 129, 143, 58, 175, 54, 67, 0, 0, 0, 255, 255, 0, 0, 0, 0, 0, 0, 233, 67, 183, 61, 156, 140, 228, 63, 206, 254, 177, 59, 57, 21, 145, 0, 104, 38, 61, 129, 217, 59, 175, 54, 67, 0, 0, 0, 255, 255, 0, 0, 0, 0, 0, 0, 64, 22, 162, 61, 56, 135, 231, 63, 50, 29, 15, 60, 65, 26, 151, 0, 99, 36, 70, 129, 143, 58, 66, 53, 67, 0, 0, 0, 255, 255, 0, 0, 0, 0, 0, 0, 67, 1, 187, 61, 51, 25, 232, 63, 52, 143, 138, 60, 73, 15, 154, 0, 96, 36, 74, 129, 217, 59, 66, 53, 67, 0, 0, 0, 255, 255, 0, 0, 0, 0, 0, 0, 225, 235, 171, 61, 192, 6, 236, 63, 234, 51, 60, 60, 91, 252, 169, 0, 85, 35, 87, 129, 143, 58, 40, 51, 67, 0, 0, 0, 255, 255, 0, 0, 0, 0, 0, 0, 121, 178, 187, 61, 222, 117, 236, 63, 111, 168, 166, 60, 95, 248, 173, 0, 82, 34, 90, 129, 217, 59, 40, 51, 67, 0, 0, 0, 255, 255, 0, 0, 0, 0, 0, 0, 222, 60, 181, 61, 207, 77, 241, 63, 131, 23, 238, 59, 103, 240, 185, 0, 68, 234, 104, 129, 143, 58, 83, 47, 67, 0, 0, 0, 255, 255, 0, 0, 0, 0, 0, 0, 146, 94, 180, 61, 173, 75, 241, 63, 232, 38, 6, 60, 103, 240, 185, 0, 64, 216, 101, 129, 217, 59, 83, 47, 67, 0, 0, 0, 255, 255, 0, 0, 0, 0, 0, 0, 34, 1, 163, 61, 43, 250, 239, 63, 91, 72, 7, 61, 103, 29, 67, 0, 33, 84, 168, 127, 243, 57, 253, 45, 67, 0, 0, 0, 255, 255, 0, 0, 0, 0, 0, 0, 197, 206, 148, 61, 26, 24, 223, 63, 7, 111, 214, 60, 187, 68, 81, 0, 104, 24, 67, 127, 147, 58, 28, 54, 67, 0, 0, 0, 255, 255, 0, 0, 0, 0, 0, 0, 201, 91, 142, 61, 132, 187, 221, 63, 89, 200, 35, 61, 201, 88, 72, 0, 113, 31, 47, 127, 147, 58, 220, 55, 67, 0, 0, 0, 255, 255, 0, 0, 0, 0, 0, 0, 240, 198, 162, 61, 246, 11, 222, 63, 134, 150, 60, 61, 252, 69, 106, 0, 125, 244, 13, 127, 216, 59, 215, 55, 67, 0, 0, 0, 255, 255, 0, 0, 0, 0, 0, 0, 27, 105, 169, 61, 212, 99, 223, 63, 11, 78, 4, 61, 187, 66, 82, 0, 104, 28, 65, 127, 216, 59, 23, 54, 67, 0, 0, 0, 255, 255, 0, 0, 0, 0, 0, 0, 26, 195, 156, 61, 168, 171, 225, 63, 206, 101, 177, 60, 187, 14, 104, 0, 98, 54, 58, 127, 147, 58, 25, 52, 67, 0, 0, 0, 255, 255, 0, 0, 0, 0, 0, 0, 55, 90, 174, 61, 183, 99, 226, 63, 172, 124, 221, 60, 190, 2, 108, 0, 95, 61, 56, 127, 216, 59, 25, 52, 67, 0, 0, 0, 255, 255, 0, 0, 0, 0, 0, 0, 181, 222, 143, 61, 54, 177, 228, 63, 69, 87, 176, 60, 191, 252, 108, 0, 93, 63, 58, 127, 147, 58, 89, 48, 67, 0, 0, 0, 255, 255, 0, 0, 0, 0, 0, 0, 111, 163, 161, 61, 79, 116, 229, 63, 0, 215, 220, 60, 188, 1, 107, 0, 92, 63, 58, 127, 216, 59, 89, 48, 67, 0, 0, 0, 255, 255, 0, 0, 0, 0, 0, 0, 183, 210, 139, 61, 94, 128, 231, 63, 175, 165, 142, 60, 183, 12, 102, 0, 92, 64, 58, 127, 147, 58, 37, 40, 67, 0, 0, 0, 255, 255, 0, 0, 0, 0, 0, 0, 211, 159, 157, 61, 187, 69, 232, 63, 37, 161, 187, 60, 183, 12, 102, 0, 92, 64, 58, 127, 216, 59, 37, 40, 67, 0, 0, 0, 255, 255, 0, 0, 0, 0, 0, 0, 67, 116, 168, 61, 48, 241, 219, 63, 67, 112, 49, 60, 59, 191, 165, 0, 112, 39, 44, 129, 143, 58, 98, 57, 67, 0, 0, 0, 255, 255, 0, 0, 0, 0, 0, 0, 74, 211, 192, 61, 198, 109, 220, 63, 197, 98, 112, 60, 57, 204, 156, 0, 112, 39, 44, 129, 217, 59, 98, 57, 67, 0, 0, 0, 255, 255, 0, 0, 0, 0, 0, 0, 240, 223, 220, 61, 10, 47, 223, 63, 71, 112, 177, 60, 131, 254, 235, 0, 21, 237, 133, 129, 237, 59, 156, 58, 67, 0, 0, 0, 255, 255, 0, 0, 0, 0, 0, 0, 19, 218, 210, 61, 94, 214, 220, 63, 153, 17, 236, 60, 137, 24, 220, 0, 25, 209, 141, 129, 237, 59, 226, 59, 67, 0, 0, 0, 255, 255, 0, 0, 0, 0, 0, 0, 128, 133, 204, 61, 132, 100, 221, 63, 123, 166, 30, 61, 137, 24, 220, 0, 28, 222, 138, 129, 106, 58, 226, 59, 67, 0, 0, 0, 255, 255, 0, 0, 0, 0, 0, 0, 159, 7, 215, 61, 144, 159, 223, 63, 6, 46, 22, 61, 131, 253, 236, 0, 21, 244, 132, 129, 106, 58, 125, 58, 67, 0, 0, 0, 255, 255, 0, 0, 0, 0, 0, 0, 12, 90, 200, 61, 77, 133, 228, 63, 36, 243, 100, 60, 130, 243, 252, 0, 5, 249, 130, 129, 237, 59, 72, 56, 67, 0, 0, 0, 255, 255, 0, 0, 0, 0, 0, 0, 143, 230, 200, 61, 129, 146, 228, 63, 80, 25, 6, 61, 131, 241, 252, 0, 5, 249, 130, 129, 106, 58, 82, 56, 67, 0, 0, 0, 255, 255, 0, 0, 0, 0, 0, 0, 13, 198, 200, 61, 163, 7, 232, 63, 77, 226, 72, 60, 130, 249, 247, 0, 9, 250, 130, 129, 237, 59, 238, 53, 67, 0, 0, 0, 255, 255, 0, 0, 0, 0, 0, 0, 124, 136, 198, 61, 213, 7, 232, 63, 83, 91, 248, 60, 130, 249, 248, 0, 9, 250, 130, 129, 106, 58, 6, 54, 67, 0, 0, 0, 255, 255, 0, 0, 0, 0, 0, 0, 91, 160, 189, 61, 11, 42, 236, 63, 253, 218, 1, 61, 131, 245, 241, 0, 15, 251, 131, 129, 106, 58, 193, 49, 67, 0, 0, 0, 255, 255, 0, 0, 0, 0, 0, 0, 192, 9, 197, 61, 181, 51, 236, 63, 208, 99, 48, 60, 131, 245, 241, 0, 15, 252, 131, 129, 237, 59, 146, 49, 67, 0, 0, 0, 255, 255, 0, 0, 0, 0, 0, 0, 240, 223, 220, 189, 10, 47, 223, 63, 89, 112, 177, 60, 131, 2, 21, 0, 235, 237, 133, 129, 237, 59, 156, 58, 67, 0, 0, 0, 255, 255, 0, 0, 0, 0, 0, 0, 17, 218, 210, 189, 94, 214, 220, 63, 169, 17, 236, 60, 137, 232, 36, 0, 231, 209, 141, 129, 237, 59, 226, 59, 67, 0, 0, 0, 255, 255, 0, 0, 0, 0, 0, 0, 126, 133, 204, 189, 132, 100, 221, 63, 131, 166, 30, 61, 137, 232, 36, 0, 228, 222, 138, 129, 106, 58, 226, 59, 67, 0, 0, 0, 255, 255, 0, 0, 0, 0, 0, 0, 157, 7, 215, 189, 144, 159, 223, 63, 14, 46, 22, 61, 131, 3, 20, 0, 235, 244, 132, 129, 106, 58, 125, 58, 67, 0, 0, 0, 255, 255, 0, 0, 0, 0, 0, 0, 12, 90, 200, 189, 77, 133, 228, 63, 68, 243, 100, 60, 130, 13, 4, 0, 251, 249, 130, 129, 237, 59, 72, 56, 67, 0, 0, 0, 255, 255, 0, 0, 0, 0, 0, 0, 141, 230, 200, 189, 129, 146, 228, 63, 88, 25, 6, 61, 131, 15, 4, 0, 251, 249, 130, 129, 106, 58, 82, 56, 67, 0, 0, 0, 255, 255, 0, 0, 0, 0, 0, 0, 13, 198, 200, 189, 163, 7, 232, 63, 109, 226, 72, 60, 130, 7, 9, 0, 247, 250, 130, 129, 237, 59, 238, 53, 67, 0, 0, 0, 255, 255, 0, 0, 0, 0, 0, 0, 122, 136, 198, 189, 213, 7, 232, 63, 99, 91, 248, 60, 130, 7, 8, 0, 247, 250, 130, 129, 106, 58, 6, 54, 67, 0, 0, 0, 255, 255, 0, 0, 0, 0, 0, 0, 89, 160, 189, 189, 11, 42, 236, 63, 5, 219, 1, 61, 134, 24, 22, 0, 232, 252, 132, 129, 106, 58, 193, 49, 67, 0, 0, 0, 255, 255, 0, 0, 0, 0, 0, 0, 192, 9, 197, 189, 181, 51, 236, 63, 240, 99, 48, 60, 134, 24, 22, 0, 233, 0, 132, 129, 237, 59, 146, 49, 67, 0, 0, 0, 255, 255, 0, 0, 0, 0, 0, 0, 150, 83, 162, 189, 117, 32, 241, 63, 211, 29, 253, 60, 139, 36, 30, 0, 229, 14, 133, 129, 106, 58, 33, 34, 67, 0, 0, 0, 255, 255, 0, 0, 0, 0, 0, 0, 53, 36, 174, 189, 210, 167, 241, 63, 71, 182, 30, 60, 139, 36, 30, 0, 232, 21, 134, 129, 237, 59, 33, 34, 67, 0, 0, 0, 255, 255, 0, 0, 0, 0, 0, 0, 213, 171, 200, 189, 184, 7, 217, 63, 47, 250, 67, 61, 167, 77, 47, 0, 198, 1, 144, 129, 239, 59, 33, 58, 67, 0, 0, 0, 255, 255, 0, 0, 0, 0, 0, 0, 100, 226, 182, 189, 5, 223, 216, 63, 18, 234, 130, 61, 170, 74, 55, 0, 195, 10, 146, 129, 243, 57, 33, 58, 67, 0, 0, 0, 255, 255, 0, 0, 0, 0, 0, 0, 144, 96, 170, 189, 116, 124, 218, 63, 196, 254, 107, 61, 166, 56, 69, 0, 187, 17, 152, 129, 243, 57, 174, 57, 67, 0, 0, 0, 255, 255, 0, 0, 0, 0, 0, 0, 72, 14, 184, 189, 24, 147, 218, 63, 114, 106, 32, 61, 140, 17, 47, 0, 208, 248, 140, 129, 239, 59, 174, 57, 67, 0, 0, 0, 255, 255, 0, 0, 0, 0, 0, 0, 95, 58, 173, 189, 48, 242, 216, 63, 150, 164, 139, 61, 203, 73, 88, 0, 151, 7, 187, 129, 216, 59, 59, 58, 67, 0, 0, 0, 255, 255, 0, 0, 0, 0, 0, 0, 140, 203, 152, 189, 168, 197, 216, 63, 226, 185, 151, 61, 217, 72, 96, 0, 146, 18, 197, 129, 147, 58, 59, 58, 67, 0, 0, 0, 255, 255, 0, 0, 0, 0, 0, 0, 223, 187, 141, 189, 68, 139, 218, 63, 221, 212, 128, 61, 237, 71, 102, 0, 138, 22, 218, 129, 147, 58, 137, 57, 67, 0, 0, 0, 255, 255, 0, 0, 0, 0, 0, 0, 204, 58, 163, 189, 209, 203, 218, 63, 98, 39, 117, 61, 212, 64, 99, 0, 146, 17, 196, 129, 216, 59, 137, 57, 67, 0, 0, 0, 255, 255, 0, 0, 0, 0, 0, 0, 144, 96, 170, 189, 116, 124, 218, 63, 196, 254, 107, 61, 166, 56, 69, 0, 167, 195, 191, 129, 221, 59, 253, 58, 67, 0, 0, 0, 255, 255, 0, 0, 0, 0, 0, 0, 100, 226, 182, 189, 5, 223, 216, 63, 18, 234, 130, 61, 170, 74, 55, 0, 175, 233, 162, 129, 221, 59, 230, 59, 67, 0, 0, 0, 255, 255, 0, 0, 0, 0, 0, 0, 95, 58, 173, 189, 48, 242, 216, 63, 150, 164, 139, 61, 203, 73, 88, 0, 146, 252, 194, 129, 165, 58, 230, 59, 67, 0, 0, 0, 255, 255, 0, 0, 0, 0, 0, 0, 204, 58, 163, 189, 209, 203, 218, 63, 98, 39, 117, 61, 212, 64, 99, 0, 139, 215, 231, 129, 165, 58, 253, 58, 67, 0, 0, 0, 255, 255, 0, 0, 0, 0, 0, 0, 155, 135, 179, 189, 223, 49, 220, 63, 132, 238, 75, 61, 161, 18, 81, 0, 173, 242, 162, 129, 243, 57, 55, 57, 67, 0, 0, 0, 255, 255, 0, 0, 0, 0, 0, 0, 87, 115, 192, 189, 89, 162, 219, 63, 250, 180, 3, 61, 140, 236, 45, 0, 216, 228, 140, 129, 239, 59, 55, 57, 67, 0, 0, 0, 255, 255, 0, 0, 0, 0, 0, 0, 30, 102, 143, 189, 161, 217, 219, 63, 24, 3, 100, 61, 11, 69, 105, 0, 147, 59, 230, 129, 147, 58, 224, 56, 67, 0, 0, 0, 255, 255, 0, 0, 0, 0, 0, 0, 158, 116, 162, 189, 140, 159, 220, 63, 140, 235, 88, 61, 243, 67, 106, 0, 145, 44, 215, 129, 216, 59, 224, 56, 67, 0, 0, 0, 255, 255, 0, 0, 0, 0, 0, 0, 155, 135, 179, 189, 223, 49, 220, 63, 132, 238, 75, 61, 161, 18, 81, 0, 177, 199, 176, 129, 221, 59, 39, 58, 67, 0, 0, 0, 255, 255, 0, 0, 0, 0, 0, 0, 158, 116, 162, 189, 140, 159, 220, 63, 140, 235, 88, 61, 243, 67, 106, 0, 131, 238, 253, 129, 165, 58, 39, 58, 67, 0, 0, 0, 255, 255, 0, 0, 0, 0, 0, 0, 101, 85, 164, 189, 138, 233, 218, 63, 82, 89, 134, 60, 187, 177, 186, 0, 151, 39, 59, 127, 143, 58, 196, 57, 67, 0, 0, 0, 255, 255, 0, 0, 0, 0, 0, 0, 117, 31, 160, 189, 199, 214, 217, 63, 186, 86, 180, 60, 176, 205, 173, 0, 158, 40, 69, 127, 143, 58, 37, 58, 67, 0, 0, 0, 255, 255, 0, 0, 0, 0, 0, 0, 58, 223, 175, 189, 114, 82, 218, 63, 178, 95, 233, 60, 176, 210, 170, 0, 158, 42, 68, 127, 217, 59, 37, 58, 67, 0, 0, 0, 255, 255, 0, 0, 0, 0, 0, 0, 22, 107, 184, 189, 145, 99, 219, 63, 8, 81, 176, 60, 189, 176, 184, 0, 149, 42, 52, 127, 217, 59, 196, 57, 67, 0, 0, 0, 255, 255, 0, 0, 0, 0, 0, 0, 238, 141, 225, 189, 193, 170, 210, 63, 1, 207, 150, 61, 159, 38, 71, 0, 177, 188, 185, 129, 239, 59, 122, 59, 67, 0, 0, 0, 255, 255, 0, 0, 0, 0, 0, 0, 188, 107, 208, 189, 71, 118, 209, 63, 178, 2, 188, 61, 157, 45, 65, 0, 193, 148, 235, 129, 239, 59, 221, 59, 67, 0, 0, 0, 255, 255, 0, 0, 0, 0, 0, 0, 240, 65, 207, 189, 222, 176, 209, 63, 16, 46, 189, 61, 157, 45, 65, 0, 187, 156, 221, 129, 243, 57, 221, 59, 67, 0, 0, 0, 255, 255, 0, 0, 0, 0, 0, 0, 91, 22, 211, 189, 2, 97, 211, 63, 140, 233, 162, 61, 158, 40, 69, 0, 177, 188, 185, 129, 243, 57, 122, 59, 67, 0, 0, 0, 255, 255, 0, 0, 0, 0, 0, 0, 88, 76, 236, 189, 101, 109, 211, 63, 229, 194, 129, 61, 157, 39, 68, 0, 179, 184, 186, 129, 239, 59, 54, 59, 67, 0, 0, 0, 255, 255, 0, 0, 0, 0, 0, 0, 48, 177, 217, 189, 76, 141, 212, 63, 80, 212, 146, 61, 157, 40, 67, 0, 178, 193, 180, 129, 243, 57, 54, 59, 67, 0, 0, 0, 255, 255, 0, 0, 0, 0, 0, 0, 232, 68, 226, 189, 86, 156, 214, 63, 43, 190, 90, 61, 160, 59, 57, 0, 180, 226, 160, 129, 239, 59, 159, 58, 67, 0, 0, 0, 255, 255, 0, 0, 0, 0, 0, 0, 5, 43, 206, 189, 77, 245, 214, 63, 15, 255, 137, 61, 162, 63, 56, 0, 186, 244, 152, 129, 243, 57, 159, 58, 67, 0, 0, 0, 255, 255, 0, 0, 0, 0, 0, 0, 183, 222, 182, 189, 39, 163, 214, 63, 136, 57, 161, 61, 208, 69, 94, 0, 147, 9, 193, 129, 216, 59, 250, 58, 67, 0, 0, 0, 255, 255, 0, 0, 0, 0, 0, 0, 176, 103, 175, 189, 65, 243, 211, 63, 23, 114, 197, 61, 207, 70, 93, 0, 140, 222, 220, 129, 216, 59, 233, 59, 67, 0, 0, 0, 255, 255, 0, 0, 0, 0, 0, 0, 163, 187, 171, 189, 135, 248, 211, 63, 224, 147, 199, 61, 207, 70, 93, 0, 140, 231, 214, 129, 147, 58, 238, 59, 67, 0, 0, 0, 255, 255, 0, 0, 0, 0, 0, 0, 209, 49, 167, 189, 118, 139, 214, 63, 120, 83, 170, 61, 208, 69, 94, 0, 147, 9, 192, 129, 147, 58, 250, 58, 67, 0, 0, 0, 255, 255, 0, 0, 0, 0, 0, 0, 113, 138, 206, 189, 223, 49, 214, 63, 89, 138, 29, 61, 194, 253, 146, 0, 149, 29, 60, 127, 143, 58, 46, 59, 67, 0, 0, 0, 255, 255, 0, 0, 0, 0, 0, 0, 37, 170, 215, 189, 161, 244, 211, 63, 234, 59, 56, 61, 185, 228, 155, 0, 152, 29, 65, 127, 143, 58, 174, 59, 67, 0, 0, 0, 255, 255, 0, 0, 0, 0, 0, 0, 141, 147, 226, 189, 184, 29, 212, 63, 27, 159, 66, 61, 182, 226, 158, 0, 154, 31, 68, 127, 217, 59, 174, 59, 67, 0, 0, 0, 255, 255, 0, 0, 0, 0, 0, 0, 173, 130, 216, 189, 66, 93, 214, 63, 220, 182, 40, 61, 194, 247, 147, 0, 148, 30, 59, 127, 217, 59, 46, 59, 67, 0, 0, 0, 255, 255, 0, 0, 0, 0, 0, 0, 225, 174, 222, 189, 56, 17, 211, 63, 250, 152, 72, 61, 172, 221, 168, 0, 161, 26, 79, 127, 143, 58, 229, 59, 67, 0, 0, 0, 255, 255, 0, 0, 0, 0, 0, 0, 220, 124, 227, 189, 12, 60, 211, 63, 155, 233, 87, 61, 172, 221, 168, 0, 161, 30, 78, 127, 217, 59, 229, 59, 67, 0, 0, 0, 255, 255, 0, 0, 0, 0, 0, 0, 218, 77, 176, 189, 20, 34, 216, 63, 168, 161, 255, 60, 183, 250, 153, 0, 156, 36, 68, 127, 143, 58, 173, 58, 67, 0, 0, 0, 255, 255, 0, 0, 0, 0, 0, 0, 18, 97, 195, 189, 181, 140, 216, 63, 104, 121, 23, 61, 188, 0, 150, 0, 155, 37, 65, 127, 217, 59, 173, 58, 67, 0, 0, 0, 255, 255, 0, 0, 0, 0, 0, 0, 115, 104, 209, 189, 233, 38, 223, 63, 138, 83, 159, 60, 132, 1, 22, 0, 234, 222, 136, 129, 239, 59, 7, 56, 67, 0, 0, 0, 255, 255, 0, 0, 0, 0, 0, 0, 97, 248, 200, 189, 122, 169, 220, 63, 229, 233, 206, 60, 138, 234, 41, 0, 225, 213, 142, 129, 239, 59, 192, 56, 67, 0, 0, 0, 255, 255, 0, 0, 0, 0, 0, 0, 138, 113, 190, 189, 116, 154, 221, 63, 207, 190, 43, 61, 161, 3, 83, 0, 178, 208, 169, 129, 243, 57, 192, 56, 67, 0, 0, 0, 255, 255, 0, 0, 0, 0, 0, 0, 127, 127, 202, 189, 75, 175, 223, 63, 192, 91, 25, 61, 155, 10, 74, 0, 181, 233, 157, 129, 243, 57, 7, 56, 67, 0, 0, 0, 255, 255, 0, 0, 0, 0, 0, 0, 208, 94, 189, 189, 56, 130, 228, 63, 26, 179, 80, 60, 130, 13, 4, 0, 251, 251, 130, 129, 239, 59, 178, 53, 67, 0, 0, 0, 255, 255, 0, 0, 0, 0, 0, 0, 132, 239, 189, 189, 168, 143, 228, 63, 165, 16, 1, 61, 139, 13, 47, 0, 209, 3, 139, 129, 243, 57, 178, 53, 67, 0, 0, 0, 255, 255, 0, 0, 0, 0, 0, 0, 85, 192, 189, 189, 71, 5, 232, 63, 108, 82, 53, 60, 130, 2, 9, 0, 247, 0, 130, 129, 239, 59, 81, 52, 67, 0, 0, 0, 255, 255, 0, 0, 0, 0, 0, 0, 72, 131, 187, 189, 121, 5, 232, 63, 49, 143, 238, 60, 136, 4, 41, 0, 215, 1, 136, 129, 243, 57, 81, 52, 67, 0, 0, 0, 255, 255, 0, 0, 0, 0, 0, 0, 206, 216, 183, 189, 241, 18, 236, 63, 168, 161, 255, 60, 144, 17, 57, 0, 201, 17, 143, 129, 243, 57, 120, 49, 67, 0, 0, 0, 255, 255, 0, 0, 0, 0, 0, 0, 187, 66, 191, 189, 155, 28, 236, 63, 44, 59, 40, 60, 133, 17, 23, 0, 234, 4, 132, 129, 239, 59, 120, 49, 67, 0, 0, 0, 255, 255, 0, 0, 0, 0, 0, 0, 16, 146, 165, 189, 95, 182, 241, 63, 128, 44, 111, 60, 138, 32, 30, 0, 238, 45, 139, 129, 64, 59, 253, 45, 67, 0, 0, 0, 255, 255, 0, 0, 0, 0, 0, 0, 135, 109, 171, 189, 180, 61, 242, 63, 160, 148, 159, 59, 137, 31, 29, 0, 239, 44, 139, 129, 239, 59, 253, 45, 67, 0, 0, 0, 255, 255, 0, 0, 0, 0, 0, 0, 127, 127, 202, 189, 75, 175, 223, 63, 192, 91, 25, 61, 155, 10, 74, 0, 188, 42, 158, 129, 150, 59, 142, 57, 67, 0, 0, 0, 255, 255, 0, 0, 0, 0, 0, 0, 114, 161, 178, 189, 222, 59, 228, 63, 41, 144, 18, 61, 184, 5, 103, 0, 160, 43, 186, 129, 206, 58, 216, 55, 67, 0, 0, 0, 255, 255, 0, 0, 0, 0, 0, 0, 132, 239, 189, 189, 168, 143, 228, 63, 165, 16, 1, 61, 139, 13, 47, 0, 215, 40, 143, 129, 36, 60, 216, 55, 67, 0, 0, 0, 255, 255, 0, 0, 0, 0, 0, 0, 224, 65, 179, 189, 14, 189, 231, 63, 195, 97, 34, 61, 200, 10, 113, 0, 151, 40, 200, 129, 206, 58, 233, 53, 67, 0, 0, 0, 255, 255, 0, 0, 0, 0, 0, 0, 72, 131, 187, 189, 121, 5, 232, 63, 49, 143, 238, 60, 136, 4, 41, 0, 217, 25, 138, 129, 36, 60, 233, 53, 67, 0, 0, 0, 255, 255, 0, 0, 0, 0, 0, 0, 111, 149, 167, 189, 252, 196, 235, 63, 0, 51, 24, 61, 195, 20, 109, 0, 152, 32, 192, 129, 206, 58, 5, 51, 67, 0, 0, 0, 255, 255, 0, 0, 0, 0, 0, 0, 206, 216, 183, 189, 241, 18, 236, 63, 168, 161, 255, 60, 144, 17, 57, 0, 203, 23, 144, 129, 36, 60, 5, 51, 67, 0, 0, 0, 255, 255, 0, 0, 0, 0, 0, 0, 170, 6, 161, 189, 5, 251, 239, 63, 155, 246, 13, 61, 178, 17, 98, 0, 159, 9, 176, 129, 206, 58, 229, 47, 67, 0, 0, 0, 255, 255, 0, 0, 0, 0, 0, 0, 32, 1, 163, 189, 43, 250, 239, 63, 97, 72, 7, 61, 153, 29, 67, 0, 187, 0, 150, 129, 36, 60, 229, 47, 67, 0, 0, 0, 255, 255, 0, 0, 0, 0, 0, 0, 127, 127, 202, 189, 75, 175, 223, 63, 192, 91, 25, 61, 155, 10, 74, 0, 181, 236, 157, 129, 221, 59, 81, 56, 67, 0, 0, 0, 255, 255, 0, 0, 0, 0, 0, 0, 138, 113, 190, 189, 116, 154, 221, 63, 207, 190, 43, 61, 161, 3, 83, 0, 176, 217, 166, 129, 221, 59, 82, 57, 67, 0, 0, 0, 255, 255, 0, 0, 0, 0, 0, 0, 238, 198, 162, 189, 246, 11, 222, 63, 140, 150, 60, 61, 4, 69, 106, 0, 130, 2, 3, 129, 165, 58, 82, 57, 67, 0, 0, 0, 255, 255, 0, 0, 0, 0, 0, 0, 47, 244, 168, 189, 189, 199, 223, 63, 177, 98, 49, 61, 215, 18, 118, 0, 137, 6, 213, 129, 165, 58, 81, 56, 67, 0, 0, 0, 255, 255, 0, 0, 0, 0, 0, 0, 114, 161, 178, 189, 222, 59, 228, 63, 41, 144, 18, 61, 184, 5, 103, 0, 169, 65, 192, 129, 221, 59, 143, 53, 67, 0, 0, 0, 255, 255, 0, 0, 0, 0, 0, 0, 255, 55, 150, 189, 113, 202, 226, 63, 80, 186, 45, 61, 206, 8, 116, 0, 165, 75, 211, 129, 165, 58, 143, 53, 67, 0, 0, 0, 255, 255, 0, 0, 0, 0, 0, 0, 184, 223, 161, 189, 87, 208, 230, 63, 55, 162, 52, 61, 217, 250, 120, 0, 159, 76, 228, 129, 165, 58, 7, 52, 67, 0, 0, 0, 255, 255, 0, 0, 0, 0, 0, 0, 224, 65, 179, 189, 14, 189, 231, 63, 195, 97, 34, 61, 200, 10, 113, 0, 170, 77, 206, 129, 221, 59, 7, 52, 67, 0, 0, 0, 255, 255, 0, 0, 0, 0, 0, 0, 104, 112, 155, 189, 160, 253, 234, 63, 146, 18, 244, 60, 45, 24, 116, 0, 155, 71, 25, 129, 165, 58, 66, 38, 67, 0, 0, 0, 255, 255, 0, 0, 0, 0, 0, 0, 111, 149, 167, 189, 252, 196, 235, 63, 0, 51, 24, 61, 195, 20, 109, 0, 230, 118, 220, 129, 221, 59, 66, 38, 67, 0, 0, 0, 255, 255, 0, 0, 0, 0, 0, 0, 58, 120, 166, 189, 124, 41, 228, 63, 94, 223, 41, 58, 198, 14, 145, 0, 151, 38, 60, 127, 143, 58, 175, 54, 67, 0, 0, 0, 255, 255, 0, 0, 0, 0, 0, 0, 225, 239, 183, 189, 21, 173, 222, 63, 211, 77, 241, 59, 199, 236, 145, 0, 146, 37, 49, 127, 143, 58, 158, 56, 67, 0, 0, 0, 255, 255, 0, 0, 0, 0, 0, 0, 15, 67, 203, 189, 85, 22, 223, 63, 44, 181, 66, 60, 198, 240, 145, 0, 147, 37, 51, 127, 217, 59, 158, 56, 67, 0, 0, 0, 255, 255, 0, 0, 0, 0, 0, 0, 233, 67, 183, 189, 156, 140, 228, 63, 8, 255, 177, 59, 199, 21, 145, 0, 152, 38, 61, 127, 217, 59, 175, 54, 67, 0, 0, 0, 255, 255, 0, 0, 0, 0, 0, 0, 64, 22, 162, 189, 56, 135, 231, 63, 76, 29, 15, 60, 191, 26, 151, 0, 157, 36, 70, 127, 143, 58, 66, 53, 67, 0, 0, 0, 255, 255, 0, 0, 0, 0, 0, 0, 67, 1, 187, 189, 51, 25, 232, 63, 66, 143, 138, 60, 183, 15, 154, 0, 160, 36, 74, 127, 217, 59, 66, 53, 67, 0, 0, 0, 255, 255, 0, 0, 0, 0, 0, 0, 225, 235, 171, 189, 192, 6, 236, 63, 6, 52, 60, 60, 165, 252, 169, 0, 171, 35, 87, 127, 143, 58, 40, 51, 67, 0, 0, 0, 255, 255, 0, 0, 0, 0, 0, 0, 121, 178, 187, 189, 222, 117, 236, 63, 125, 168, 166, 60, 161, 248, 173, 0, 174, 34, 90, 127, 217, 59, 40, 51, 67, 0, 0, 0, 255, 255, 0, 0, 0, 0, 0, 0, 222, 60, 181, 189, 207, 77, 241, 63, 189, 23, 238, 59, 153, 240, 185, 0, 188, 234, 104, 127, 143, 58, 83, 47, 67, 0, 0, 0, 255, 255, 0, 0, 0, 0, 0, 0, 146, 94, 180, 189, 173, 75, 241, 63, 4, 39, 6, 60, 153, 240, 185, 0, 192, 216, 101, 127, 217, 59, 83, 47, 67, 0, 0, 0, 255, 255, 0, 0, 0, 0, 0, 0, 32, 1, 163, 189, 43, 250, 239, 63, 97, 72, 7, 61, 153, 29, 67, 0, 223, 84, 168, 129, 243, 57, 253, 45, 67, 0, 0, 0, 255, 255, 0, 0, 0, 0, 0, 0, 238, 198, 162, 189, 246, 11, 222, 63, 140, 150, 60, 61, 4, 69, 106, 0, 131, 244, 13, 129, 216, 59, 215, 55, 67, 0, 0, 0, 255, 255, 0, 0, 0, 0, 0, 0, 199, 91, 142, 189, 132, 187, 221, 63, 95, 200, 35, 61, 55, 88, 72, 0, 143, 31, 47, 129, 147, 58, 220, 55, 67, 0, 0, 0, 255, 255, 0, 0, 0, 0, 0, 0, 195, 206, 148, 189, 26, 24, 223, 63, 19, 111, 214, 60, 69, 68, 81, 0, 152, 24, 67, 129, 147, 58, 28, 54, 67, 0, 0, 0, 255, 255, 0, 0, 0, 0, 0, 0, 25, 105, 169, 189, 212, 99, 223, 63, 17, 78, 4, 61, 69, 66, 82, 0, 152, 28, 65, 129, 216, 59, 23, 54, 67, 0, 0, 0, 255, 255, 0, 0, 0, 0, 0, 0, 26, 195, 156, 189, 168, 171, 225, 63, 218, 101, 177, 60, 69, 14, 104, 0, 158, 54, 58, 129, 147, 58, 25, 52, 67, 0, 0, 0, 255, 255, 0, 0, 0, 0, 0, 0, 53, 90, 174, 189, 183, 99, 226, 63, 186, 124, 221, 60, 66, 2, 108, 0, 161, 61, 56, 129, 216, 59, 25, 52, 67, 0, 0, 0, 255, 255, 0, 0, 0, 0, 0, 0, 181, 222, 143, 189, 54, 177, 228, 63, 81, 87, 176, 60, 65, 252, 108, 0, 163, 63, 58, 129, 147, 58, 89, 48, 67, 0, 0, 0, 255, 255, 0, 0, 0, 0, 0, 0, 109, 163, 161, 189, 79, 116, 229, 63, 12, 215, 220, 60, 68, 1, 107, 0, 164, 63, 58, 129, 216, 59, 89, 48, 67, 0, 0, 0, 255, 255, 0, 0, 0, 0, 0, 0, 183, 210, 139, 189, 94, 128, 231, 63, 187, 165, 142, 60, 73, 12, 102, 0, 164, 64, 58, 129, 147, 58, 37, 40, 67, 0, 0, 0, 255, 255, 0, 0, 0, 0, 0, 0, 211, 159, 157, 189, 187, 69, 232, 63, 49, 161, 187, 60, 73, 12, 102, 0, 164, 64, 58, 129, 216, 59, 37, 40, 67, 0, 0, 0, 255, 255, 0, 0, 0, 0, 0, 0, 67, 116, 168, 189, 48, 241, 219, 63, 93, 112, 49, 60, 197, 191, 165, 0, 144, 39, 44, 127, 143, 58, 98, 57, 67, 0, 0, 0, 255, 255, 0, 0, 0, 0, 0, 0, 74, 211, 192, 189, 198, 109, 220, 63, 227, 98, 112, 60, 199, 204, 156, 0, 144, 39, 44, 127, 217, 59, 98, 57, 67, 0, 0, 0, 255, 255, 0, 0, 0, 0, 0, 0, 126, 133, 204, 189, 132, 100, 221, 63, 131, 166, 30, 61, 119, 24, 220, 0, 228, 222, 138, 127, 106, 58, 226, 59, 67, 0, 0, 0, 255, 255, 0, 0, 0, 0, 0, 0, 17, 218, 210, 189, 94, 214, 220, 63, 169, 17, 236, 60, 119, 24, 220, 0, 231, 209, 141, 127, 237, 59, 226, 59, 67, 0, 0, 0, 255, 255, 0, 0, 0, 0, 0, 0, 240, 223, 220, 189, 10, 47, 223, 63, 89, 112, 177, 60, 125, 254, 235, 0, 235, 237, 133, 127, 237, 59, 156, 58, 67, 0, 0, 0, 255, 255, 0, 0, 0, 0, 0, 0, 157, 7, 215, 189, 144, 159, 223, 63, 14, 46, 22, 61, 125, 253, 236, 0, 235, 244, 132, 127, 106, 58, 125, 58, 67, 0, 0, 0, 255, 255, 0, 0, 0, 0, 0, 0, 12, 90, 200, 189, 77, 133, 228, 63, 68, 243, 100, 60, 126, 243, 252, 0, 251, 249, 130, 127, 237, 59, 72, 56, 67, 0, 0, 0, 255, 255, 0, 0, 0, 0, 0, 0, 141, 230, 200, 189, 129, 146, 228, 63, 88, 25, 6, 61, 125, 241, 252, 0, 251, 249, 130, 127, 106, 58, 82, 56, 67, 0, 0, 0, 255, 255, 0, 0, 0, 0, 0, 0, 89, 160, 189, 189, 11, 42, 236, 63, 5, 219, 1, 61, 125, 245, 241, 0, 241, 251, 131, 127, 106, 58, 193, 49, 67, 0, 0, 0, 255, 255, 0, 0, 0, 0, 0, 0, 122, 136, 198, 189, 213, 7, 232, 63, 99, 91, 248, 60, 126, 249, 248, 0, 247, 250, 130, 127, 106, 58, 6, 54, 67, 0, 0, 0, 255, 255, 0, 0, 0, 0, 0, 0, 13, 198, 200, 189, 163, 7, 232, 63, 109, 226, 72, 60, 126, 249, 247, 0, 247, 250, 130, 127, 237, 59, 238, 53, 67, 0, 0, 0, 255, 255, 0, 0, 0, 0, 0, 0, 192, 9, 197, 189, 181, 51, 236, 63, 240, 99, 48, 60, 125, 245, 241, 0, 241, 252, 131, 127, 237, 59, 146, 49, 67, 0, 0, 0, 255, 255, 0, 0, 0, 0, 0, 0 ),
"array_index_data": PoolByteArray( 0, 0, 2, 0, 1, 0, 3, 0, 2, 0, 0, 0, 3, 0, 4, 0, 2, 0, 5, 0, 4, 0, 3, 0, 6, 0, 8, 0, 7, 0, 6, 0, 9, 0, 8, 0, 10, 0, 9, 0, 6, 0, 10, 0, 11, 0, 9, 0, 5, 0, 8, 0, 4, 0, 7, 0, 8, 0, 5, 0, 12, 0, 14, 0, 13, 0, 12, 0, 15, 0, 14, 0, 16, 0, 18, 0, 17, 0, 16, 0, 19, 0, 18, 0, 20, 0, 22, 0, 21, 0, 23, 0, 22, 0, 20, 0, 24, 0, 15, 0, 12, 0, 24, 0, 25, 0, 15, 0, 26, 0, 19, 0, 16, 0, 26, 0, 27, 0, 19, 0, 23, 0, 28, 0, 22, 0, 29, 0, 28, 0, 23, 0, 30, 0, 32, 0, 31, 0, 33, 0, 32, 0, 30, 0, 34, 0, 36, 0, 35, 0, 37, 0, 36, 0, 34, 0, 37, 0, 38, 0, 36, 0, 39, 0, 38, 0, 37, 0, 39, 0, 40, 0, 38, 0, 41, 0, 40, 0, 39, 0, 42, 0, 44, 0, 43, 0, 45, 0, 44, 0, 42, 0, 46, 0, 48, 0, 47, 0, 49, 0, 48, 0, 46, 0, 50, 0, 47, 0, 51, 0, 46, 0, 47, 0, 50, 0, 52, 0, 31, 0, 53, 0, 30, 0, 31, 0, 52, 0, 41, 0, 14, 0, 40, 0, 13, 0, 14, 0, 41, 0, 17, 0, 44, 0, 45, 0, 17, 0, 18, 0, 44, 0, 49, 0, 53, 0, 48, 0, 52, 0, 53, 0, 49, 0, 54, 0, 56, 0, 55, 0, 57, 0, 56, 0, 54, 0, 57, 0, 58, 0, 56, 0, 59, 0, 58, 0, 57, 0, 60, 0, 62, 0, 61, 0, 60, 0, 63, 0, 62, 0, 64, 0, 63, 0, 60, 0, 64, 0, 65, 0, 63, 0, 66, 0, 68, 0, 67, 0, 59, 0, 62, 0, 58, 0, 61, 0, 62, 0, 59, 0, 69, 0, 67, 0, 68, 0, 69, 0, 70, 0, 67, 0, 71, 0, 70, 0, 69, 0, 71, 0, 72, 0, 70, 0, 73, 0, 72, 0, 71, 0, 73, 0, 74, 0, 72, 0, 75, 0, 77, 0, 76, 0, 78, 0, 77, 0, 75, 0, 78, 0, 79, 0, 77, 0, 80, 0, 79, 0, 78, 0, 81, 0, 79, 0, 80, 0, 81, 0, 82, 0, 79, 0, 83, 0, 82, 0, 81, 0, 83, 0, 84, 0, 82, 0, 85, 0, 87, 0, 86, 0, 88, 0, 87, 0, 85, 0, 88, 0, 89, 0, 87, 0, 90, 0, 89, 0, 88, 0, 90, 0, 91, 0, 89, 0, 92, 0, 91, 0, 90, 0, 92, 0, 93, 0, 91, 0, 94, 0, 93, 0, 92, 0, 60, 0, 95, 0, 64, 0, 96, 0, 98, 0, 97, 0, 96, 0, 99, 0, 98, 0, 100, 0, 99, 0, 96, 0, 100, 0, 101, 0, 99, 0, 102, 0, 101, 0, 100, 0, 102, 0, 103, 0, 101, 0, 104, 0, 103, 0, 102, 0, 104, 0, 105, 0, 103, 0, 24, 0, 55, 0, 25, 0, 54, 0, 55, 0, 24, 0, 97, 0, 27, 0, 26, 0, 97, 0, 98, 0, 27, 0, 29, 0, 76, 0, 28, 0, 75, 0, 76, 0, 29, 0, 33, 0, 106, 0, 32, 0, 107, 0, 106, 0, 33, 0, 107, 0, 86, 0, 106, 0, 85, 0, 86, 0, 107, 0, 108, 0, 110, 0, 109, 0, 108, 0, 111, 0, 110, 0, 112, 0, 111, 0, 108, 0, 112, 0, 113, 0, 111, 0, 114, 0, 116, 0, 115, 0, 117, 0, 116, 0, 114, 0, 114, 0, 113, 0, 112, 0, 114, 0, 115, 0, 113, 0, 118, 0, 120, 0, 119, 0, 118, 0, 121, 0, 120, 0, 122, 0, 121, 0, 118, 0, 122, 0, 123, 0, 121, 0, 124, 0, 126, 0, 125, 0, 127, 0, 126, 0, 124, 0, 127, 0, 128, 0, 126, 0, 129, 0, 128, 0, 127, 0, 124, 0, 123, 0, 122, 0, 124, 0, 125, 0, 123, 0, 130, 0, 132, 0, 131, 0, 133, 0, 132, 0, 130, 0, 134, 0, 136, 0, 135, 0, 137, 0, 136, 0, 134, 0, 138, 0, 140, 0, 139, 0, 138, 0, 141, 0, 140, 0, 133, 0, 142, 0, 132, 0, 143, 0, 142, 0, 133, 0, 137, 0, 144, 0, 136, 0, 145, 0, 144, 0, 137, 0, 146, 0, 141, 0, 138, 0, 146, 0, 147, 0, 141, 0, 148, 0, 150, 0, 149, 0, 148, 0, 151, 0, 150, 0, 152, 0, 154, 0, 153, 0, 152, 0, 155, 0, 154, 0, 156, 0, 155, 0, 152, 0, 156, 0, 157, 0, 155, 0, 158, 0, 157, 0, 156, 0, 158, 0, 159, 0, 157, 0, 160, 0, 162, 0, 161, 0, 160, 0, 163, 0, 162, 0, 164, 0, 166, 0, 165, 0, 164, 0, 167, 0, 166, 0, 165, 0, 169, 0, 168, 0, 165, 0, 166, 0, 169, 0, 149, 0, 171, 0, 170, 0, 149, 0, 150, 0, 171, 0, 130, 0, 159, 0, 158, 0, 130, 0, 131, 0, 159, 0, 160, 0, 135, 0, 163, 0, 134, 0, 135, 0, 160, 0, 170, 0, 167, 0, 164, 0, 170, 0, 171, 0, 167, 0, 172, 0, 174, 0, 173, 0, 172, 0, 175, 0, 174, 0, 176, 0, 175, 0, 172, 0, 176, 0, 177, 0, 175, 0, 178, 0, 180, 0, 179, 0, 181, 0, 180, 0, 178, 0, 181, 0, 182, 0, 180, 0, 183, 0, 182, 0, 181, 0, 184, 0, 186, 0, 185, 0, 178, 0, 177, 0, 176, 0, 178, 0, 179, 0, 177, 0, 186, 0, 187, 0, 185, 0, 188, 0, 187, 0, 186, 0, 188, 0, 189, 0, 187, 0, 190, 0, 189, 0, 188, 0, 190, 0, 191, 0, 189, 0, 192, 0, 191, 0, 190, 0, 193, 0, 195, 0, 194, 0, 193, 0, 196, 0, 195, 0, 197, 0, 196, 0, 193, 0, 197, 0, 198, 0, 196, 0, 197, 0, 199, 0, 198, 0, 200, 0, 199, 0, 197, 0, 200, 0, 201, 0, 199, 0, 202, 0, 201, 0, 200, 0, 203, 0, 205, 0, 204, 0, 203, 0, 206, 0, 205, 0, 207, 0, 206, 0, 203, 0, 207, 0, 208, 0, 206, 0, 209, 0, 208, 0, 207, 0, 209, 0, 210, 0, 208, 0, 211, 0, 210, 0, 209, 0, 211, 0, 212, 0, 210, 0, 180, 0, 182, 0, 213, 0, 214, 0, 216, 0, 215, 0, 217, 0, 216, 0, 214, 0, 217, 0, 218, 0, 216, 0, 219, 0, 218, 0, 217, 0, 219, 0, 220, 0, 218, 0, 221, 0, 220, 0, 219, 0, 221, 0, 222, 0, 220, 0, 223, 0, 222, 0, 221, 0, 173, 0, 142, 0, 143, 0, 173, 0, 174, 0, 142, 0, 145, 0, 215, 0, 144, 0, 214, 0, 215, 0, 145, 0, 194, 0, 147, 0, 146, 0, 194, 0, 195, 0, 147, 0, 224, 0, 151, 0, 148, 0, 224, 0, 225, 0, 151, 0, 204, 0, 225, 0, 224, 0, 204, 0, 205, 0, 225, 0, 226, 0, 228, 0, 227, 0, 229, 0, 228, 0, 226, 0, 229, 0, 230, 0, 228, 0, 231, 0, 230, 0, 229, 0, 232, 0, 234, 0, 233, 0, 232, 0, 235, 0, 234, 0, 231, 0, 234, 0, 230, 0, 233, 0, 234, 0, 231, 0 ),
"blend_shape_data": [  ],
"format": 97751,
"index_count": 624,
"material": ExtResource( 1 ),
"primitive": 4,
"skeleton_aabb": [ AABB( 0, 0, 0, -1, -1, -1 ), AABB( 0, 0, 0, -1, -1, -1 ), AABB( 0, 0, 0, -1, -1, -1 ), AABB( 0, 0, 0, -1, -1, -1 ), AABB( 0, 0, 0, -1, -1, -1 ), AABB( 0, 0, 0, -1, -1, -1 ), AABB( 0, 0, 0, -1, -1, -1 ), AABB( 0, 0, 0, -1, -1, -1 ), AABB( 0, 0, 0, -1, -1, -1 ), AABB( 0, 0, 0, -1, -1, -1 ), AABB( 0, 0, 0, -1, -1, -1 ), AABB( 0, 0, 0, -1, -1, -1 ), AABB( 0, 0, 0, -1, -1, -1 ), AABB( 0, 0, 0, -1, -1, -1 ), AABB( 0, 0, 0, -1, -1, -1 ), AABB( 0, 0, 0, -1, -1, -1 ), AABB( 0, 0, 0, -1, -1, -1 ), AABB( 0, 0, 0, -1, -1, -1 ), AABB( 0, 0, 0, -1, -1, -1 ), AABB( 0, 0, 0, -1, -1, -1 ), AABB( 0, 0, 0, -1, -1, -1 ), AABB( 0, 0, 0, -1, -1, -1 ), AABB( 0, 0, 0, -1, -1, -1 ), AABB( 0, 0, 0, -1, -1, -1 ), AABB( 0, 0, 0, -1, -1, -1 ), AABB( 0, 0, 0, -1, -1, -1 ), AABB( 0, 0, 0, -1, -1, -1 ), AABB( 0, 0, 0, -1, -1, -1 ), AABB( 0, 0, 0, -1, -1, -1 ), AABB( 0, 0, 0, -1, -1, -1 ), AABB( 0, 0, 0, -1, -1, -1 ), AABB( 0, 0, 0, -1, -1, -1 ), AABB( 0, 0, 0, -1, -1, -1 ), AABB( 0, 0, 0, -1, -1, -1 ), AABB( 0, 0, 0, -1, -1, -1 ), AABB( 0, 0, 0, -1, -1, -1 ), AABB( 0, 0, 0, -1, -1, -1 ), AABB( 0, 0, 0, -1, -1, -1 ), AABB( 0, 0, 0, -1, -1, -1 ), AABB( 0, 0, 0, -1, -1, -1 ), AABB( 0, 0, 0, -1, -1, -1 ), AABB( 0, 0, 0, -1, -1, -1 ), AABB( 0, 0, 0, -1, -1, -1 ), AABB( 0, 0, 0, -1, -1, -1 ), AABB( 0, 0, 0, -1, -1, -1 ), AABB( 0, 0, 0, -1, -1, -1 ), AABB( 0, 0, 0, -1, -1, -1 ), AABB( 0, 0, 0, -1, -1, -1 ), AABB( 0, 0, 0, -1, -1, -1 ), AABB( 0, 0, 0, -1, -1, -1 ), AABB( 0, 0, 0, -1, -1, -1 ), AABB( 0, 0, 0, -1, -1, -1 ), AABB( 0, 0, 0, -1, -1, -1 ), AABB( 0, 0, 0, -1, -1, -1 ), AABB( 0, 0, 0, -1, -1, -1 ), AABB( 0, 0, 0, -1, -1, -1 ), AABB( 0, 0, 0, -1, -1, -1 ), AABB( 0, 0, 0, -1, -1, -1 ), AABB( 0, 0, 0, -1, -1, -1 ), AABB( 0, 0, 0, -1, -1, -1 ), AABB( 0, 0, 0, -1, -1, -1 ), AABB( 0, 0, 0, -1, -1, -1 ), AABB( 0, 0, 0, -1, -1, -1 ), AABB( 0, 0, 0, -1, -1, -1 ), AABB( 0, 0, 0, -1, -1, -1 ), AABB( 0, 0, 0, -1, -1, -1 ), AABB( 0, 0, 0, -1, -1, -1 ), AABB( -0.11538, 1.63642, 0.000647988, 0.23076, 0.256086, 0.096802 ) ],
"vertex_count": 236
}

[sub_resource type="Skin" id=2]
resource_name = "Skin"
bind_count = 156
bind/0/name = "global"
bind/0/bone = -1
bind/0/pose = Transform( 1, 1.23313e-13, -7.2267e-07, 1.66723e-13, 1, 4.01339e-07, 7.2267e-07, -4.01339e-07, 1, -6.97974e-09, 0.0114655, 0.01051 )
bind/1/name = "position"
bind/1/bone = -1
bind/1/pose = Transform( 1, 1.19153e-13, -7.1277e-07, 1.66909e-13, 1, 4.01339e-07, 7.1277e-07, -4.01339e-07, 1, -6.87569e-09, 0.0114655, 0.01051 )
bind/2/name = "hips"
bind/2/bone = -1
bind/2/pose = Transform( 1, 5.13178e-08, -6.3035e-07, 1.85521e-08, 0.993893, 0.110346, 6.32164e-07, -0.110346, 0.993893, -7.12523e-08, -1.0268, 0.133055 )
bind/3/name = "lower_back"
bind/3/bone = -1
bind/3/pose = Transform( 1, -1.35904e-08, -7.5413e-07, -2.26092e-08, 0.998848, -0.047981, 7.53914e-07, 0.047981, 0.998848, -2.19086e-09, -1.08813, -0.0392615 )
bind/4/name = "lower_back_adjust"
bind/4/bone = -1
bind/4/pose = Transform( 1, -1.5719e-08, -7.98442e-07, -2.26092e-08, 0.998848, -0.047981, 7.98277e-07, 0.047981, 0.998848, -4.4906e-10, -1.1418, -0.0392616 )
bind/5/name = "lower_back_belly"
bind/5/bone = -1
bind/5/pose = Transform( 1, -2.17043e-08, -9.23042e-07, -2.26092e-08, 0.998848, -0.047981, 9.2302e-07, 0.047981, 0.998848, 4.44857e-09, -1.17677, -0.0392616 )
bind/6/name = "spine"
bind/6/bone = -1
bind/6/pose = Transform( 1, 1.01402e-07, 2.98477e-07, -3.32301e-08, 0.975484, -0.220071, -3.13475e-07, 0.220071, 0.975484, -1.28922e-07, -1.25481, -0.260157 )
bind/7/name = "spine_adjust"
bind/7/bone = -1
bind/7/pose = Transform( 1, 1.13304e-07, 3.51233e-07, -3.32301e-08, 0.975484, -0.220071, -3.67557e-07, 0.220071, 0.975484, -1.42942e-07, -1.29232, -0.26006 )
bind/8/name = "spine_1"
bind/8/bone = -1
bind/8/pose = Transform( 1, -6.51205e-14, -6.23173e-07, -7.1882e-13, 1, -1.2219e-06, 6.23173e-07, 1.2219e-06, 1, -3.87145e-08, -1.46054, 0.0628258 )
bind/9/name = "spine_1_adjust"
bind/9/bone = -1
bind/9/pose = Transform( 1, -1.39829e-13, -6.86461e-07, -7.21441e-13, 1, -1.2219e-06, 6.8646e-07, 1.2219e-06, 1, -4.26906e-08, -1.50252, 0.0628258 )
bind/10/name = "right_outer_breast"
bind/10/bone = -1
bind/10/pose = Transform( 0.941961, -0.0140017, 0.335431, -0.335612, -0.0136156, 0.941902, -0.00862121, -0.999809, -0.0175246, 0.0648618, -0.0507378, 1.5043 )
bind/11/name = "right_inner_breast"
bind/11/bone = -1
bind/11/pose = Transform( 0.935579, -0.0646256, 0.347153, -0.34228, 0.0757229, 0.936542, -0.0868121, -0.995032, 0.0487247, 0.13917, -0.243545, 1.48336 )
bind/12/name = "left_outer_breast"
bind/12/bone = -1
bind/12/pose = Transform( 0.941961, 0.0140016, -0.335431, 0.335612, -0.0136156, 0.941902, 0.00862107, -0.999809, -0.0175245, -0.0648617, -0.0507379, 1.5043 )
bind/13/name = "left_inner_breast"
bind/13/bone = -1
bind/13/pose = Transform( 0.935579, 0.0646256, -0.347153, 0.34228, 0.0757229, 0.936542, 0.086812, -0.995032, 0.0487247, -0.13917, -0.243545, 1.48336 )
bind/14/name = "left_shoulder"
bind/14/bone = -1
bind/14/pose = Transform( -0.294711, -0.955574, 0.00491031, 0.950546, -0.29368, -0.101066, 0.0980178, -0.0251178, 0.994868, 1.59292, 0.428172, 0.0954396 )
bind/15/name = "left_arm"
bind/15/bone = -1
bind/15/pose = Transform( -0.693215, -0.713776, 0.099886, 0.69847, -0.6995, -0.15113, 0.177743, -0.034998, 0.983455, 1.29507, 0.96523, 0.0938936 )
bind/16/name = "left_fore_arm"
bind/16/bone = -1
bind/16/pose = Transform( -0.620395, -0.784275, 0.0047373, 0.782681, -0.618725, 0.0677456, -0.0502, 0.0457368, 0.997692, 1.35395, 0.565521, 0.0732766 )
bind/17/name = "left_hand"
bind/17/bone = -1
bind/17/pose = Transform( -0.0493084, 0.0940457, 0.994346, 0.770607, -0.629765, 0.097777, 0.6354, 0.771072, -0.0414196, 0.0127393, 0.309062, -1.35058 )
bind/18/name = "left_hand_finger_5_1"
bind/18/bone = -1
bind/18/pose = Transform( -0.992545, -0.118866, -0.0269389, 0.0743453, -0.765607, 0.638999, -0.09658, 0.632232, 0.768736, 0.776523, 0.90826, -0.658291 )
bind/19/name = "left_hand_finger_5_2"
bind/19/bone = -1
bind/19/pose = Transform( -0.992854, -0.0966306, 0.0700259, 0.119285, -0.786343, 0.606166, -0.00350981, 0.610187, 0.79225, 0.753635, 0.869484, -0.691319 )
bind/20/name = "left_hand_finger_5_3"
bind/20/bone = -1
bind/20/pose = Transform( -0.984252, -0.167113, 0.0576331, 0.170923, -0.816509, 0.551451, -0.0450965, 0.552618, 0.832214, 0.828862, 0.831322, -0.598006 )
bind/21/name = "left_hand_finger_1_1"
bind/21/bone = -1
bind/21/pose = Transform( 0.390028, 0.234283, 0.8905, 0.646904, -0.757939, -0.0839282, 0.655282, 0.608802, -0.447176, -0.429601, 0.434953, -1.2166 )
bind/22/name = "left_hand_finger_1_2"
bind/22/bone = -1
bind/22/pose = Transform( 0.385461, 0.193311, 0.902248, 0.466129, -0.884665, -0.00959764, 0.796332, 0.424263, -0.431112, -0.378145, 0.676316, -1.10431 )
bind/23/name = "left_hand_finger_1_3"
bind/23/bone = -1
bind/23/pose = Transform( 0.433326, 0.223098, 0.873188, 0.393041, -0.918665, 0.0396674, 0.811016, 0.32601, -0.485768, -0.449719, 0.748869, -1.01206 )
bind/24/name = "left_hand_finger_2_1"
bind/24/bone = -1
bind/24/pose = Transform( 0.220196, 0.222111, 0.949832, 0.62787, -0.777474, 0.0362494, 0.746521, 0.588389, -0.310653, -0.314734, 0.48206, -1.24251 )
bind/25/name = "left_hand_finger_2_2"
bind/25/bone = -1
bind/25/pose = Transform( 0.207569, 0.223243, 0.952407, 0.505083, -0.85825, 0.0910942, 0.837739, 0.462136, -0.290902, -0.306657, 0.625711, -1.16201 )
bind/26/name = "left_hand_finger_2_3"
bind/26/bone = -1
bind/26/pose = Transform( 0.194864, 0.215056, 0.956964, 0.366724, -0.920879, 0.132272, 0.909693, 0.325166, -0.258313, -0.28771, 0.766354, -1.0596 )
bind/27/name = "left_hand_finger_3_1"
bind/27/bone = -1
bind/27/pose = Transform( 0.0576452, 0.206654, 0.976715, 0.678938, -0.725385, 0.113407, 0.731929, 0.656591, -0.18212, -0.208506, 0.389966, -1.29803 )
bind/28/name = "left_hand_finger_3_2"
bind/28/bone = -1
bind/28/pose = Transform( 0.079894, 0.149245, 0.985568, 0.559624, -0.82492, 0.0795528, 0.824887, 0.545192, -0.149427, -0.158784, 0.535091, -1.23696 )
bind/29/name = "left_hand_finger_3_3"
bind/29/bone = -1
bind/29/pose = Transform( 0.0320837, 0.161219, 0.986397, 0.480479, -0.867876, 0.12622, 0.87642, 0.469893, -0.105307, -0.135727, 0.602722, -1.18989 )
bind/30/name = "left_hand_finger_4_1"
bind/30/bone = -1
bind/30/pose = Transform( -0.0551933, 0.194053, 0.979437, 0.73433, -0.656769, 0.171505, 0.676545, 0.728696, -0.10625, -0.141596, 0.276016, -1.33479 )
bind/31/name = "left_hand_finger_4_2"
bind/31/bone = -1
bind/31/pose = Transform( -0.0678895, 0.202986, 0.976826, 0.608335, -0.7676, 0.201788, 0.790772, 0.607936, -0.0713714, -0.142549, 0.436546, -1.27963 )
bind/32/name = "left_hand_finger_4_3"
bind/32/bone = -1
bind/32/pose = Transform( -0.0567189, 0.193731, 0.979414, 0.488109, -0.850381, 0.196475, 0.870938, 0.489204, -0.046329, -0.140625, 0.583741, -1.20732 )
bind/33/name = "left_fore_arm_adjust"
bind/33/bone = -1
bind/33/pose = Transform( -0.620395, -0.784275, 0.00473677, 0.782681, -0.618726, 0.0677456, -0.0502004, 0.0457364, 0.997692, 1.35395, 0.530452, 0.0732774 )
bind/34/name = "left_fore_arm_twist"
bind/34/bone = -1
bind/34/pose = Transform( -0.620395, -0.784275, 0.00473646, 0.782681, -0.618726, 0.0677456, -0.0502006, 0.0457362, 0.997692, 1.35395, 0.425245, 0.0732778 )
bind/35/name = "left_fore_arm_twist_adjust"
bind/35/bone = -1
bind/35/pose = Transform( -0.620395, -0.784275, 0.00473656, 0.782681, -0.618726, 0.0677456, -0.0502005, 0.0457363, 0.997692, 1.35395, 0.390176, 0.0732777 )
bind/36/name = "left_arm_adjust"
bind/36/bone = -1
bind/36/pose = Transform( -0.69687, -0.616763, -0.366026, 0.69847, -0.6995, -0.15113, -0.162823, -0.360976, 0.918251, 1.105, 0.895739, 0.681902 )
bind/37/name = "left_shoulder_adjust"
bind/37/bone = -1
bind/37/pose = Transform( -0.310472, -0.907222, -0.283823, 0.950546, -0.29368, -0.101066, 0.00833579, -0.301165, 0.953536, 1.49678, 0.387746, 0.553302 )
bind/38/name = "left_trapezius"
bind/38/bone = -1
bind/38/pose = Transform( 3.50178e-07, 1.39326e-06, -1, 1, -5.93724e-08, 3.8743e-07, -1.13854e-07, -1, -1.34483e-06, -0.0995377, -0.0937125, 1.67642 )
bind/39/name = "right_shoulder"
bind/39/bone = -1
bind/39/pose = Transform( -0.294712, 0.955574, -0.00491025, -0.950546, -0.29368, -0.101066, -0.0980178, -0.0251179, 0.994868, -1.59292, 0.428172, 0.0954397 )
bind/40/name = "right_arm"
bind/40/bone = -1
bind/40/pose = Transform( -0.693215, 0.713775, -0.0998861, -0.69847, -0.6995, -0.15113, -0.177743, -0.0349981, 0.983455, -1.29507, 0.96523, 0.0938936 )
bind/41/name = "right_fore_arm"
bind/41/bone = -1
bind/41/pose = Transform( -0.620396, 0.784275, -0.00473712, -0.782681, -0.618726, 0.0677456, 0.0502001, 0.0457367, 0.997692, -1.35394, 0.565522, 0.0732768 )
bind/42/name = "right_hand"
bind/42/bone = -1
bind/42/pose = Transform( -0.0493084, -0.0940455, -0.994346, -0.770607, -0.629765, 0.0977769, -0.6354, 0.771071, -0.0414194, -0.0127396, 0.309062, -1.35058 )
bind/43/name = "right_hand_finger_5_1"
bind/43/bone = -1
bind/43/pose = Transform( -0.992545, 0.118866, 0.0269392, -0.074345, -0.765606, 0.639, 0.0965804, 0.632233, 0.768735, -0.776523, 0.908258, -0.658292 )
bind/44/name = "right_hand_finger_5_2"
bind/44/bone = -1
bind/44/pose = Transform( -0.992854, 0.0966343, -0.0700226, -0.119285, -0.786342, 0.606167, 0.0035148, 0.610188, 0.792249, -0.753639, 0.869482, -0.691317 )
bind/45/name = "right_hand_finger_5_3"
bind/45/bone = -1
bind/45/pose = Transform( -0.984253, 0.167112, -0.0576316, -0.170921, -0.816508, 0.551454, 0.0450981, 0.552621, 0.832212, -0.828862, 0.83132, -0.598009 )
bind/46/name = "right_hand_finger_1_1"
bind/46/bone = -1
bind/46/pose = Transform( 0.390027, -0.234283, -0.8905, -0.646904, -0.757939, -0.0839273, -0.655282, 0.608802, -0.447176, 0.429601, 0.434953, -1.2166 )
bind/47/name = "right_hand_finger_1_2"
bind/47/bone = -1
bind/47/pose = Transform( 0.385461, -0.193311, -0.902248, -0.466129, -0.884665, -0.00959708, -0.796332, 0.424263, -0.431111, 0.378145, 0.676315, -1.10431 )
bind/48/name = "right_hand_finger_1_3"
bind/48/bone = -1
bind/48/pose = Transform( 0.433325, -0.223098, -0.873188, -0.393041, -0.918665, 0.0396678, -0.811017, 0.32601, -0.485767, 0.449719, 0.748869, -1.01206 )
bind/49/name = "right_hand_finger_2_1"
bind/49/bone = -1
bind/49/pose = Transform( 0.220195, -0.222111, -0.949832, -0.62787, -0.777474, 0.0362505, -0.746521, 0.588389, -0.310653, 0.314734, 0.48206, -1.24251 )
bind/50/name = "right_hand_finger_2_2"
bind/50/bone = -1
bind/50/pose = Transform( 0.207569, -0.223244, -0.952406, -0.505083, -0.85825, 0.0910953, -0.837739, 0.462135, -0.290902, 0.306659, 0.625711, -1.16201 )
bind/51/name = "right_hand_finger_2_3"
bind/51/bone = -1
bind/51/pose = Transform( 0.194864, -0.215058, -0.956963, -0.366726, -0.920878, 0.132273, -0.909692, 0.325168, -0.258313, 0.287713, 0.76635, -1.0596 )
bind/52/name = "right_hand_finger_3_1"
bind/52/bone = -1
bind/52/pose = Transform( 0.0576447, -0.206655, -0.976715, -0.678938, -0.725385, 0.113408, -0.73193, 0.656591, -0.18212, 0.208507, 0.389966, -1.29803 )
bind/53/name = "right_hand_finger_3_2"
bind/53/bone = -1
bind/53/pose = Transform( 0.0798938, -0.149246, -0.985567, -0.559624, -0.82492, 0.0795536, -0.824887, 0.545191, -0.149428, 0.158785, 0.535091, -1.23696 )
bind/54/name = "right_hand_finger_3_3"
bind/54/bone = -1
bind/54/pose = Transform( 0.0320831, -0.16122, -0.986397, -0.480478, -0.867876, 0.126221, -0.87642, 0.469893, -0.105307, 0.135728, 0.602722, -1.18989 )
bind/55/name = "right_hand_finger_4_1"
bind/55/bone = -1
bind/55/pose = Transform( -0.055194, -0.194054, -0.979437, -0.73433, -0.656769, 0.171506, -0.676545, 0.728696, -0.10625, 0.141597, 0.276015, -1.33479 )
bind/56/name = "right_hand_finger_4_2"
bind/56/bone = -1
bind/56/pose = Transform( -0.0678897, -0.202987, -0.976825, -0.608335, -0.7676, 0.201789, -0.790772, 0.607936, -0.0713718, 0.142551, 0.436545, -1.27963 )
bind/57/name = "right_hand_finger_4_3"
bind/57/bone = -1
bind/57/pose = Transform( -0.0567189, -0.193732, -0.979414, -0.488109, -0.850381, 0.196475, -0.870938, 0.489204, -0.0463294, 0.140627, 0.58374, -1.20732 )
bind/58/name = "right_fore_arm_adjust"
bind/58/bone = -1
bind/58/pose = Transform( -0.620396, 0.784275, -0.00473666, -0.782681, -0.618726, 0.0677456, 0.0502004, 0.0457363, 0.997692, -1.35394, 0.530453, 0.0732776 )
bind/59/name = "right_fore_arm_twist"
bind/59/bone = -1
bind/59/pose = Transform( -0.620396, 0.784275, -0.00473627, -0.782681, -0.618726, 0.0677456, 0.0502007, 0.045736, 0.997692, -1.35394, 0.425246, 0.0732781 )
bind/60/name = "right_fore_arm_twist_adjust"
bind/60/bone = -1
bind/60/pose = Transform( -0.620396, 0.784275, -0.0047365, -0.782681, -0.618726, 0.0677456, 0.0502005, 0.0457362, 0.997692, -1.35394, 0.390177, 0.0732778 )
bind/61/name = "right_arm_adjust"
bind/61/bone = -1
bind/61/pose = Transform( -0.696871, 0.616762, 0.366027, -0.69847, -0.6995, -0.15113, 0.162825, -0.360976, 0.918251, -1.105, 0.89574, 0.681904 )
bind/62/name = "right_shoulder_adjust"
bind/62/bone = -1
bind/62/pose = Transform( -0.310472, 0.907222, 0.283823, -0.950546, -0.29368, -0.101066, -0.00833586, -0.301165, 0.953536, -1.49678, 0.387746, 0.553302 )
bind/63/name = "right_trapezius"
bind/63/bone = -1
bind/63/pose = Transform( 3.57628e-07, -1.35787e-06, 1, -1, -7.73003e-08, 3.57628e-07, 9.12692e-08, -1, -1.30758e-06, 0.0995377, -0.0937124, 1.67642 )
bind/64/name = "neck"
bind/64/bone = -1
bind/64/pose = Transform( 1, -4.55301e-09, 3.79311e-09, 3.7926e-09, 0.983539, 0.180697, -4.5536e-09, -0.180697, 0.983539, 8.22354e-09, -1.619, 0.361323 )
bind/65/name = "neck_adjust"
bind/65/bone = -1
bind/65/pose = Transform( 1, 1.51894e-07, -8.47755e-07, 3.79278e-09, 0.983539, 0.180697, 8.61246e-07, -0.180697, 0.983539, -3.0461e-07, -1.65456, 0.361323 )
bind/66/name = "head"
bind/66/bone = -1
bind/66/pose = Transform( 1, -2.29015e-08, -2.61161e-07, 2.68635e-08, 0.999885, 0.015181, 2.60783e-07, -0.015181, 0.999885, 2.87331e-08, -1.75734, 0.071037 )
bind/67/name = "head_adjust"
bind/67/bone = -1
bind/67/pose = Transform( 1, -2.4408e-08, -1.61938e-07, 2.68635e-08, 0.999885, 0.015181, 1.61548e-07, -0.015181, 0.999885, 3.57824e-08, -1.80929, 0.071037 )
bind/68/name = "mandible"
bind/68/bone = -1
bind/68/pose = Transform( -1, -2.73826e-09, 5.96829e-08, 5.24514e-08, -0.518552, 0.855047, 2.86072e-08, 0.855046, 0.518552, 9.39464e-05, 0.925702, -1.54558 )
bind/69/name = "left_lips"
bind/69/bone = -1
bind/69/pose = Transform( -0.986748, 3.86967e-08, 0.162262, 0.162262, 1.14447e-07, 0.986748, 2.53568e-08, 1, -3.96803e-07, 0.0109806, -0.0903346, -1.78282 )
bind/70/name = "left_lips_adjust"
bind/70/bone = -1
bind/70/pose = Transform( -0.986748, 2.8749e-08, 0.162262, 0.162262, 1.14447e-07, 0.986748, 1.55409e-08, 1, -3.95189e-07, 0.0109806, -0.0903346, -1.78282 )
bind/71/name = "right_lips"
bind/71/bone = -1
bind/71/pose = Transform( -0.986748, -2.41686e-08, -0.162262, -0.162262, 2.67849e-07, 0.986748, 4.77689e-08, 1, -5.65994e-07, -0.0109807, -0.0903349, -1.78282 )
bind/72/name = "right_lips_adjust"
bind/72/bone = -1
bind/72/pose = Transform( -0.986748, -9.40746e-09, -0.162262, -0.162262, 2.67849e-07, 0.986748, 6.23344e-08, 1, -5.63599e-07, -0.0109807, -0.0903349, -1.78282 )
bind/73/name = "mandible_adjust"
bind/73/bone = -1
bind/73/pose = Transform( -1, 1.45332e-07, 1.49482e-07, 5.24514e-08, -0.518552, 0.855047, 2.0178e-07, 0.855046, 0.518552, 9.36788e-05, 0.925702, -1.54558 )
bind/74/name = "tongue_1"
bind/74/bone = -1
bind/74/pose = Transform( -1, -4.23179e-06, 4.17702e-07, 5.95598e-07, -0.0421259, 0.999112, -4.21044e-06, 0.999112, 0.0421257, 7.64917e-06, 0.0560116, -1.77506 )
bind/75/name = "tongue_2"
bind/75/bone = -1
bind/75/pose = Transform( 1, -1.0209e-05, -1.15225e-07, 6.01607e-07, 0.0476552, 0.998864, -1.01919e-05, -0.998864, 0.0476555, 1.79637e-05, -0.13178, 1.77037 )
bind/76/name = "left_low_maxilar"
bind/76/bone = -1
bind/76/pose = Transform( -0.894858, 0.134607, -0.425571, -0.44625, -0.290154, 0.846565, -0.00952784, 0.947466, 0.319715, -0.176921, 0.519427, -1.67629 )
bind/77/name = "left_low_maxilar_adjust"
bind/77/bone = -1
bind/77/pose = Transform( -0.894858, 0.134607, -0.425571, -0.44625, -0.290154, 0.846565, -0.0095272, 0.947466, 0.319715, -0.176922, 0.519427, -1.67629 )
bind/78/name = "right_low_maxilar"
bind/78/bone = -1
bind/78/pose = Transform( -0.894857, -0.134607, 0.425572, 0.44625, -0.290154, 0.846564, 0.00952809, 0.947466, 0.319715, 0.176921, 0.519427, -1.67629 )
bind/79/name = "right_low_maxilar_adjust"
bind/79/bone = -1
bind/79/pose = Transform( -0.894857, -0.134608, 0.425571, 0.44625, -0.290154, 0.846564, 0.00952744, 0.947466, 0.319715, 0.176922, 0.519427, -1.67629 )
bind/80/name = "lips_inferior"
bind/80/bone = -1
bind/80/pose = Transform( -1, -5.06626e-08, 1.88861e-07, 1.94989e-07, -0.186005, 0.982549, -1.46495e-08, 0.982549, 0.186004, 9.4037e-05, 0.234461, -1.7686 )
bind/81/name = "lips_inferior_adjust"
bind/81/bone = -1
bind/81/pose = Transform( -1, 6.6062e-07, 3.23522e-07, 1.94997e-07, -0.186005, 0.982549, 7.09268e-07, 0.982549, 0.186004, 9.27567e-05, 0.234461, -1.7686 )
bind/82/name = "left_lips_inferior"
bind/82/bone = -1
bind/82/pose = Transform( -0.991093, -0.0318637, 0.129303, 0.133124, -0.211102, 0.968357, -0.00355928, 0.976945, 0.213463, 0.0545967, 0.280519, -1.76151 )
bind/83/name = "left_lips_inferior_adjust"
bind/83/bone = -1
bind/83/pose = Transform( -0.991093, -0.0318646, 0.129303, 0.133124, -0.211102, 0.968357, -0.00356014, 0.976944, 0.213463, 0.0545982, 0.280519, -1.76151 )
bind/84/name = "right_lips_inferior"
bind/84/bone = -1
bind/84/pose = Transform( -0.991093, 0.0318637, -0.129303, -0.133124, -0.211102, 0.968357, 0.00355929, 0.976945, 0.213463, -0.0545966, 0.280519, -1.76151 )
bind/85/name = "right_lips_inferior_adjust"
bind/85/bone = -1
bind/85/pose = Transform( -0.991093, 0.0318645, -0.129303, -0.133124, -0.211102, 0.968357, 0.00356015, 0.976945, 0.213463, -0.0545981, 0.280519, -1.76151 )
bind/86/name = "left_cheek"
bind/86/bone = -1
bind/86/pose = Transform( -0.62841, -0.00526736, 0.777864, 0.777875, 1.68337e-07, 0.628419, -0.00331028, 0.999986, 0.00409717, -0.0263445, -0.0719784, -1.83719 )
bind/87/name = "left_cheek_adjust"
bind/87/bone = -1
bind/87/pose = Transform( -0.62841, -0.00526735, 0.777864, 0.777875, 1.68337e-07, 0.628419, -0.00331027, 0.999986, 0.00409716, -0.0263445, -0.0719783, -1.83719 )
bind/88/name = "lips_superior"
bind/88/bone = -1
bind/88/pose = Transform( -1, -4.65178e-07, 2.68302e-07, 1.47254e-07, 0.242938, 0.970042, -5.16423e-07, 0.970042, -0.242938, 9.4758e-05, -0.533429, -1.71113 )
bind/89/name = "lips_superior_adjust"
bind/89/bone = -1
bind/89/pose = Transform( -1, 1.03646e-06, -1.07753e-07, 1.47271e-07, 0.242938, 0.970042, 1.03159e-06, 0.970042, -0.242938, 9.21091e-05, -0.533429, -1.71113 )
bind/90/name = "left_lips_superior_middle"
bind/90/bone = -1
bind/90/pose = Transform( -0.98569, 0.0412875, 0.163434, 0.168565, 0.247231, 0.954182, -0.00101022, 0.968077, -0.250653, -0.0795088, -0.53944, -1.70669 )
bind/91/name = "left_lips_superior_middle_adjust"
bind/91/bone = -1
bind/91/pose = Transform( -0.98569, 0.0415322, 0.163371, 0.168565, 0.247231, 0.954182, -0.000761051, 0.968066, -0.250694, -0.0799402, -0.53944, -1.70667 )
bind/92/name = "right_lips_superior_middle"
bind/92/bone = -1
bind/92/pose = Transform( -0.98569, -0.0412874, -0.163434, -0.168565, 0.247231, 0.954182, 0.00101028, 0.968077, -0.250653, 0.0795086, -0.53944, -1.70669 )
bind/93/name = "right_lips_superior_middle_adjust"
bind/93/bone = -1
bind/93/pose = Transform( -0.985691, -0.0415322, -0.163371, -0.168565, 0.247231, 0.954182, 0.000761033, 0.968066, -0.250694, 0.0799402, -0.53944, -1.70667 )
bind/94/name = "upper_lips"
bind/94/bone = -1
bind/94/pose = Transform( -1, 1.55524e-07, 2.40901e-09, 4.76759e-11, -0.0151799, 0.999885, 1.55543e-07, 0.999885, 0.0151799, 9.3669e-05, -0.0461554, -1.80173 )
bind/95/name = "upper_lips_adjust"
bind/95/bone = -1
bind/95/pose = Transform( -1, 1.50978e-07, 2.34001e-09, 4.76905e-11, -0.0151799, 0.999885, 1.50996e-07, 0.999885, 0.0151799, 9.36772e-05, -0.0461554, -1.80173 )
bind/96/name = "nose_base"
bind/96/bone = -1
bind/96/pose = Transform( -1, 3.81869e-07, -5.9678e-09, -1.22106e-08, -0.0163496, 0.999866, 3.8172e-07, 0.999866, 0.0163496, 9.32541e-05, -0.0742602, -1.8251 )
bind/97/name = "nose_base_adjust"
bind/97/bone = -1
bind/97/pose = Transform( -1, 3.46476e-07, -1.92426e-08, -2.53712e-08, -0.0176964, 0.999843, 3.4608e-07, 0.999843, 0.0176964, 9.332e-05, -0.0718018, -1.8252 )
bind/98/name = "nose_middle"
bind/98/bone = -1
bind/98/pose = Transform( -0.999991, -0.00117195, 0.00416679, 0.00418352, -0.0146551, 0.999884, -0.00111075, 0.999892, 0.0146598, 0.00175281, -0.0713848, -1.8469 )
bind/99/name = "nose_middle_adjust"
bind/99/bone = -1
bind/99/pose = Transform( -0.999981, -0.00121503, 0.00598702, 0.00600305, -0.0136484, 0.999889, -0.00113319, 0.999906, 0.0136554, 0.00165312, -0.0732433, -1.84683 )
bind/100/name = "nose_top"
bind/100/bone = -1
bind/100/pose = Transform( -0.999873, 0.0158391, 0.00184587, 0.00160527, -0.0151894, 0.999883, 0.0158653, 0.999759, 0.015162, -0.0298296, -0.0499751, -1.87488 )
bind/101/name = "nose_top_adjust"
bind/101/bone = -1
bind/101/pose = Transform( -0.999873, 0.0158387, 0.00184587, 0.00160527, -0.0151894, 0.999883, 0.0158649, 0.999759, 0.015162, -0.0298288, -0.049975, -1.87488 )
bind/102/name = "right_cheek"
bind/102/bone = -1
bind/102/pose = Transform( -0.628412, 0.00526764, -0.777863, -0.777874, 1.47382e-07, 0.62842, 0.00331045, 0.999986, 0.00409739, 0.0263439, -0.0719783, -1.83719 )
bind/103/name = "right_cheek_adjust"
bind/103/bone = -1
bind/103/pose = Transform( -0.628412, 0.00526743, -0.777863, -0.777874, 1.47615e-07, 0.62842, 0.00331032, 0.999986, 0.00409723, 0.0263443, -0.0719783, -1.83719 )
bind/104/name = "left_low_cheek"
bind/104/bone = -1
bind/104/pose = Transform( -0.76728, -0.0205127, 0.640984, 0.641312, -0.0244448, 0.76689, -6.22346e-05, 0.999491, 0.031911, 0.024217, -0.0300466, -1.78866 )
bind/105/name = "left_low_cheek_adjust"
bind/105/bone = -1
bind/105/pose = Transform( -0.76728, -0.0205121, 0.640984, 0.641312, -0.0244448, 0.76689, -6.18118e-05, 0.99949, 0.0319107, 0.024216, -0.0300466, -1.78866 )
bind/106/name = "right_low_cheek"
bind/106/bone = -1
bind/106/pose = Transform( -0.76728, 0.0205122, -0.640984, -0.641312, -0.0244438, 0.766891, 6.24247e-05, 0.999491, 0.0319099, -0.0242161, -0.0300484, -1.78866 )
bind/107/name = "right_low_cheek_adjust"
bind/107/bone = -1
bind/107/pose = Transform( -0.76728, 0.020512, -0.640984, -0.641312, -0.0244438, 0.766891, 6.2298e-05, 0.999491, 0.0319098, -0.0242158, -0.0300485, -1.78866 )
bind/108/name = "left_eyebrow_low"
bind/108/bone = -1
bind/108/pose = Transform( -1, 1.49693e-07, -2.68644e-07, -2.34726e-07, 0.192885, 0.981221, 1.98699e-07, 0.981221, -0.192885, 0.0190228, -0.399827, -1.82152 )
bind/109/name = "left_eyebrow_low_adjust"
bind/109/bone = -1
bind/109/pose = Transform( -1, 2.23224e-07, -2.83099e-07, -2.34726e-07, 0.192885, 0.981221, 2.73638e-07, 0.981221, -0.192885, 0.0190227, -0.399827, -1.82152 )
bind/110/name = "right_eyebrow_low"
bind/110/bone = -1
bind/110/pose = Transform( -1, -1.25259e-07, 2.90286e-07, 2.60674e-07, 0.192885, 0.981221, -1.78898e-07, 0.981221, -0.192885, -0.0190228, -0.399827, -1.82152 )
bind/111/name = "right_eyebrow_low_adjust"
bind/111/bone = -1
bind/111/pose = Transform( -1, -1.31333e-07, 2.9148e-07, 2.60674e-07, 0.192885, 0.981221, -1.85089e-07, 0.981221, -0.192885, -0.0190228, -0.399827, -1.82152 )
bind/112/name = "left_eyebrow_middle"
bind/112/bone = -1
bind/112/pose = Transform( -1, -2.98874e-08, -1.77245e-07, -1.79682e-07, 0.192881, 0.981222, 4.8612e-09, 0.981222, -0.192881, 0.0366719, -0.398369, -1.82663 )
bind/113/name = "left_eyebrow_middle_adjust"
bind/113/bone = -1
bind/113/pose = Transform( -1, -1.41558e-10, -1.83093e-07, -1.79682e-07, 0.192881, 0.981222, 3.51763e-08, 0.981222, -0.192881, 0.0366718, -0.398369, -1.82663 )
bind/114/name = "right_eyebrow_middle"
bind/114/bone = -1
bind/114/pose = Transform( -1, 2.79785e-07, 3.22861e-07, 3.70763e-07, 0.192882, 0.981222, 2.12257e-07, 0.981222, -0.192882, -0.0366723, -0.398369, -1.82663 )
bind/115/name = "right_eyebrow_middle_adjust"
bind/115/bone = -1
bind/115/pose = Transform( -1, -2.31511e-08, 3.8241e-07, 3.70764e-07, 0.192882, 0.981222, -9.64762e-08, 0.981222, -0.192882, -0.0366718, -0.398369, -1.82663 )
bind/116/name = "left_eyebrow_up"
bind/116/bone = -1
bind/116/pose = Transform( -0.999997, -0.000412833, -0.0022168, -0.0022548, 0.173138, 0.984895, -2.27854e-05, 0.984898, -0.173138, 0.0527136, -0.351196, -1.83566 )
bind/117/name = "left_eyebrow_up_adjust"
bind/117/bone = -1
bind/117/pose = Transform( -0.999997, -0.000412621, -0.00221684, -0.0022548, 0.173138, 0.984895, -2.25698e-05, 0.984898, -0.173138, 0.0527132, -0.351196, -1.83566 )
bind/118/name = "right_eyebrow_up"
bind/118/bone = -1
bind/118/pose = Transform( -0.999997, 0.000412864, 0.00221755, 0.00225555, 0.173138, 0.984895, 2.26852e-05, 0.984897, -0.173138, -0.0527136, -0.351196, -1.83566 )
bind/119/name = "right_eyebrow_up_adjust"
bind/119/bone = -1
bind/119/pose = Transform( -0.999997, 0.000413169, 0.0022175, 0.00225555, 0.173138, 0.984895, 2.2994e-05, 0.984897, -0.173138, -0.0527142, -0.351196, -1.83566 )
bind/120/name = "left_ear"
bind/120/bone = -1
bind/120/pose = Transform( 0.96106, -0.0084261, 0.276212, 0.26164, 0.349411, -0.899698, -0.0889305, 0.936931, 0.33801, -0.0628492, -0.650023, -1.7092 )
bind/121/name = "left_ear_adjust"
bind/121/bone = -1
bind/121/pose = Transform( 0.96106, -0.00842586, 0.276212, 0.26164, 0.349411, -0.899698, -0.0889308, 0.936932, 0.33801, -0.0628497, -0.650023, -1.7092 )
bind/122/name = "right_ear"
bind/122/bone = -1
bind/122/pose = Transform( 0.96106, 0.00842602, -0.276211, -0.261639, 0.349411, -0.899698, 0.0889305, 0.936932, 0.33801, 0.0628495, -0.650023, -1.7092 )
bind/123/name = "right_ear_adjust"
bind/123/bone = -1
bind/123/pose = Transform( 0.96106, 0.00842547, -0.276211, -0.261639, 0.349411, -0.899698, 0.088931, 0.936932, 0.33801, 0.0628505, -0.650023, -1.7092 )
bind/124/name = "left_eye"
bind/124/bone = -1
bind/124/pose = Transform( -1, -1.02585e-05, 1.83709e-06, 1.83702e-06, 7.36585e-06, 1, -1.02585e-05, 1, -7.36581e-06, 0.0349601, -0.0752557, -1.86303 )
bind/125/name = "left_eye_globe"
bind/125/bone = -1
bind/125/pose = Transform( -1, -1.89614e-05, 1.83715e-06, 1.83702e-06, 7.36584e-06, 1, -1.89614e-05, 1, -7.36578e-06, 0.0349762, -0.0752556, -1.86303 )
bind/126/name = "left_eye_adjust"
bind/126/bone = -1
bind/126/pose = Transform( -1, -1.45321e-05, 1.83718e-06, 1.83708e-06, 7.36584e-06, 1, -1.45321e-05, 1, -7.3658e-06, 0.0349679, -0.0752555, -1.86303 )
bind/127/name = "left_upper_lid"
bind/127/bone = -1
bind/127/pose = Transform( -1, 0.000691709, -0.000110502, 1.60862e-05, 0.180387, 0.983596, 0.000700295, 0.983595, -0.180387, 0.0336606, -0.410075, -1.81892 )
bind/128/name = "left_upper_lid_adjust"
bind/128/bone = -1
bind/128/pose = Transform( -0.999999, 0.0013918, -0.000165793, 8.89923e-05, 0.181093, 0.983466, 0.0013988, 0.983465, -0.181093, 0.0323604, -0.411383, -1.81865 )
bind/129/name = "left_lower_lid"
bind/129/bone = -1
bind/129/pose = Transform( -1, -0.000548437, -0.000118918, 8.2731e-05, -0.353666, 0.935372, -0.00055505, 0.935372, 0.353666, 0.0359717, 0.588509, -1.76922 )
bind/130/name = "left_lower_lid_adjust"
bind/130/bone = -1
bind/130/pose = Transform( -0.999999, -0.00109548, -0.000246984, 0.000157449, -0.354539, 0.935042, -0.00111188, 0.935041, 0.354539, 0.0370004, 0.590158, -1.76865 )
bind/131/name = "right_eye"
bind/131/bone = -1
bind/131/pose = Transform( -1, 1.02709e-05, -8.64524e-07, -8.64447e-07, 7.58936e-06, 1, 1.02709e-05, 1, -7.58934e-06, -0.0349601, -0.075256, -1.86303 )
bind/132/name = "right_eye_globe"
bind/132/bone = -1
bind/132/pose = Transform( -1, 1.90106e-05, -8.6459e-07, -8.64447e-07, 7.58935e-06, 1, 1.90106e-05, 1, -7.58933e-06, -0.0349763, -0.0752559, -1.86303 )
bind/133/name = "right_eye_adjust"
bind/133/bone = -1
bind/133/pose = Transform( -1, 1.45321e-05, -8.64618e-07, -8.64508e-07, 7.58935e-06, 1, 1.45321e-05, 1, -7.58933e-06, -0.034968, -0.0752559, -1.86303 )
bind/134/name = "right_upper_lid"
bind/134/bone = -1
bind/134/pose = Transform( -1, -0.000691411, 0.000113577, -1.30069e-05, 0.180386, 0.983596, -0.000700557, 0.983596, -0.180386, -0.0336614, -0.410074, -1.81892 )
bind/135/name = "right_upper_lid_adjust"
bind/135/bone = -1
bind/135/pose = Transform( -0.999999, -0.00139197, 0.000168769, -8.60983e-05, 0.181093, 0.983466, -0.00139952, 0.983465, -0.181093, -0.0323603, -0.411383, -1.81865 )
bind/136/name = "right_lower_lid"
bind/136/bone = -1
bind/136/pose = Transform( -1, 0.000547822, 0.000120586, -8.09525e-05, -0.353665, 0.935372, 0.000555064, 0.935372, 0.353665, -0.0359707, 0.588508, -1.76922 )
bind/137/name = "right_lower_lid_adjust"
bind/137/bone = -1
bind/137/pose = Transform( -0.999999, 0.00109489, 0.00024865, -0.000155667, -0.354526, 0.935046, 0.00111192, 0.935045, 0.354526, -0.0369995, 0.590133, -1.76866 )
bind/138/name = "left_nose"
bind/138/bone = -1
bind/138/pose = Transform( -0.999958, 0.00799045, -0.00448609, -0.00456708, -0.0101465, 0.999938, 0.00794444, 0.999917, 0.0101826, 0.012095, -0.0412429, -1.81497 )
bind/139/name = "left_nose_adjust"
bind/139/bone = -1
bind/139/pose = Transform( -0.999958, 0.00799063, -0.00448608, -0.00456708, -0.0101465, 0.999938, 0.00794462, 0.999917, 0.0101826, 0.0120947, -0.0412428, -1.81497 )
bind/140/name = "right_nose"
bind/140/bone = -1
bind/140/pose = Transform( -0.999958, -0.00799071, 0.00448606, 0.00456705, -0.0101466, 0.999938, -0.0079447, 0.999917, 0.0101826, -0.0120945, -0.0412428, -1.81497 )
bind/141/name = "right_nose_adjust"
bind/141/bone = -1
bind/141/pose = Transform( -0.999958, -0.00799045, 0.00448606, 0.00456705, -0.0101466, 0.999938, -0.00794444, 0.999917, 0.0101826, -0.012095, -0.0412429, -1.81497 )
bind/142/name = "left_up_leg"
bind/142/bone = -1
bind/142/pose = Transform( -0.982549, -0.114902, 0.146273, 0.11672, -0.993157, 0.00388103, 0.144826, 0.0208863, 0.989237, 0.227313, 0.997692, -0.0196003 )
bind/143/name = "left_leg"
bind/143/bone = -1
bind/143/pose = Transform( -0.959941, -0.159197, 0.230587, 0.143454, -0.986119, -0.0836104, 0.240696, -0.0471824, 0.969453, 0.251109, 0.555909, 0.00477933 )
bind/144/name = "left_foot"
bind/144/bone = -1
bind/144/pose = Transform( 0.921948, 0.116266, -0.36945, 0.374675, -0.5094, 0.774681, -0.0981285, -0.85264, -0.513202, -0.245064, 0.0184409, 0.0954674 )
bind/145/name = "left_toe_base"
bind/145/bone = -1
bind/145/pose = Transform( 0.92968, -0.0170783, -0.367972, 0.3634, -0.120986, 0.923744, -0.0602956, -0.992507, -0.106273, -0.244074, -0.184941, 0.0525591 )
bind/146/name = "left_leg_adjust"
bind/146/bone = -1
bind/146/pose = Transform( -0.959941, -0.159197, 0.230587, 0.143454, -0.986119, -0.0836104, 0.240696, -0.0471824, 0.969453, 0.251109, 0.436982, 0.0047793 )
bind/147/name = "left_up_leg_adjust"
bind/147/bone = -1
bind/147/pose = Transform( -0.970708, -0.113254, 0.211893, 0.11672, -0.993157, 0.00388103, 0.210003, 0.0284995, 0.977285, 0.225501, 0.889703, -0.0347099 )
bind/148/name = "left_gluteus"
bind/148/bone = -1
bind/148/pose = Transform( -1, -4.53839e-07, -3.65731e-07, 2.38238e-07, 0.565907, -0.824469, 8.6416e-07, -0.824469, -0.565907, 0.109735, -0.59037, 0.828775 )
bind/149/name = "right_up_leg"
bind/149/bone = -1
bind/149/pose = Transform( -0.982549, 0.114902, -0.146272, -0.11672, -0.993157, 0.00388099, -0.144826, 0.0208862, 0.989237, -0.227313, 0.997692, -0.0196002 )
bind/150/name = "right_leg"
bind/150/bone = -1
bind/150/pose = Transform( -0.959941, 0.159196, -0.230587, -0.143454, -0.986119, -0.08361, -0.240697, -0.047182, 0.969453, -0.251109, 0.555909, 0.00477914 )
bind/151/name = "right_foot"
bind/151/bone = -1
bind/151/pose = Transform( 0.921948, -0.116266, 0.36945, -0.374676, -0.509399, 0.774681, 0.0981288, -0.85264, -0.513202, 0.245063, 0.0184405, 0.0954674 )
bind/152/name = "right_toe_base"
bind/152/bone = -1
bind/152/pose = Transform( 0.92968, 0.0170778, 0.367973, -0.363401, -0.120987, 0.923744, 0.0602954, -0.992507, -0.106273, 0.244073, -0.184941, 0.0525589 )
bind/153/name = "right_leg_adjust"
bind/153/bone = -1
bind/153/pose = Transform( -0.959941, 0.159196, -0.230587, -0.143454, -0.986119, -0.08361, -0.240697, -0.047182, 0.969453, -0.251109, 0.436981, 0.00477913 )
bind/154/name = "right_up_leg_adjust"
bind/154/bone = -1
bind/154/pose = Transform( -0.970709, 0.113254, -0.211893, -0.11672, -0.993157, 0.00388099, -0.210003, 0.0284994, 0.977285, -0.225501, 0.889703, -0.0347097 )
bind/155/name = "right_gluteus"
bind/155/bone = -1
bind/155/pose = Transform( -1, 3.26767e-07, 2.87547e-07, 5.90741e-08, 0.565907, -0.824469, -3.75711e-07, -0.824469, -0.565907, -0.109735, -0.59037, 0.828774 )

[node name="Hair06" type="MeshInstance"]
mesh = SubResource( 1 )
skin = SubResource( 2 )
material/0 = null
