; Engine configuration file.
; It's best edited using the editor UI and not directly,
; since the parameters that go here are not all obvious.
;
; Format:
;   [section] ; section goes between []
;   param=value ; assign values to parameters

config_version=4

_global_script_classes=[ {
"base": "Reference",
"class": "DirWalker",
"language": "GDScript",
"path": "res://addons/finder/utils/dir_walker.gd"
}, {
"base": "Control",
"class": "FileItem",
"language": "GDScript",
"path": "res://addons/finder/ui/file_item_list/file_item.gd"
}, {
"base": "Control",
"class": "Finder",
"language": "GDScript",
"path": "res://addons/finder/finder.gd"
}, {
"base": "Reference",
"class": "FuzzyFile",
"language": "GDScript",
"path": "res://addons/finder/utils/fuzzy_file.gd"
}, {
"base": "Reference",
"class": "FuzzyMatching",
"language": "GDScript",
"path": "res://addons/finder/utils/fuzzy_matching.gd"
}, {
"base": "Reference",
"class": "GDscriptParser",
"language": "GDScript",
"path": "res://addons/finder/utils/gdscript_parser/gdscript_parser.gd"
}, {
"base": "Reference",
"class": "RelevanceSorter",
"language": "GDScript",
"path": "res://addons/finder/utils/relevance_sorter.gd"
}, {
"base": "Control",
"class": "WaitDialog",
"language": "GDScript",
"path": "res://addons/finder/ui/wait_dialog/wait_dialog.gd"
} ]
_global_script_class_icons={
"DirWalker": "",
"FileItem": "",
"Finder": "",
"FuzzyFile": "",
"FuzzyMatching": "",
"GDscriptParser": "",
"RelevanceSorter": "",
"WaitDialog": ""
}

[application]

config/name="godot-finder"
config/icon="res://icon.png"

[editor_plugins]

enabled=PoolStringArray( "res://addons/finder/plugin.cfg" )

[gui]

common/drop_mouse_on_gui_input_disabled=true

[physics]

common/enable_pause_aware_picking=true

[rendering]

environment/default_environment="res://default_env.tres"
