%YAML 1.1
%TAG !u! tag:unity3d.com,2011:
--- !u!114 &11400000
MonoBehaviour:
  m_ObjectHideFlags: 0
  m_CorrespondingSourceObject: {fileID: 0}
  m_PrefabInstance: {fileID: 0}
  m_PrefabAsset: {fileID: 0}
  m_GameObject: {fileID: 0}
  m_Enabled: 1
  m_EditorHideFlags: 0
  m_Script: {fileID: 11500000, guid: 16e9cbdc2c2c4b21a5fe010b7a78b5b8, type: 3}
  m_Name: LocVar_PlayerCharacterName
  m_EditorClassIdentifier: 
  m_GUID: 
  m_LocalizationDirectionNotes: 
  Key: '%PlayerCharacterName%'
  Type: 0
