%YAML 1.1
%TAG !u! tag:unity3d.com,2011:
--- !u!114 &11400000
MonoBehaviour:
  m_ObjectHideFlags: 0
  m_CorrespondingSourceObject: {fileID: 0}
  m_PrefabInstance: {fileID: 0}
  m_PrefabAsset: {fileID: 0}
  m_GameObject: {fileID: 0}
  m_Enabled: 1
  m_EditorHideFlags: 0
  m_Script: {fileID: 11500000, guid: bdfae823be6ba6943bed0b3392d1c5cc, type: 3}
  m_Name: ExitButton
  m_EditorClassIdentifier: 
  m_GUID: 631c00e1-ca34-4142-8737-9bc9bb56fed3
  m_LocalizationDirectionNotes: Main menu button label
  m_VariablesUsed: []
  m_Texts:
  - Exit
  - Exit
  - Vychod
  - "Wyj\u015Bcie"
