{
    "cli": {
      "version": ">= 0.34.0"
    },
    "submit": {
      "production": {
        
        "ios": {
          "appleId": "panchamsheoran@gmail.com",
          "ascAppId": "1599840628",
          "appleTeamId": "T3AAR3J7RZ",
          "bundleIdentifier":"KodiBlaze"
        }
      }
    }
    
  }