{
  "id": 58709,
  "star": 1,
  "name": "踏莎行",
  "dynasty": "宋代",
  "content": "钗凤摇金，髻螺分翠。铢衣稳束宫腰细。绿柔红小不禁风，海棠无力贪春睡。 <br> 剪水精神，怯春情意。霓裳一曲当时事。五陵年少本多情，为何特地添憔悴。",
  "poet": {
    "id": 574,
    "star": 0,
    "name": "石孝友",
    "desc": "石孝友，南宋词人，字次仲，江西南昌人。生卒年不详。宋孝宗乾道二年（1166）进士。填词常用俚俗之语，状写男女情爱。仕途不顺，不羡富贵，隐居于丘壑之间。 石孝友著有《金谷遗音》，《直斋书录解题》著录一卷，明《唐宋名贤百家词》本作《金谷词》，不分卷。有明汲古阁《宋六十名家词》本、《四部备要》排印本。《全宋词》据毛□校汲古阁本收录。► 151篇诗文"
  },
  "tags": []
}