<?xml version="1.0" encoding="UTF-8"?>
<!-- Do not edit this file with editors other than draw.io -->
<!DOCTYPE svg PUBLIC "-//W3C//DTD SVG 1.1//EN" "http://www.w3.org/Graphics/SVG/1.1/DTD/svg11.dtd">
<svg xmlns="http://www.w3.org/2000/svg" xmlns:xlink="http://www.w3.org/1999/xlink" version="1.1" width="1532px" height="1391px" viewBox="-0.5 -0.5 1532 1391" content="&lt;mxfile host=&quot;Electron&quot; modified=&quot;2024-03-22T10:55:11.520Z&quot; agent=&quot;Mozilla/5.0 (X11; Linux x86_64) AppleWebKit/537.36 (KHTML, like Gecko) draw.io/23.1.5 Chrome/120.0.6099.109 Electron/28.1.0 Safari/537.36&quot; etag=&quot;ed54qpyiD8roVryQGe_4&quot; version=&quot;23.1.5&quot; type=&quot;device&quot;&gt;&#10;  &lt;diagram name=&quot;Page-1&quot; id=&quot;ucKyutU3gNlg2Bc_Kiah&quot;&gt;&#10;    &lt;mxGraphModel dx=&quot;2271&quot; dy=&quot;1967&quot; grid=&quot;1&quot; gridSize=&quot;10&quot; guides=&quot;1&quot; tooltips=&quot;1&quot; connect=&quot;1&quot; arrows=&quot;1&quot; fold=&quot;1&quot; page=&quot;1&quot; pageScale=&quot;1&quot; pageWidth=&quot;850&quot; pageHeight=&quot;1100&quot; math=&quot;0&quot; shadow=&quot;0&quot;&gt;&#10;      &lt;root&gt;&#10;        &lt;mxCell id=&quot;0&quot; /&gt;&#10;        &lt;mxCell id=&quot;1&quot; parent=&quot;0&quot; /&gt;&#10;        &lt;mxCell id=&quot;dXZAkCa6KsGppO-HxsZK-83&quot; value=&quot;LAN&amp;amp;nbsp;192.168.0.0/16&quot; style=&quot;rounded=0;whiteSpace=wrap;html=1;fillColor=#d5e8d4;strokeColor=#82b366;align=left;verticalAlign=top;fontSize=20;&quot; vertex=&quot;1&quot; parent=&quot;1&quot;&gt;&#10;          &lt;mxGeometry x=&quot;-50&quot; y=&quot;-110&quot; width=&quot;1260&quot; height=&quot;1390&quot; as=&quot;geometry&quot; /&gt;&#10;        &lt;/mxCell&gt;&#10;        &lt;mxCell id=&quot;dXZAkCa6KsGppO-HxsZK-1&quot; value=&quot;Administratif&quot; style=&quot;swimlane;whiteSpace=wrap;html=1;&quot; vertex=&quot;1&quot; parent=&quot;1&quot;&gt;&#10;          &lt;mxGeometry x=&quot;420&quot; y=&quot;790&quot; width=&quot;740&quot; height=&quot;230&quot; as=&quot;geometry&quot;&gt;&#10;            &lt;mxRectangle x=&quot;80&quot; y=&quot;50&quot; width=&quot;110&quot; height=&quot;30&quot; as=&quot;alternateBounds&quot; /&gt;&#10;          &lt;/mxGeometry&gt;&#10;        &lt;/mxCell&gt;&#10;        &lt;mxCell id=&quot;dXZAkCa6KsGppO-HxsZK-2&quot; value=&quot;Comerciales&quot; style=&quot;swimlane;whiteSpace=wrap;html=1;&quot; vertex=&quot;1&quot; parent=&quot;dXZAkCa6KsGppO-HxsZK-1&quot;&gt;&#10;          &lt;mxGeometry x=&quot;45&quot; y=&quot;45&quot; width=&quot;150&quot; height=&quot;150&quot; as=&quot;geometry&quot; /&gt;&#10;        &lt;/mxCell&gt;&#10;        &lt;mxCell id=&quot;dXZAkCa6KsGppO-HxsZK-7&quot; value=&quot;20&quot; style=&quot;image;points=[];aspect=fixed;html=1;align=center;shadow=0;dashed=0;image=img/lib/allied_telesis/computer_and_terminals/Laptop.svg;labelBackgroundColor=none;&quot; vertex=&quot;1&quot; parent=&quot;dXZAkCa6KsGppO-HxsZK-2&quot;&gt;&#10;          &lt;mxGeometry x=&quot;54&quot; y=&quot;53.7&quot; width=&quot;42&quot; height=&quot;42.599999999999994&quot; as=&quot;geometry&quot; /&gt;&#10;        &lt;/mxCell&gt;&#10;        &lt;mxCell id=&quot;dXZAkCa6KsGppO-HxsZK-3&quot; value=&quot;Marketing&quot; style=&quot;swimlane;whiteSpace=wrap;html=1;&quot; vertex=&quot;1&quot; parent=&quot;dXZAkCa6KsGppO-HxsZK-1&quot;&gt;&#10;          &lt;mxGeometry x=&quot;225&quot; y=&quot;45&quot; width=&quot;160&quot; height=&quot;150&quot; as=&quot;geometry&quot; /&gt;&#10;        &lt;/mxCell&gt;&#10;        &lt;mxCell id=&quot;dXZAkCa6KsGppO-HxsZK-5&quot; value=&quot;3&quot; style=&quot;image;points=[];aspect=fixed;html=1;align=center;shadow=0;dashed=0;image=img/lib/allied_telesis/computer_and_terminals/Personal_Computer.svg;labelBackgroundColor=none;&quot; vertex=&quot;1&quot; parent=&quot;dXZAkCa6KsGppO-HxsZK-3&quot;&gt;&#10;          &lt;mxGeometry x=&quot;57.2&quot; y=&quot;44.1&quot; width=&quot;45.6&quot; height=&quot;61.800000000000004&quot; as=&quot;geometry&quot; /&gt;&#10;        &lt;/mxCell&gt;&#10;        &lt;mxCell id=&quot;dXZAkCa6KsGppO-HxsZK-8&quot; value=&quot;Achat&quot; style=&quot;swimlane;whiteSpace=wrap;html=1;&quot; vertex=&quot;1&quot; parent=&quot;dXZAkCa6KsGppO-HxsZK-1&quot;&gt;&#10;          &lt;mxGeometry x=&quot;415&quot; y=&quot;45&quot; width=&quot;160&quot; height=&quot;150&quot; as=&quot;geometry&quot; /&gt;&#10;        &lt;/mxCell&gt;&#10;        &lt;mxCell id=&quot;dXZAkCa6KsGppO-HxsZK-9&quot; value=&quot;2&quot; style=&quot;image;points=[];aspect=fixed;html=1;align=center;shadow=0;dashed=0;image=img/lib/allied_telesis/computer_and_terminals/Personal_Computer.svg;labelBackgroundColor=none;&quot; vertex=&quot;1&quot; parent=&quot;dXZAkCa6KsGppO-HxsZK-8&quot;&gt;&#10;          &lt;mxGeometry x=&quot;57.2&quot; y=&quot;44.1&quot; width=&quot;45.6&quot; height=&quot;61.800000000000004&quot; as=&quot;geometry&quot; /&gt;&#10;        &lt;/mxCell&gt;&#10;        &lt;mxCell id=&quot;dXZAkCa6KsGppO-HxsZK-16&quot; value=&quot;2&quot; style=&quot;verticalLabelPosition=bottom;sketch=0;aspect=fixed;html=1;verticalAlign=top;strokeColor=none;align=center;outlineConnect=0;shape=mxgraph.citrix.printer;&quot; vertex=&quot;1&quot; parent=&quot;dXZAkCa6KsGppO-HxsZK-1&quot;&gt;&#10;          &lt;mxGeometry x=&quot;620&quot; y=&quot;80&quot; width=&quot;70&quot; height=&quot;70&quot; as=&quot;geometry&quot; /&gt;&#10;        &lt;/mxCell&gt;&#10;        &lt;mxCell id=&quot;dXZAkCa6KsGppO-HxsZK-13&quot; value=&quot;Direction&quot; style=&quot;swimlane;whiteSpace=wrap;html=1;&quot; vertex=&quot;1&quot; parent=&quot;1&quot;&gt;&#10;          &lt;mxGeometry x=&quot;420&quot; y=&quot;140&quot; width=&quot;150&quot; height=&quot;150&quot; as=&quot;geometry&quot; /&gt;&#10;        &lt;/mxCell&gt;&#10;        &lt;mxCell id=&quot;dXZAkCa6KsGppO-HxsZK-14&quot; value=&quot;1&amp;lt;br&amp;gt;Mr. Méca&quot; style=&quot;image;points=[];aspect=fixed;html=1;align=center;shadow=0;dashed=0;image=img/lib/allied_telesis/computer_and_terminals/Laptop.svg;labelBackgroundColor=none;&quot; vertex=&quot;1&quot; parent=&quot;dXZAkCa6KsGppO-HxsZK-13&quot;&gt;&#10;          &lt;mxGeometry x=&quot;54&quot; y=&quot;53.7&quot; width=&quot;42&quot; height=&quot;42.599999999999994&quot; as=&quot;geometry&quot; /&gt;&#10;        &lt;/mxCell&gt;&#10;        &lt;mxCell id=&quot;dXZAkCa6KsGppO-HxsZK-17&quot; value=&quot;R&amp;amp;amp;D&quot; style=&quot;swimlane;whiteSpace=wrap;html=1;&quot; vertex=&quot;1&quot; parent=&quot;1&quot;&gt;&#10;          &lt;mxGeometry x=&quot;420&quot; y=&quot;311&quot; width=&quot;265&quot; height=&quot;200&quot; as=&quot;geometry&quot; /&gt;&#10;        &lt;/mxCell&gt;&#10;        &lt;mxCell id=&quot;dXZAkCa6KsGppO-HxsZK-18&quot; value=&quot;1&quot; style=&quot;verticalLabelPosition=bottom;sketch=0;aspect=fixed;html=1;verticalAlign=top;strokeColor=none;align=center;outlineConnect=0;shape=mxgraph.citrix.printer;&quot; vertex=&quot;1&quot; parent=&quot;dXZAkCa6KsGppO-HxsZK-17&quot;&gt;&#10;          &lt;mxGeometry x=&quot;160&quot; y=&quot;65&quot; width=&quot;70&quot; height=&quot;70&quot; as=&quot;geometry&quot; /&gt;&#10;        &lt;/mxCell&gt;&#10;        &lt;mxCell id=&quot;dXZAkCa6KsGppO-HxsZK-19&quot; value=&quot;12&quot; style=&quot;image;points=[];aspect=fixed;html=1;align=center;shadow=0;dashed=0;image=img/lib/allied_telesis/computer_and_terminals/Personal_Computer.svg;labelBackgroundColor=none;&quot; vertex=&quot;1&quot; parent=&quot;dXZAkCa6KsGppO-HxsZK-17&quot;&gt;&#10;          &lt;mxGeometry x=&quot;50&quot; y=&quot;69.1&quot; width=&quot;45.6&quot; height=&quot;61.800000000000004&quot; as=&quot;geometry&quot; /&gt;&#10;        &lt;/mxCell&gt;&#10;        &lt;mxCell id=&quot;dXZAkCa6KsGppO-HxsZK-20&quot; value=&quot;Production&quot; style=&quot;swimlane;whiteSpace=wrap;html=1;&quot; vertex=&quot;1&quot; parent=&quot;1&quot;&gt;&#10;          &lt;mxGeometry x=&quot;420&quot; y=&quot;530&quot; width=&quot;750&quot; height=&quot;230&quot; as=&quot;geometry&quot; /&gt;&#10;        &lt;/mxCell&gt;&#10;        &lt;mxCell id=&quot;dXZAkCa6KsGppO-HxsZK-22&quot; value=&quot;Pilotage Machine&quot; style=&quot;swimlane;whiteSpace=wrap;html=1;startSize=23;&quot; vertex=&quot;1&quot; parent=&quot;dXZAkCa6KsGppO-HxsZK-20&quot;&gt;&#10;          &lt;mxGeometry x=&quot;30&quot; y=&quot;50&quot; width=&quot;150&quot; height=&quot;150&quot; as=&quot;geometry&quot; /&gt;&#10;        &lt;/mxCell&gt;&#10;        &lt;mxCell id=&quot;dXZAkCa6KsGppO-HxsZK-24&quot; value=&quot;12&quot; style=&quot;image;points=[];aspect=fixed;html=1;align=center;shadow=0;dashed=0;image=img/lib/allied_telesis/computer_and_terminals/Personal_Computer.svg;labelBackgroundColor=none;&quot; vertex=&quot;1&quot; parent=&quot;dXZAkCa6KsGppO-HxsZK-22&quot;&gt;&#10;          &lt;mxGeometry x=&quot;52.19999999999999&quot; y=&quot;44.10000000000002&quot; width=&quot;45.6&quot; height=&quot;61.800000000000004&quot; as=&quot;geometry&quot; /&gt;&#10;        &lt;/mxCell&gt;&#10;        &lt;mxCell id=&quot;dXZAkCa6KsGppO-HxsZK-25&quot; value=&quot;Ingénieurie&quot; style=&quot;swimlane;whiteSpace=wrap;html=1;&quot; vertex=&quot;1&quot; parent=&quot;dXZAkCa6KsGppO-HxsZK-20&quot;&gt;&#10;          &lt;mxGeometry x=&quot;215&quot; y=&quot;50&quot; width=&quot;160&quot; height=&quot;150&quot; as=&quot;geometry&quot; /&gt;&#10;        &lt;/mxCell&gt;&#10;        &lt;mxCell id=&quot;dXZAkCa6KsGppO-HxsZK-26&quot; value=&quot;18&quot; style=&quot;image;points=[];aspect=fixed;html=1;align=center;shadow=0;dashed=0;image=img/lib/allied_telesis/computer_and_terminals/Personal_Computer.svg;labelBackgroundColor=none;&quot; vertex=&quot;1&quot; parent=&quot;dXZAkCa6KsGppO-HxsZK-25&quot;&gt;&#10;          &lt;mxGeometry x=&quot;57.2&quot; y=&quot;44.1&quot; width=&quot;45.6&quot; height=&quot;61.800000000000004&quot; as=&quot;geometry&quot; /&gt;&#10;        &lt;/mxCell&gt;&#10;        &lt;mxCell id=&quot;dXZAkCa6KsGppO-HxsZK-27&quot; value=&quot;Tech&quot; style=&quot;swimlane;whiteSpace=wrap;html=1;&quot; vertex=&quot;1&quot; parent=&quot;dXZAkCa6KsGppO-HxsZK-20&quot;&gt;&#10;          &lt;mxGeometry x=&quot;410&quot; y=&quot;50&quot; width=&quot;160&quot; height=&quot;150&quot; as=&quot;geometry&quot; /&gt;&#10;        &lt;/mxCell&gt;&#10;        &lt;mxCell id=&quot;dXZAkCa6KsGppO-HxsZK-28&quot; value=&quot;2&quot; style=&quot;image;points=[];aspect=fixed;html=1;align=center;shadow=0;dashed=0;image=img/lib/allied_telesis/computer_and_terminals/Personal_Computer.svg;labelBackgroundColor=none;&quot; vertex=&quot;1&quot; parent=&quot;dXZAkCa6KsGppO-HxsZK-27&quot;&gt;&#10;          &lt;mxGeometry x=&quot;57.2&quot; y=&quot;44.1&quot; width=&quot;45.6&quot; height=&quot;61.800000000000004&quot; as=&quot;geometry&quot; /&gt;&#10;        &lt;/mxCell&gt;&#10;        &lt;mxCell id=&quot;dXZAkCa6KsGppO-HxsZK-31&quot; value=&quot;1&quot; style=&quot;verticalLabelPosition=bottom;sketch=0;aspect=fixed;html=1;verticalAlign=top;strokeColor=none;align=center;outlineConnect=0;shape=mxgraph.citrix.printer;&quot; vertex=&quot;1&quot; parent=&quot;dXZAkCa6KsGppO-HxsZK-20&quot;&gt;&#10;          &lt;mxGeometry x=&quot;630&quot; y=&quot;80&quot; width=&quot;70&quot; height=&quot;70&quot; as=&quot;geometry&quot; /&gt;&#10;        &lt;/mxCell&gt;&#10;        &lt;mxCell id=&quot;dXZAkCa6KsGppO-HxsZK-32&quot; value=&quot;DSI&quot; style=&quot;swimlane;whiteSpace=wrap;html=1;&quot; vertex=&quot;1&quot; parent=&quot;1&quot;&gt;&#10;          &lt;mxGeometry x=&quot;420&quot; y=&quot;-80&quot; width=&quot;270&quot; height=&quot;200&quot; as=&quot;geometry&quot; /&gt;&#10;        &lt;/mxCell&gt;&#10;        &lt;mxCell id=&quot;dXZAkCa6KsGppO-HxsZK-37&quot; value=&quot;1&quot; style=&quot;image;points=[];aspect=fixed;html=1;align=center;shadow=0;dashed=0;image=img/lib/allied_telesis/computer_and_terminals/Personal_Computer.svg;labelBackgroundColor=none;&quot; vertex=&quot;1&quot; parent=&quot;dXZAkCa6KsGppO-HxsZK-32&quot;&gt;&#10;          &lt;mxGeometry x=&quot;60.00000000000004&quot; y=&quot;69.1&quot; width=&quot;45.6&quot; height=&quot;61.800000000000004&quot; as=&quot;geometry&quot; /&gt;&#10;        &lt;/mxCell&gt;&#10;        &lt;mxCell id=&quot;dXZAkCa6KsGppO-HxsZK-38&quot; value=&quot;2&amp;lt;br&amp;gt;Backup ERP/CRM&amp;lt;br&amp;gt;Compta&quot; style=&quot;shadow=0;dashed=0;html=1;labelPosition=center;verticalLabelPosition=bottom;verticalAlign=top;align=center;outlineConnect=0;shape=mxgraph.veeam.3d.hard_drive;fillColor=#637D8A;gradientColor=#324752;strokeColor=none;&quot; vertex=&quot;1&quot; parent=&quot;dXZAkCa6KsGppO-HxsZK-32&quot;&gt;&#10;          &lt;mxGeometry x=&quot;160&quot; y=&quot;86&quot; width=&quot;62&quot; height=&quot;28&quot; as=&quot;geometry&quot; /&gt;&#10;        &lt;/mxCell&gt;&#10;        &lt;mxCell id=&quot;dXZAkCa6KsGppO-HxsZK-33&quot; value=&quot;Serveurs&quot; style=&quot;swimlane;whiteSpace=wrap;html=1;&quot; vertex=&quot;1&quot; parent=&quot;1&quot;&gt;&#10;          &lt;mxGeometry x=&quot;420&quot; y=&quot;1050&quot; width=&quot;370&quot; height=&quot;200&quot; as=&quot;geometry&quot; /&gt;&#10;        &lt;/mxCell&gt;&#10;        &lt;mxCell id=&quot;dXZAkCa6KsGppO-HxsZK-34&quot; value=&quot;AD + IIS&quot; style=&quot;image;points=[];aspect=fixed;html=1;align=center;shadow=0;dashed=0;image=img/lib/allied_telesis/computer_and_terminals/Server_Desktop.svg;labelBackgroundColor=none;&quot; vertex=&quot;1&quot; parent=&quot;dXZAkCa6KsGppO-HxsZK-33&quot;&gt;&#10;          &lt;mxGeometry x=&quot;110&quot; y=&quot;73&quot; width=&quot;42.599999999999994&quot; height=&quot;54&quot; as=&quot;geometry&quot; /&gt;&#10;        &lt;/mxCell&gt;&#10;        &lt;mxCell id=&quot;dXZAkCa6KsGppO-HxsZK-35&quot; value=&quot;1&amp;lt;br&amp;gt;Serveur de Fichier&amp;lt;br&amp;gt;R&amp;amp;amp;D&quot; style=&quot;image;points=[];aspect=fixed;html=1;align=center;shadow=0;dashed=0;image=img/lib/allied_telesis/computer_and_terminals/Server_Desktop.svg;labelBackgroundColor=none;&quot; vertex=&quot;1&quot; parent=&quot;dXZAkCa6KsGppO-HxsZK-33&quot;&gt;&#10;          &lt;mxGeometry x=&quot;220&quot; y=&quot;73&quot; width=&quot;42.599999999999994&quot; height=&quot;54&quot; as=&quot;geometry&quot; /&gt;&#10;        &lt;/mxCell&gt;&#10;        &lt;mxCell id=&quot;dXZAkCa6KsGppO-HxsZK-36&quot; value=&quot;1&amp;lt;br&amp;gt;ERP/CRM&amp;lt;br&amp;gt;Compta&quot; style=&quot;image;points=[];aspect=fixed;html=1;align=center;shadow=0;dashed=0;image=img/lib/allied_telesis/computer_and_terminals/Server_Desktop.svg;labelBackgroundColor=none;&quot; vertex=&quot;1&quot; parent=&quot;dXZAkCa6KsGppO-HxsZK-33&quot;&gt;&#10;          &lt;mxGeometry x=&quot;300&quot; y=&quot;73&quot; width=&quot;42.599999999999994&quot; height=&quot;54&quot; as=&quot;geometry&quot; /&gt;&#10;        &lt;/mxCell&gt;&#10;        &lt;mxCell id=&quot;dXZAkCa6KsGppO-HxsZK-97&quot; value=&quot;AD Primary&quot; style=&quot;image;points=[];aspect=fixed;html=1;align=center;shadow=0;dashed=0;image=img/lib/allied_telesis/computer_and_terminals/Server_Desktop.svg;labelBackgroundColor=none;&quot; vertex=&quot;1&quot; parent=&quot;dXZAkCa6KsGppO-HxsZK-33&quot;&gt;&#10;          &lt;mxGeometry x=&quot;30&quot; y=&quot;73&quot; width=&quot;42.599999999999994&quot; height=&quot;54&quot; as=&quot;geometry&quot; /&gt;&#10;        &lt;/mxCell&gt;&#10;        &lt;mxCell id=&quot;dXZAkCa6KsGppO-HxsZK-50&quot; style=&quot;edgeStyle=orthogonalEdgeStyle;rounded=0;orthogonalLoop=1;jettySize=auto;html=1;endArrow=none;endFill=0;&quot; edge=&quot;1&quot; parent=&quot;1&quot; source=&quot;dXZAkCa6KsGppO-HxsZK-39&quot; target=&quot;dXZAkCa6KsGppO-HxsZK-49&quot;&gt;&#10;          &lt;mxGeometry relative=&quot;1&quot; as=&quot;geometry&quot; /&gt;&#10;        &lt;/mxCell&gt;&#10;        &lt;mxCell id=&quot;dXZAkCa6KsGppO-HxsZK-39&quot; value=&quot;&quot; style=&quot;outlineConnect=0;dashed=0;verticalLabelPosition=bottom;verticalAlign=top;align=center;html=1;shape=mxgraph.aws3.internet_gateway;fillColor=#F58534;gradientColor=none;&quot; vertex=&quot;1&quot; parent=&quot;1&quot;&gt;&#10;          &lt;mxGeometry x=&quot;-320&quot; y=&quot;609&quot; width=&quot;69&quot; height=&quot;72&quot; as=&quot;geometry&quot; /&gt;&#10;        &lt;/mxCell&gt;&#10;        &lt;mxCell id=&quot;dXZAkCa6KsGppO-HxsZK-52&quot; style=&quot;edgeStyle=orthogonalEdgeStyle;rounded=0;orthogonalLoop=1;jettySize=auto;html=1;endArrow=none;endFill=0;&quot; edge=&quot;1&quot; parent=&quot;1&quot; source=&quot;dXZAkCa6KsGppO-HxsZK-49&quot; target=&quot;dXZAkCa6KsGppO-HxsZK-51&quot;&gt;&#10;          &lt;mxGeometry relative=&quot;1&quot; as=&quot;geometry&quot; /&gt;&#10;        &lt;/mxCell&gt;&#10;        &lt;mxCell id=&quot;dXZAkCa6KsGppO-HxsZK-49&quot; value=&quot;193.68.98.1&quot; style=&quot;image;html=1;image=img/lib/clip_art/networking/Firewall_02_128x128.png&quot; vertex=&quot;1&quot; parent=&quot;1&quot;&gt;&#10;          &lt;mxGeometry x=&quot;-180&quot; y=&quot;605&quot; width=&quot;80&quot; height=&quot;80&quot; as=&quot;geometry&quot; /&gt;&#10;        &lt;/mxCell&gt;&#10;        &lt;mxCell id=&quot;dXZAkCa6KsGppO-HxsZK-102&quot; style=&quot;edgeStyle=orthogonalEdgeStyle;rounded=0;orthogonalLoop=1;jettySize=auto;html=1;endArrow=none;endFill=0;&quot; edge=&quot;1&quot; parent=&quot;1&quot; source=&quot;dXZAkCa6KsGppO-HxsZK-51&quot; target=&quot;dXZAkCa6KsGppO-HxsZK-100&quot;&gt;&#10;          &lt;mxGeometry relative=&quot;1&quot; as=&quot;geometry&quot;&gt;&#10;            &lt;Array as=&quot;points&quot;&gt;&#10;              &lt;mxPoint x=&quot;100&quot; y=&quot;645&quot; /&gt;&#10;              &lt;mxPoint x=&quot;100&quot; y=&quot;1150&quot; /&gt;&#10;            &lt;/Array&gt;&#10;          &lt;/mxGeometry&gt;&#10;        &lt;/mxCell&gt;&#10;        &lt;mxCell id=&quot;dXZAkCa6KsGppO-HxsZK-103&quot; style=&quot;edgeStyle=orthogonalEdgeStyle;rounded=0;orthogonalLoop=1;jettySize=auto;html=1;endArrow=none;endFill=0;&quot; edge=&quot;1&quot; parent=&quot;1&quot; source=&quot;dXZAkCa6KsGppO-HxsZK-51&quot; target=&quot;dXZAkCa6KsGppO-HxsZK-59&quot;&gt;&#10;          &lt;mxGeometry relative=&quot;1&quot; as=&quot;geometry&quot;&gt;&#10;            &lt;Array as=&quot;points&quot;&gt;&#10;              &lt;mxPoint x=&quot;100&quot; y=&quot;645&quot; /&gt;&#10;              &lt;mxPoint x=&quot;100&quot; y=&quot;905&quot; /&gt;&#10;            &lt;/Array&gt;&#10;          &lt;/mxGeometry&gt;&#10;        &lt;/mxCell&gt;&#10;        &lt;mxCell id=&quot;dXZAkCa6KsGppO-HxsZK-104&quot; style=&quot;edgeStyle=orthogonalEdgeStyle;rounded=0;orthogonalLoop=1;jettySize=auto;html=1;endArrow=none;endFill=0;&quot; edge=&quot;1&quot; parent=&quot;1&quot; source=&quot;dXZAkCa6KsGppO-HxsZK-51&quot; target=&quot;dXZAkCa6KsGppO-HxsZK-57&quot;&gt;&#10;          &lt;mxGeometry relative=&quot;1&quot; as=&quot;geometry&quot; /&gt;&#10;        &lt;/mxCell&gt;&#10;        &lt;mxCell id=&quot;dXZAkCa6KsGppO-HxsZK-105&quot; style=&quot;edgeStyle=orthogonalEdgeStyle;rounded=0;orthogonalLoop=1;jettySize=auto;html=1;endArrow=none;endFill=0;&quot; edge=&quot;1&quot; parent=&quot;1&quot; source=&quot;dXZAkCa6KsGppO-HxsZK-51&quot; target=&quot;dXZAkCa6KsGppO-HxsZK-69&quot;&gt;&#10;          &lt;mxGeometry relative=&quot;1&quot; as=&quot;geometry&quot;&gt;&#10;            &lt;Array as=&quot;points&quot;&gt;&#10;              &lt;mxPoint x=&quot;100&quot; y=&quot;645&quot; /&gt;&#10;              &lt;mxPoint x=&quot;100&quot; y=&quot;486&quot; /&gt;&#10;            &lt;/Array&gt;&#10;          &lt;/mxGeometry&gt;&#10;        &lt;/mxCell&gt;&#10;        &lt;mxCell id=&quot;dXZAkCa6KsGppO-HxsZK-51&quot; value=&quot;&quot; style=&quot;image;points=[];aspect=fixed;html=1;align=center;shadow=0;dashed=0;image=img/lib/allied_telesis/security/Router_VPN.svg;&quot; vertex=&quot;1&quot; parent=&quot;1&quot;&gt;&#10;          &lt;mxGeometry x=&quot;-90&quot; y=&quot;614.9000000000001&quot; width=&quot;85.39&quot; height=&quot;60.6&quot; as=&quot;geometry&quot; /&gt;&#10;        &lt;/mxCell&gt;&#10;        &lt;mxCell id=&quot;dXZAkCa6KsGppO-HxsZK-68&quot; style=&quot;edgeStyle=orthogonalEdgeStyle;rounded=0;orthogonalLoop=1;jettySize=auto;html=1;entryX=0;entryY=0.5;entryDx=0;entryDy=0;endArrow=none;endFill=0;&quot; edge=&quot;1&quot; parent=&quot;1&quot; source=&quot;dXZAkCa6KsGppO-HxsZK-57&quot; target=&quot;dXZAkCa6KsGppO-HxsZK-20&quot;&gt;&#10;          &lt;mxGeometry relative=&quot;1&quot; as=&quot;geometry&quot; /&gt;&#10;        &lt;/mxCell&gt;&#10;        &lt;mxCell id=&quot;dXZAkCa6KsGppO-HxsZK-57&quot; value=&quot;&quot; style=&quot;image;points=[];aspect=fixed;html=1;align=center;shadow=0;dashed=0;image=img/lib/allied_telesis/switch/Switch_24_port_L3.svg;&quot; vertex=&quot;1&quot; parent=&quot;1&quot;&gt;&#10;          &lt;mxGeometry x=&quot;204.4&quot; y=&quot;619.7&quot; width=&quot;74.4&quot; height=&quot;51&quot; as=&quot;geometry&quot; /&gt;&#10;        &lt;/mxCell&gt;&#10;        &lt;mxCell id=&quot;dXZAkCa6KsGppO-HxsZK-67&quot; style=&quot;edgeStyle=orthogonalEdgeStyle;rounded=0;orthogonalLoop=1;jettySize=auto;html=1;entryX=0;entryY=0.5;entryDx=0;entryDy=0;endArrow=none;endFill=0;&quot; edge=&quot;1&quot; parent=&quot;1&quot; source=&quot;dXZAkCa6KsGppO-HxsZK-59&quot; target=&quot;dXZAkCa6KsGppO-HxsZK-1&quot;&gt;&#10;          &lt;mxGeometry relative=&quot;1&quot; as=&quot;geometry&quot; /&gt;&#10;        &lt;/mxCell&gt;&#10;        &lt;mxCell id=&quot;dXZAkCa6KsGppO-HxsZK-59&quot; value=&quot;&quot; style=&quot;image;points=[];aspect=fixed;html=1;align=center;shadow=0;dashed=0;image=img/lib/allied_telesis/switch/Switch_24_port_L3.svg;&quot; vertex=&quot;1&quot; parent=&quot;1&quot;&gt;&#10;          &lt;mxGeometry x=&quot;204.4&quot; y=&quot;879.5&quot; width=&quot;74.4&quot; height=&quot;51&quot; as=&quot;geometry&quot; /&gt;&#10;        &lt;/mxCell&gt;&#10;        &lt;mxCell id=&quot;dXZAkCa6KsGppO-HxsZK-74&quot; style=&quot;edgeStyle=orthogonalEdgeStyle;rounded=0;orthogonalLoop=1;jettySize=auto;html=1;entryX=0;entryY=0.5;entryDx=0;entryDy=0;endArrow=none;endFill=0;&quot; edge=&quot;1&quot; parent=&quot;1&quot; source=&quot;dXZAkCa6KsGppO-HxsZK-69&quot; target=&quot;dXZAkCa6KsGppO-HxsZK-13&quot;&gt;&#10;          &lt;mxGeometry relative=&quot;1&quot; as=&quot;geometry&quot;&gt;&#10;            &lt;Array as=&quot;points&quot;&gt;&#10;              &lt;mxPoint x=&quot;310&quot; y=&quot;486&quot; /&gt;&#10;              &lt;mxPoint x=&quot;310&quot; y=&quot;215&quot; /&gt;&#10;            &lt;/Array&gt;&#10;          &lt;/mxGeometry&gt;&#10;        &lt;/mxCell&gt;&#10;        &lt;mxCell id=&quot;dXZAkCa6KsGppO-HxsZK-75&quot; style=&quot;edgeStyle=orthogonalEdgeStyle;rounded=0;orthogonalLoop=1;jettySize=auto;html=1;entryX=0;entryY=0.5;entryDx=0;entryDy=0;endArrow=none;endFill=0;&quot; edge=&quot;1&quot; parent=&quot;1&quot; source=&quot;dXZAkCa6KsGppO-HxsZK-69&quot; target=&quot;dXZAkCa6KsGppO-HxsZK-32&quot;&gt;&#10;          &lt;mxGeometry relative=&quot;1&quot; as=&quot;geometry&quot;&gt;&#10;            &lt;Array as=&quot;points&quot;&gt;&#10;              &lt;mxPoint x=&quot;242&quot; y=&quot;20&quot; /&gt;&#10;            &lt;/Array&gt;&#10;          &lt;/mxGeometry&gt;&#10;        &lt;/mxCell&gt;&#10;        &lt;mxCell id=&quot;dXZAkCa6KsGppO-HxsZK-76&quot; style=&quot;edgeStyle=orthogonalEdgeStyle;rounded=0;orthogonalLoop=1;jettySize=auto;html=1;entryX=0;entryY=0.5;entryDx=0;entryDy=0;endArrow=none;endFill=0;&quot; edge=&quot;1&quot; parent=&quot;1&quot; source=&quot;dXZAkCa6KsGppO-HxsZK-69&quot; target=&quot;dXZAkCa6KsGppO-HxsZK-17&quot;&gt;&#10;          &lt;mxGeometry relative=&quot;1&quot; as=&quot;geometry&quot;&gt;&#10;            &lt;Array as=&quot;points&quot;&gt;&#10;              &lt;mxPoint x=&quot;349&quot; y=&quot;486&quot; /&gt;&#10;              &lt;mxPoint x=&quot;349&quot; y=&quot;411&quot; /&gt;&#10;            &lt;/Array&gt;&#10;          &lt;/mxGeometry&gt;&#10;        &lt;/mxCell&gt;&#10;        &lt;mxCell id=&quot;dXZAkCa6KsGppO-HxsZK-69&quot; value=&quot;&quot; style=&quot;image;points=[];aspect=fixed;html=1;align=center;shadow=0;dashed=0;image=img/lib/allied_telesis/switch/Switch_24_port_L3.svg;&quot; vertex=&quot;1&quot; parent=&quot;1&quot;&gt;&#10;          &lt;mxGeometry x=&quot;204.4&quot; y=&quot;460&quot; width=&quot;74.4&quot; height=&quot;51&quot; as=&quot;geometry&quot; /&gt;&#10;        &lt;/mxCell&gt;&#10;        &lt;mxCell id=&quot;dXZAkCa6KsGppO-HxsZK-87&quot; value=&quot;Modelis 2000&quot; style=&quot;verticalLabelPosition=bottom;html=1;verticalAlign=top;align=center;strokeColor=none;fillColor=#00BEF2;shape=mxgraph.azure.enterprise;pointerEvents=1;&quot; vertex=&quot;1&quot; parent=&quot;1&quot;&gt;&#10;          &lt;mxGeometry x=&quot;-300.5&quot; y=&quot;780&quot; width=&quot;30&quot; height=&quot;50&quot; as=&quot;geometry&quot; /&gt;&#10;        &lt;/mxCell&gt;&#10;        &lt;mxCell id=&quot;dXZAkCa6KsGppO-HxsZK-89&quot; style=&quot;edgeStyle=orthogonalEdgeStyle;rounded=0;orthogonalLoop=1;jettySize=auto;html=1;entryX=0.5;entryY=0;entryDx=0;entryDy=0;entryPerimeter=0;endArrow=none;endFill=0;&quot; edge=&quot;1&quot; parent=&quot;1&quot; source=&quot;dXZAkCa6KsGppO-HxsZK-39&quot; target=&quot;dXZAkCa6KsGppO-HxsZK-87&quot;&gt;&#10;          &lt;mxGeometry relative=&quot;1&quot; as=&quot;geometry&quot; /&gt;&#10;        &lt;/mxCell&gt;&#10;        &lt;mxCell id=&quot;dXZAkCa6KsGppO-HxsZK-101&quot; style=&quot;edgeStyle=orthogonalEdgeStyle;rounded=0;orthogonalLoop=1;jettySize=auto;html=1;entryX=0;entryY=0.5;entryDx=0;entryDy=0;endArrow=none;endFill=0;&quot; edge=&quot;1&quot; parent=&quot;1&quot; source=&quot;dXZAkCa6KsGppO-HxsZK-100&quot; target=&quot;dXZAkCa6KsGppO-HxsZK-33&quot;&gt;&#10;          &lt;mxGeometry relative=&quot;1&quot; as=&quot;geometry&quot; /&gt;&#10;        &lt;/mxCell&gt;&#10;        &lt;mxCell id=&quot;dXZAkCa6KsGppO-HxsZK-100&quot; value=&quot;&quot; style=&quot;image;points=[];aspect=fixed;html=1;align=center;shadow=0;dashed=0;image=img/lib/allied_telesis/switch/Switch_24_port_L3.svg;&quot; vertex=&quot;1&quot; parent=&quot;1&quot;&gt;&#10;          &lt;mxGeometry x=&quot;204.4&quot; y=&quot;1124.5&quot; width=&quot;74.4&quot; height=&quot;51&quot; as=&quot;geometry&quot; /&gt;&#10;        &lt;/mxCell&gt;&#10;      &lt;/root&gt;&#10;    &lt;/mxGraphModel&gt;&#10;  &lt;/diagram&gt;&#10;&lt;/mxfile&gt;&#10;"><defs><linearGradient x1="0%" y1="0%" x2="0%" y2="100%" id="mx-gradient-637d8a-1-324752-1-s-0"><stop offset="0%" style="stop-color: rgb(99, 125, 138); stop-opacity: 1;"/><stop offset="100%" style="stop-color: rgb(50, 71, 82); stop-opacity: 1;"/></linearGradient></defs><g><rect x="271" y="0" width="1260" height="1390" fill="#d5e8d4" stroke="#82b366" pointer-events="all"/><g transform="translate(-0.5 -0.5)"><switch><foreignObject pointer-events="none" width="100%" height="100%" requiredFeatures="http://www.w3.org/TR/SVG11/feature#Extensibility" style="overflow: visible; text-align: left;"><div xmlns="http://www.w3.org/1999/xhtml" style="display: flex; align-items: unsafe flex-start; justify-content: unsafe flex-start; width: 1258px; height: 1px; padding-top: 7px; margin-left: 273px;"><div data-drawio-colors="color: rgb(0, 0, 0); " style="box-sizing: border-box; font-size: 0px; text-align: left;"><div style="display: inline-block; font-size: 20px; font-family: Helvetica; color: rgb(0, 0, 0); line-height: 1.2; pointer-events: all; white-space: normal; overflow-wrap: normal;">LAN 192.168.0.0/16</div></div></div></foreignObject><text x="273" y="27" fill="rgb(0, 0, 0)" font-family="Helvetica" font-size="20px">LAN 192.168.0.0/16</text></switch></g><path d="M 741 923 L 741 900 L 1481 900 L 1481 923" fill="rgb(255, 255, 255)" stroke="rgb(0, 0, 0)" stroke-miterlimit="10" pointer-events="all"/><path d="M 741 923 L 741 1130 L 1481 1130 L 1481 923" fill="none" stroke="rgb(0, 0, 0)" stroke-miterlimit="10" pointer-events="none"/><path d="M 741 923 L 1481 923" fill="none" stroke="rgb(0, 0, 0)" stroke-miterlimit="10" pointer-events="none"/><g transform="translate(-0.5 -0.5)"><switch><foreignObject pointer-events="none" width="100%" height="100%" requiredFeatures="http://www.w3.org/TR/SVG11/feature#Extensibility" style="overflow: visible; text-align: left;"><div xmlns="http://www.w3.org/1999/xhtml" style="display: flex; align-items: unsafe center; justify-content: unsafe center; width: 738px; height: 1px; padding-top: 912px; margin-left: 742px;"><div data-drawio-colors="color: rgb(0, 0, 0); " style="box-sizing: border-box; font-size: 0px; text-align: center;"><div style="display: inline-block; font-size: 12px; font-family: Helvetica; color: rgb(0, 0, 0); line-height: 1.2; pointer-events: all; font-weight: bold; white-space: normal; overflow-wrap: normal;">Administratif</div></div></div></foreignObject><text x="1111" y="915" fill="rgb(0, 0, 0)" font-family="Helvetica" font-size="12px" text-anchor="middle" font-weight="bold">Administratif</text></switch></g><path d="M 786 968 L 786 945 L 936 945 L 936 968" fill="rgb(255, 255, 255)" stroke="rgb(0, 0, 0)" stroke-miterlimit="10" pointer-events="all"/><path d="M 786 968 L 786 1095 L 936 1095 L 936 968" fill="none" stroke="rgb(0, 0, 0)" stroke-miterlimit="10" pointer-events="none"/><path d="M 786 968 L 936 968" fill="none" stroke="rgb(0, 0, 0)" stroke-miterlimit="10" pointer-events="none"/><g transform="translate(-0.5 -0.5)"><switch><foreignObject pointer-events="none" width="100%" height="100%" requiredFeatures="http://www.w3.org/TR/SVG11/feature#Extensibility" style="overflow: visible; text-align: left;"><div xmlns="http://www.w3.org/1999/xhtml" style="display: flex; align-items: unsafe center; justify-content: unsafe center; width: 148px; height: 1px; padding-top: 957px; margin-left: 787px;"><div data-drawio-colors="color: rgb(0, 0, 0); " style="box-sizing: border-box; font-size: 0px; text-align: center;"><div style="display: inline-block; font-size: 12px; font-family: Helvetica; color: rgb(0, 0, 0); line-height: 1.2; pointer-events: all; font-weight: bold; white-space: normal; overflow-wrap: normal;">Comerciales</div></div></div></foreignObject><text x="861" y="960" fill="rgb(0, 0, 0)" font-family="Helvetica" font-size="12px" text-anchor="middle" font-weight="bold">Comerciales</text></switch></g><image x="839.5" y="998.2" width="42" height="42.6" xlink:href="file:///app/main/resources/app.asar/drawio/src/main/webapp/img/lib/allied_telesis/computer_and_terminals/Laptop.svg"/><g transform="translate(-0.5 -0.5)"><switch><foreignObject pointer-events="none" width="100%" height="100%" requiredFeatures="http://www.w3.org/TR/SVG11/feature#Extensibility" style="overflow: visible; text-align: left;"><div xmlns="http://www.w3.org/1999/xhtml" style="display: flex; align-items: unsafe flex-start; justify-content: unsafe center; width: 1px; height: 1px; padding-top: 1048px; margin-left: 861px;"><div data-drawio-colors="color: rgb(0, 0, 0); " style="box-sizing: border-box; font-size: 0px; text-align: center;"><div style="display: inline-block; font-size: 12px; font-family: Helvetica; color: rgb(0, 0, 0); line-height: 1.2; pointer-events: all; white-space: nowrap;">20</div></div></div></foreignObject><text x="861" y="1060" fill="rgb(0, 0, 0)" font-family="Helvetica" font-size="12px" text-anchor="middle">20</text></switch></g><path d="M 966 968 L 966 945 L 1126 945 L 1126 968" fill="rgb(255, 255, 255)" stroke="rgb(0, 0, 0)" stroke-miterlimit="10" pointer-events="all"/><path d="M 966 968 L 966 1095 L 1126 1095 L 1126 968" fill="none" stroke="rgb(0, 0, 0)" stroke-miterlimit="10" pointer-events="none"/><path d="M 966 968 L 1126 968" fill="none" stroke="rgb(0, 0, 0)" stroke-miterlimit="10" pointer-events="none"/><g transform="translate(-0.5 -0.5)"><switch><foreignObject pointer-events="none" width="100%" height="100%" requiredFeatures="http://www.w3.org/TR/SVG11/feature#Extensibility" style="overflow: visible; text-align: left;"><div xmlns="http://www.w3.org/1999/xhtml" style="display: flex; align-items: unsafe center; justify-content: unsafe center; width: 158px; height: 1px; padding-top: 957px; margin-left: 967px;"><div data-drawio-colors="color: rgb(0, 0, 0); " style="box-sizing: border-box; font-size: 0px; text-align: center;"><div style="display: inline-block; font-size: 12px; font-family: Helvetica; color: rgb(0, 0, 0); line-height: 1.2; pointer-events: all; font-weight: bold; white-space: normal; overflow-wrap: normal;">Marketing</div></div></div></foreignObject><text x="1046" y="960" fill="rgb(0, 0, 0)" font-family="Helvetica" font-size="12px" text-anchor="middle" font-weight="bold">Marketing</text></switch></g><image x="1022.7" y="988.6" width="45.6" height="61.8" xlink:href="file:///app/main/resources/app.asar/drawio/src/main/webapp/img/lib/allied_telesis/computer_and_terminals/Personal_Computer.svg"/><g transform="translate(-0.5 -0.5)"><switch><foreignObject pointer-events="none" width="100%" height="100%" requiredFeatures="http://www.w3.org/TR/SVG11/feature#Extensibility" style="overflow: visible; text-align: left;"><div xmlns="http://www.w3.org/1999/xhtml" style="display: flex; align-items: unsafe flex-start; justify-content: unsafe center; width: 1px; height: 1px; padding-top: 1058px; margin-left: 1046px;"><div data-drawio-colors="color: rgb(0, 0, 0); " style="box-sizing: border-box; font-size: 0px; text-align: center;"><div style="display: inline-block; font-size: 12px; font-family: Helvetica; color: rgb(0, 0, 0); line-height: 1.2; pointer-events: all; white-space: nowrap;">3</div></div></div></foreignObject><text x="1046" y="1070" fill="rgb(0, 0, 0)" font-family="Helvetica" font-size="12px" text-anchor="middle">3</text></switch></g><path d="M 1156 968 L 1156 945 L 1316 945 L 1316 968" fill="rgb(255, 255, 255)" stroke="rgb(0, 0, 0)" stroke-miterlimit="10" pointer-events="all"/><path d="M 1156 968 L 1156 1095 L 1316 1095 L 1316 968" fill="none" stroke="rgb(0, 0, 0)" stroke-miterlimit="10" pointer-events="none"/><path d="M 1156 968 L 1316 968" fill="none" stroke="rgb(0, 0, 0)" stroke-miterlimit="10" pointer-events="none"/><g transform="translate(-0.5 -0.5)"><switch><foreignObject pointer-events="none" width="100%" height="100%" requiredFeatures="http://www.w3.org/TR/SVG11/feature#Extensibility" style="overflow: visible; text-align: left;"><div xmlns="http://www.w3.org/1999/xhtml" style="display: flex; align-items: unsafe center; justify-content: unsafe center; width: 158px; height: 1px; padding-top: 957px; margin-left: 1157px;"><div data-drawio-colors="color: rgb(0, 0, 0); " style="box-sizing: border-box; font-size: 0px; text-align: center;"><div style="display: inline-block; font-size: 12px; font-family: Helvetica; color: rgb(0, 0, 0); line-height: 1.2; pointer-events: all; font-weight: bold; white-space: normal; overflow-wrap: normal;">Achat</div></div></div></foreignObject><text x="1236" y="960" fill="rgb(0, 0, 0)" font-family="Helvetica" font-size="12px" text-anchor="middle" font-weight="bold">Achat</text></switch></g><image x="1212.7" y="988.6" width="45.6" height="61.8" xlink:href="file:///app/main/resources/app.asar/drawio/src/main/webapp/img/lib/allied_telesis/computer_and_terminals/Personal_Computer.svg"/><g transform="translate(-0.5 -0.5)"><switch><foreignObject pointer-events="none" width="100%" height="100%" requiredFeatures="http://www.w3.org/TR/SVG11/feature#Extensibility" style="overflow: visible; text-align: left;"><div xmlns="http://www.w3.org/1999/xhtml" style="display: flex; align-items: unsafe flex-start; justify-content: unsafe center; width: 1px; height: 1px; padding-top: 1058px; margin-left: 1236px;"><div data-drawio-colors="color: rgb(0, 0, 0); " style="box-sizing: border-box; font-size: 0px; text-align: center;"><div style="display: inline-block; font-size: 12px; font-family: Helvetica; color: rgb(0, 0, 0); line-height: 1.2; pointer-events: all; white-space: nowrap;">2</div></div></div></foreignObject><text x="1236" y="1070" fill="rgb(0, 0, 0)" font-family="Helvetica" font-size="12px" text-anchor="middle">2</text></switch></g><path d="M 1361 1040.04 L 1361 1004.41 L 1396.75 995.69 L 1396.75 980.65 L 1398.5 980 L 1415.5 984.73 L 1415.5 1000.18 L 1431 1004.91 L 1431 1041.13 L 1393.25 1050 Z" fill="#bec5d6" stroke="none" pointer-events="all"/><path d="M 1361 1004.41 L 1393.25 1014.13 L 1393.25 1050 L 1361 1040.04 Z" fill="#97a1b2" stroke="none" pointer-events="all"/><path d="M 1363 1034.31 L 1363 1032.06 L 1391.25 1040.53 L 1391.25 1043.02 Z" fill="#666d75" stroke="none" pointer-events="all"/><path d="M 1374.25 1003.42 L 1401.25 996.69 L 1422 1003.67 L 1415.5 1005.41 L 1396.75 1001.17 Z" fill="#5d656c" stroke="none" pointer-events="all"/><path d="M 1374.25 1003.42 L 1397 1001.17 L 1413.5 1005.91 L 1395.75 1010.14 Z" fill="#959fb2" stroke="none" pointer-events="all"/><path d="M 1396.75 980.75 L 1398.5 980 L 1415.5 984.73 L 1413.75 985.48 Z" fill="#ffffff" stroke="none" pointer-events="all"/><path d="M 1413.75 985.48 L 1415.5 984.73 L 1415.5 1005.41 L 1413.75 1005.91 Z" fill="#9ea0a3" stroke="none" pointer-events="all"/><path d="M 1396.75 1001.17 L 1396.75 980.75 L 1413.75 985.48 L 1413.75 1005.91 Z" fill="#eff0f1" stroke="none" pointer-events="all"/><path d="M 1393.25 1014.13 L 1431 1004.91 L 1431 1041.03 L 1393.25 1050 Z" fill="#5e666c" stroke="none" pointer-events="all"/><path d="M 1393.25 1040.78 C 1387.22 1039.14 1381.36 1036.94 1375.75 1034.21 C 1370.04 1031.76 1366.3 1027.38 1365.75 1022.47 C 1365.54 1019.52 1365.71 1016.54 1366.25 1013.63 C 1366.48 1011.14 1367.64 1008.83 1369.5 1007.15 L 1377.25 1004.36 L 1395.75 1010.14 L 1415.75 1005.36 L 1423.75 1006.9 C 1424.85 1008.15 1425.63 1009.65 1426 1011.26 C 1426.36 1013.61 1426.52 1015.99 1426.5 1018.36 C 1426.58 1022.77 1426.36 1027.18 1425.85 1031.57 C 1425.58 1034.12 1424.16 1036.41 1422 1037.79 C 1419.57 1039.04 1416.95 1039.88 1414.25 1040.28 C 1407.29 1041.18 1400.25 1041.35 1393.25 1040.78 Z" fill-opacity="0.4" fill="#ffffff" stroke="none" pointer-events="all"/><path d="M 1393.25 1019.11 L 1431 1010.04" fill="none" stroke="#a5acbb" stroke-opacity="0.5" stroke-width="0.45" stroke-miterlimit="10" pointer-events="all"/><path d="M 1361 1008.9 L 1393.25 1019.11" fill="none" stroke="#404449" stroke-opacity="0.5" stroke-width="0.45" stroke-miterlimit="10" pointer-events="all"/><rect x="1361" y="980" width="0" height="0" fill="none" stroke="none" pointer-events="all"/><path d="M 1361 1040.04 L 1361 1004.41 L 1396.75 995.69 L 1396.75 980.65 L 1398.5 980 L 1415.5 984.73 L 1415.5 1000.18 L 1431 1004.91 L 1431 1041.13 L 1393.25 1050 Z" fill="none" stroke="#000000" stroke-width="0.6" stroke-miterlimit="10" pointer-events="all"/><g transform="translate(-0.5 -0.5)"><switch><foreignObject pointer-events="none" width="100%" height="100%" requiredFeatures="http://www.w3.org/TR/SVG11/feature#Extensibility" style="overflow: visible; text-align: left;"><div xmlns="http://www.w3.org/1999/xhtml" style="display: flex; align-items: unsafe flex-start; justify-content: unsafe center; width: 1px; height: 1px; padding-top: 1057px; margin-left: 1396px;"><div data-drawio-colors="color: rgb(0, 0, 0); " style="box-sizing: border-box; font-size: 0px; text-align: center;"><div style="display: inline-block; font-size: 12px; font-family: Helvetica; color: rgb(0, 0, 0); line-height: 1.2; pointer-events: all; white-space: nowrap;">2</div></div></div></foreignObject><text x="1396" y="1069" fill="rgb(0, 0, 0)" font-family="Helvetica" font-size="12px" text-anchor="middle">2</text></switch></g><path d="M 741 273 L 741 250 L 891 250 L 891 273" fill="rgb(255, 255, 255)" stroke="rgb(0, 0, 0)" stroke-miterlimit="10" pointer-events="all"/><path d="M 741 273 L 741 400 L 891 400 L 891 273" fill="none" stroke="rgb(0, 0, 0)" stroke-miterlimit="10" pointer-events="none"/><path d="M 741 273 L 891 273" fill="none" stroke="rgb(0, 0, 0)" stroke-miterlimit="10" pointer-events="none"/><g transform="translate(-0.5 -0.5)"><switch><foreignObject pointer-events="none" width="100%" height="100%" requiredFeatures="http://www.w3.org/TR/SVG11/feature#Extensibility" style="overflow: visible; text-align: left;"><div xmlns="http://www.w3.org/1999/xhtml" style="display: flex; align-items: unsafe center; justify-content: unsafe center; width: 148px; height: 1px; padding-top: 262px; margin-left: 742px;"><div data-drawio-colors="color: rgb(0, 0, 0); " style="box-sizing: border-box; font-size: 0px; text-align: center;"><div style="display: inline-block; font-size: 12px; font-family: Helvetica; color: rgb(0, 0, 0); line-height: 1.2; pointer-events: all; font-weight: bold; white-space: normal; overflow-wrap: normal;">Direction</div></div></div></foreignObject><text x="816" y="265" fill="rgb(0, 0, 0)" font-family="Helvetica" font-size="12px" text-anchor="middle" font-weight="bold">Direction</text></switch></g><image x="794.5" y="303.2" width="42" height="42.6" xlink:href="file:///app/main/resources/app.asar/drawio/src/main/webapp/img/lib/allied_telesis/computer_and_terminals/Laptop.svg"/><g transform="translate(-0.5 -0.5)"><switch><foreignObject pointer-events="none" width="100%" height="100%" requiredFeatures="http://www.w3.org/TR/SVG11/feature#Extensibility" style="overflow: visible; text-align: left;"><div xmlns="http://www.w3.org/1999/xhtml" style="display: flex; align-items: unsafe flex-start; justify-content: unsafe center; width: 1px; height: 1px; padding-top: 353px; margin-left: 816px;"><div data-drawio-colors="color: rgb(0, 0, 0); " style="box-sizing: border-box; font-size: 0px; text-align: center;"><div style="display: inline-block; font-size: 12px; font-family: Helvetica; color: rgb(0, 0, 0); line-height: 1.2; pointer-events: all; white-space: nowrap;">1<br />Mr. Méca</div></div></div></foreignObject><text x="816" y="365" fill="rgb(0, 0, 0)" font-family="Helvetica" font-size="12px" text-anchor="middle">1...</text></switch></g><path d="M 741 444 L 741 421 L 1006 421 L 1006 444" fill="rgb(255, 255, 255)" stroke="rgb(0, 0, 0)" stroke-miterlimit="10" pointer-events="all"/><path d="M 741 444 L 741 621 L 1006 621 L 1006 444" fill="none" stroke="rgb(0, 0, 0)" stroke-miterlimit="10" pointer-events="none"/><path d="M 741 444 L 1006 444" fill="none" stroke="rgb(0, 0, 0)" stroke-miterlimit="10" pointer-events="none"/><g transform="translate(-0.5 -0.5)"><switch><foreignObject pointer-events="none" width="100%" height="100%" requiredFeatures="http://www.w3.org/TR/SVG11/feature#Extensibility" style="overflow: visible; text-align: left;"><div xmlns="http://www.w3.org/1999/xhtml" style="display: flex; align-items: unsafe center; justify-content: unsafe center; width: 263px; height: 1px; padding-top: 433px; margin-left: 742px;"><div data-drawio-colors="color: rgb(0, 0, 0); " style="box-sizing: border-box; font-size: 0px; text-align: center;"><div style="display: inline-block; font-size: 12px; font-family: Helvetica; color: rgb(0, 0, 0); line-height: 1.2; pointer-events: all; font-weight: bold; white-space: normal; overflow-wrap: normal;">R&amp;D</div></div></div></foreignObject><text x="874" y="436" fill="rgb(0, 0, 0)" font-family="Helvetica" font-size="12px" text-anchor="middle" font-weight="bold">R&amp;D</text></switch></g><path d="M 901 546.04 L 901 510.41 L 936.75 501.69 L 936.75 486.65 L 938.5 486 L 955.5 490.73 L 955.5 506.18 L 971 510.91 L 971 547.13 L 933.25 556 Z" fill="#bec5d6" stroke="none" pointer-events="all"/><path d="M 901 510.41 L 933.25 520.13 L 933.25 556 L 901 546.04 Z" fill="#97a1b2" stroke="none" pointer-events="all"/><path d="M 903 540.31 L 903 538.06 L 931.25 546.53 L 931.25 549.02 Z" fill="#666d75" stroke="none" pointer-events="all"/><path d="M 914.25 509.42 L 941.25 502.69 L 962 509.67 L 955.5 511.41 L 936.75 507.17 Z" fill="#5d656c" stroke="none" pointer-events="all"/><path d="M 914.25 509.42 L 937 507.17 L 953.5 511.91 L 935.75 516.14 Z" fill="#959fb2" stroke="none" pointer-events="all"/><path d="M 936.75 486.75 L 938.5 486 L 955.5 490.73 L 953.75 491.48 Z" fill="#ffffff" stroke="none" pointer-events="all"/><path d="M 953.75 491.48 L 955.5 490.73 L 955.5 511.41 L 953.75 511.91 Z" fill="#9ea0a3" stroke="none" pointer-events="all"/><path d="M 936.75 507.17 L 936.75 486.75 L 953.75 491.48 L 953.75 511.91 Z" fill="#eff0f1" stroke="none" pointer-events="all"/><path d="M 933.25 520.13 L 971 510.91 L 971 547.03 L 933.25 556 Z" fill="#5e666c" stroke="none" pointer-events="all"/><path d="M 933.25 546.78 C 927.22 545.14 921.36 542.94 915.75 540.21 C 910.04 537.76 906.3 533.38 905.75 528.47 C 905.54 525.52 905.71 522.54 906.25 519.63 C 906.48 517.14 907.64 514.83 909.5 513.15 L 917.25 510.36 L 935.75 516.14 L 955.75 511.36 L 963.75 512.9 C 964.85 514.15 965.63 515.65 966 517.26 C 966.36 519.61 966.52 521.99 966.5 524.36 C 966.58 528.77 966.36 533.18 965.85 537.57 C 965.58 540.12 964.16 542.41 962 543.79 C 959.57 545.04 956.95 545.88 954.25 546.28 C 947.29 547.18 940.25 547.35 933.25 546.78 Z" fill-opacity="0.4" fill="#ffffff" stroke="none" pointer-events="all"/><path d="M 933.25 525.11 L 971 516.04" fill="none" stroke="#a5acbb" stroke-opacity="0.5" stroke-width="0.45" stroke-miterlimit="10" pointer-events="all"/><path d="M 901 514.9 L 933.25 525.11" fill="none" stroke="#404449" stroke-opacity="0.5" stroke-width="0.45" stroke-miterlimit="10" pointer-events="all"/><rect x="901" y="486" width="0" height="0" fill="none" stroke="none" pointer-events="all"/><path d="M 901 546.04 L 901 510.41 L 936.75 501.69 L 936.75 486.65 L 938.5 486 L 955.5 490.73 L 955.5 506.18 L 971 510.91 L 971 547.13 L 933.25 556 Z" fill="none" stroke="#000000" stroke-width="0.6" stroke-miterlimit="10" pointer-events="all"/><g transform="translate(-0.5 -0.5)"><switch><foreignObject pointer-events="none" width="100%" height="100%" requiredFeatures="http://www.w3.org/TR/SVG11/feature#Extensibility" style="overflow: visible; text-align: left;"><div xmlns="http://www.w3.org/1999/xhtml" style="display: flex; align-items: unsafe flex-start; justify-content: unsafe center; width: 1px; height: 1px; padding-top: 563px; margin-left: 936px;"><div data-drawio-colors="color: rgb(0, 0, 0); " style="box-sizing: border-box; font-size: 0px; text-align: center;"><div style="display: inline-block; font-size: 12px; font-family: Helvetica; color: rgb(0, 0, 0); line-height: 1.2; pointer-events: all; white-space: nowrap;">1</div></div></div></foreignObject><text x="936" y="575" fill="rgb(0, 0, 0)" font-family="Helvetica" font-size="12px" text-anchor="middle">1</text></switch></g><image x="790.5" y="489.6" width="45.6" height="61.8" xlink:href="file:///app/main/resources/app.asar/drawio/src/main/webapp/img/lib/allied_telesis/computer_and_terminals/Personal_Computer.svg"/><g transform="translate(-0.5 -0.5)"><switch><foreignObject pointer-events="none" width="100%" height="100%" requiredFeatures="http://www.w3.org/TR/SVG11/feature#Extensibility" style="overflow: visible; text-align: left;"><div xmlns="http://www.w3.org/1999/xhtml" style="display: flex; align-items: unsafe flex-start; justify-content: unsafe center; width: 1px; height: 1px; padding-top: 559px; margin-left: 814px;"><div data-drawio-colors="color: rgb(0, 0, 0); " style="box-sizing: border-box; font-size: 0px; text-align: center;"><div style="display: inline-block; font-size: 12px; font-family: Helvetica; color: rgb(0, 0, 0); line-height: 1.2; pointer-events: all; white-space: nowrap;">12</div></div></div></foreignObject><text x="814" y="571" fill="rgb(0, 0, 0)" font-family="Helvetica" font-size="12px" text-anchor="middle">12</text></switch></g><path d="M 741 663 L 741 640 L 1491 640 L 1491 663" fill="rgb(255, 255, 255)" stroke="rgb(0, 0, 0)" stroke-miterlimit="10" pointer-events="all"/><path d="M 741 663 L 741 870 L 1491 870 L 1491 663" fill="none" stroke="rgb(0, 0, 0)" stroke-miterlimit="10" pointer-events="none"/><path d="M 741 663 L 1491 663" fill="none" stroke="rgb(0, 0, 0)" stroke-miterlimit="10" pointer-events="none"/><g transform="translate(-0.5 -0.5)"><switch><foreignObject pointer-events="none" width="100%" height="100%" requiredFeatures="http://www.w3.org/TR/SVG11/feature#Extensibility" style="overflow: visible; text-align: left;"><div xmlns="http://www.w3.org/1999/xhtml" style="display: flex; align-items: unsafe center; justify-content: unsafe center; width: 748px; height: 1px; padding-top: 652px; margin-left: 742px;"><div data-drawio-colors="color: rgb(0, 0, 0); " style="box-sizing: border-box; font-size: 0px; text-align: center;"><div style="display: inline-block; font-size: 12px; font-family: Helvetica; color: rgb(0, 0, 0); line-height: 1.2; pointer-events: all; font-weight: bold; white-space: normal; overflow-wrap: normal;">Production</div></div></div></foreignObject><text x="1116" y="655" fill="rgb(0, 0, 0)" font-family="Helvetica" font-size="12px" text-anchor="middle" font-weight="bold">Production</text></switch></g><path d="M 771 713 L 771 690 L 921 690 L 921 713" fill="rgb(255, 255, 255)" stroke="rgb(0, 0, 0)" stroke-miterlimit="10" pointer-events="all"/><path d="M 771 713 L 771 840 L 921 840 L 921 713" fill="none" stroke="rgb(0, 0, 0)" stroke-miterlimit="10" pointer-events="none"/><path d="M 771 713 L 921 713" fill="none" stroke="rgb(0, 0, 0)" stroke-miterlimit="10" pointer-events="none"/><g transform="translate(-0.5 -0.5)"><switch><foreignObject pointer-events="none" width="100%" height="100%" requiredFeatures="http://www.w3.org/TR/SVG11/feature#Extensibility" style="overflow: visible; text-align: left;"><div xmlns="http://www.w3.org/1999/xhtml" style="display: flex; align-items: unsafe center; justify-content: unsafe center; width: 148px; height: 1px; padding-top: 702px; margin-left: 772px;"><div data-drawio-colors="color: rgb(0, 0, 0); " style="box-sizing: border-box; font-size: 0px; text-align: center;"><div style="display: inline-block; font-size: 12px; font-family: Helvetica; color: rgb(0, 0, 0); line-height: 1.2; pointer-events: all; font-weight: bold; white-space: normal; overflow-wrap: normal;">Pilotage Machine</div></div></div></foreignObject><text x="846" y="705" fill="rgb(0, 0, 0)" font-family="Helvetica" font-size="12px" text-anchor="middle" font-weight="bold">Pilotage Machine</text></switch></g><image x="822.7" y="733.6" width="45.6" height="61.8" xlink:href="file:///app/main/resources/app.asar/drawio/src/main/webapp/img/lib/allied_telesis/computer_and_terminals/Personal_Computer.svg"/><g transform="translate(-0.5 -0.5)"><switch><foreignObject pointer-events="none" width="100%" height="100%" requiredFeatures="http://www.w3.org/TR/SVG11/feature#Extensibility" style="overflow: visible; text-align: left;"><div xmlns="http://www.w3.org/1999/xhtml" style="display: flex; align-items: unsafe flex-start; justify-content: unsafe center; width: 1px; height: 1px; padding-top: 803px; margin-left: 846px;"><div data-drawio-colors="color: rgb(0, 0, 0); " style="box-sizing: border-box; font-size: 0px; text-align: center;"><div style="display: inline-block; font-size: 12px; font-family: Helvetica; color: rgb(0, 0, 0); line-height: 1.2; pointer-events: all; white-space: nowrap;">12</div></div></div></foreignObject><text x="846" y="815" fill="rgb(0, 0, 0)" font-family="Helvetica" font-size="12px" text-anchor="middle">12</text></switch></g><path d="M 956 713 L 956 690 L 1116 690 L 1116 713" fill="rgb(255, 255, 255)" stroke="rgb(0, 0, 0)" stroke-miterlimit="10" pointer-events="all"/><path d="M 956 713 L 956 840 L 1116 840 L 1116 713" fill="none" stroke="rgb(0, 0, 0)" stroke-miterlimit="10" pointer-events="none"/><path d="M 956 713 L 1116 713" fill="none" stroke="rgb(0, 0, 0)" stroke-miterlimit="10" pointer-events="none"/><g transform="translate(-0.5 -0.5)"><switch><foreignObject pointer-events="none" width="100%" height="100%" requiredFeatures="http://www.w3.org/TR/SVG11/feature#Extensibility" style="overflow: visible; text-align: left;"><div xmlns="http://www.w3.org/1999/xhtml" style="display: flex; align-items: unsafe center; justify-content: unsafe center; width: 158px; height: 1px; padding-top: 702px; margin-left: 957px;"><div data-drawio-colors="color: rgb(0, 0, 0); " style="box-sizing: border-box; font-size: 0px; text-align: center;"><div style="display: inline-block; font-size: 12px; font-family: Helvetica; color: rgb(0, 0, 0); line-height: 1.2; pointer-events: all; font-weight: bold; white-space: normal; overflow-wrap: normal;">Ingénieurie</div></div></div></foreignObject><text x="1036" y="705" fill="rgb(0, 0, 0)" font-family="Helvetica" font-size="12px" text-anchor="middle" font-weight="bold">Ingénieurie</text></switch></g><image x="1012.7" y="733.6" width="45.6" height="61.8" xlink:href="file:///app/main/resources/app.asar/drawio/src/main/webapp/img/lib/allied_telesis/computer_and_terminals/Personal_Computer.svg"/><g transform="translate(-0.5 -0.5)"><switch><foreignObject pointer-events="none" width="100%" height="100%" requiredFeatures="http://www.w3.org/TR/SVG11/feature#Extensibility" style="overflow: visible; text-align: left;"><div xmlns="http://www.w3.org/1999/xhtml" style="display: flex; align-items: unsafe flex-start; justify-content: unsafe center; width: 1px; height: 1px; padding-top: 803px; margin-left: 1036px;"><div data-drawio-colors="color: rgb(0, 0, 0); " style="box-sizing: border-box; font-size: 0px; text-align: center;"><div style="display: inline-block; font-size: 12px; font-family: Helvetica; color: rgb(0, 0, 0); line-height: 1.2; pointer-events: all; white-space: nowrap;">18</div></div></div></foreignObject><text x="1036" y="815" fill="rgb(0, 0, 0)" font-family="Helvetica" font-size="12px" text-anchor="middle">18</text></switch></g><path d="M 1151 713 L 1151 690 L 1311 690 L 1311 713" fill="rgb(255, 255, 255)" stroke="rgb(0, 0, 0)" stroke-miterlimit="10" pointer-events="all"/><path d="M 1151 713 L 1151 840 L 1311 840 L 1311 713" fill="none" stroke="rgb(0, 0, 0)" stroke-miterlimit="10" pointer-events="none"/><path d="M 1151 713 L 1311 713" fill="none" stroke="rgb(0, 0, 0)" stroke-miterlimit="10" pointer-events="none"/><g transform="translate(-0.5 -0.5)"><switch><foreignObject pointer-events="none" width="100%" height="100%" requiredFeatures="http://www.w3.org/TR/SVG11/feature#Extensibility" style="overflow: visible; text-align: left;"><div xmlns="http://www.w3.org/1999/xhtml" style="display: flex; align-items: unsafe center; justify-content: unsafe center; width: 158px; height: 1px; padding-top: 702px; margin-left: 1152px;"><div data-drawio-colors="color: rgb(0, 0, 0); " style="box-sizing: border-box; font-size: 0px; text-align: center;"><div style="display: inline-block; font-size: 12px; font-family: Helvetica; color: rgb(0, 0, 0); line-height: 1.2; pointer-events: all; font-weight: bold; white-space: normal; overflow-wrap: normal;">Tech</div></div></div></foreignObject><text x="1231" y="705" fill="rgb(0, 0, 0)" font-family="Helvetica" font-size="12px" text-anchor="middle" font-weight="bold">Tech</text></switch></g><image x="1207.7" y="733.6" width="45.6" height="61.8" xlink:href="file:///app/main/resources/app.asar/drawio/src/main/webapp/img/lib/allied_telesis/computer_and_terminals/Personal_Computer.svg"/><g transform="translate(-0.5 -0.5)"><switch><foreignObject pointer-events="none" width="100%" height="100%" requiredFeatures="http://www.w3.org/TR/SVG11/feature#Extensibility" style="overflow: visible; text-align: left;"><div xmlns="http://www.w3.org/1999/xhtml" style="display: flex; align-items: unsafe flex-start; justify-content: unsafe center; width: 1px; height: 1px; padding-top: 803px; margin-left: 1231px;"><div data-drawio-colors="color: rgb(0, 0, 0); " style="box-sizing: border-box; font-size: 0px; text-align: center;"><div style="display: inline-block; font-size: 12px; font-family: Helvetica; color: rgb(0, 0, 0); line-height: 1.2; pointer-events: all; white-space: nowrap;">2</div></div></div></foreignObject><text x="1231" y="815" fill="rgb(0, 0, 0)" font-family="Helvetica" font-size="12px" text-anchor="middle">2</text></switch></g><path d="M 1371 780.04 L 1371 744.41 L 1406.75 735.69 L 1406.75 720.65 L 1408.5 720 L 1425.5 724.73 L 1425.5 740.18 L 1441 744.91 L 1441 781.13 L 1403.25 790 Z" fill="#bec5d6" stroke="none" pointer-events="all"/><path d="M 1371 744.41 L 1403.25 754.13 L 1403.25 790 L 1371 780.04 Z" fill="#97a1b2" stroke="none" pointer-events="all"/><path d="M 1373 774.31 L 1373 772.06 L 1401.25 780.53 L 1401.25 783.02 Z" fill="#666d75" stroke="none" pointer-events="all"/><path d="M 1384.25 743.42 L 1411.25 736.69 L 1432 743.67 L 1425.5 745.41 L 1406.75 741.17 Z" fill="#5d656c" stroke="none" pointer-events="all"/><path d="M 1384.25 743.42 L 1407 741.17 L 1423.5 745.91 L 1405.75 750.14 Z" fill="#959fb2" stroke="none" pointer-events="all"/><path d="M 1406.75 720.75 L 1408.5 720 L 1425.5 724.73 L 1423.75 725.48 Z" fill="#ffffff" stroke="none" pointer-events="all"/><path d="M 1423.75 725.48 L 1425.5 724.73 L 1425.5 745.41 L 1423.75 745.91 Z" fill="#9ea0a3" stroke="none" pointer-events="all"/><path d="M 1406.75 741.17 L 1406.75 720.75 L 1423.75 725.48 L 1423.75 745.91 Z" fill="#eff0f1" stroke="none" pointer-events="all"/><path d="M 1403.25 754.13 L 1441 744.91 L 1441 781.03 L 1403.25 790 Z" fill="#5e666c" stroke="none" pointer-events="all"/><path d="M 1403.25 780.78 C 1397.22 779.14 1391.36 776.94 1385.75 774.21 C 1380.04 771.76 1376.3 767.38 1375.75 762.47 C 1375.54 759.52 1375.71 756.54 1376.25 753.63 C 1376.48 751.14 1377.64 748.83 1379.5 747.15 L 1387.25 744.36 L 1405.75 750.14 L 1425.75 745.36 L 1433.75 746.9 C 1434.85 748.15 1435.63 749.65 1436 751.26 C 1436.36 753.61 1436.52 755.99 1436.5 758.36 C 1436.58 762.77 1436.36 767.18 1435.85 771.57 C 1435.58 774.12 1434.16 776.41 1432 777.79 C 1429.57 779.04 1426.95 779.88 1424.25 780.28 C 1417.29 781.18 1410.25 781.35 1403.25 780.78 Z" fill-opacity="0.4" fill="#ffffff" stroke="none" pointer-events="all"/><path d="M 1403.25 759.11 L 1441 750.04" fill="none" stroke="#a5acbb" stroke-opacity="0.5" stroke-width="0.45" stroke-miterlimit="10" pointer-events="all"/><path d="M 1371 748.9 L 1403.25 759.11" fill="none" stroke="#404449" stroke-opacity="0.5" stroke-width="0.45" stroke-miterlimit="10" pointer-events="all"/><rect x="1371" y="720" width="0" height="0" fill="none" stroke="none" pointer-events="all"/><path d="M 1371 780.04 L 1371 744.41 L 1406.75 735.69 L 1406.75 720.65 L 1408.5 720 L 1425.5 724.73 L 1425.5 740.18 L 1441 744.91 L 1441 781.13 L 1403.25 790 Z" fill="none" stroke="#000000" stroke-width="0.6" stroke-miterlimit="10" pointer-events="all"/><g transform="translate(-0.5 -0.5)"><switch><foreignObject pointer-events="none" width="100%" height="100%" requiredFeatures="http://www.w3.org/TR/SVG11/feature#Extensibility" style="overflow: visible; text-align: left;"><div xmlns="http://www.w3.org/1999/xhtml" style="display: flex; align-items: unsafe flex-start; justify-content: unsafe center; width: 1px; height: 1px; padding-top: 797px; margin-left: 1406px;"><div data-drawio-colors="color: rgb(0, 0, 0); " style="box-sizing: border-box; font-size: 0px; text-align: center;"><div style="display: inline-block; font-size: 12px; font-family: Helvetica; color: rgb(0, 0, 0); line-height: 1.2; pointer-events: all; white-space: nowrap;">1</div></div></div></foreignObject><text x="1406" y="809" fill="rgb(0, 0, 0)" font-family="Helvetica" font-size="12px" text-anchor="middle">1</text></switch></g><path d="M 741 53 L 741 30 L 1011 30 L 1011 53" fill="rgb(255, 255, 255)" stroke="rgb(0, 0, 0)" stroke-miterlimit="10" pointer-events="all"/><path d="M 741 53 L 741 230 L 1011 230 L 1011 53" fill="none" stroke="rgb(0, 0, 0)" stroke-miterlimit="10" pointer-events="none"/><path d="M 741 53 L 1011 53" fill="none" stroke="rgb(0, 0, 0)" stroke-miterlimit="10" pointer-events="none"/><g transform="translate(-0.5 -0.5)"><switch><foreignObject pointer-events="none" width="100%" height="100%" requiredFeatures="http://www.w3.org/TR/SVG11/feature#Extensibility" style="overflow: visible; text-align: left;"><div xmlns="http://www.w3.org/1999/xhtml" style="display: flex; align-items: unsafe center; justify-content: unsafe center; width: 268px; height: 1px; padding-top: 42px; margin-left: 742px;"><div data-drawio-colors="color: rgb(0, 0, 0); " style="box-sizing: border-box; font-size: 0px; text-align: center;"><div style="display: inline-block; font-size: 12px; font-family: Helvetica; color: rgb(0, 0, 0); line-height: 1.2; pointer-events: all; font-weight: bold; white-space: normal; overflow-wrap: normal;">DSI</div></div></div></foreignObject><text x="876" y="45" fill="rgb(0, 0, 0)" font-family="Helvetica" font-size="12px" text-anchor="middle" font-weight="bold">DSI</text></switch></g><image x="800.5" y="98.6" width="45.6" height="61.8" xlink:href="file:///app/main/resources/app.asar/drawio/src/main/webapp/img/lib/allied_telesis/computer_and_terminals/Personal_Computer.svg"/><g transform="translate(-0.5 -0.5)"><switch><foreignObject pointer-events="none" width="100%" height="100%" requiredFeatures="http://www.w3.org/TR/SVG11/feature#Extensibility" style="overflow: visible; text-align: left;"><div xmlns="http://www.w3.org/1999/xhtml" style="display: flex; align-items: unsafe flex-start; justify-content: unsafe center; width: 1px; height: 1px; padding-top: 168px; margin-left: 824px;"><div data-drawio-colors="color: rgb(0, 0, 0); " style="box-sizing: border-box; font-size: 0px; text-align: center;"><div style="display: inline-block; font-size: 12px; font-family: Helvetica; color: rgb(0, 0, 0); line-height: 1.2; pointer-events: all; white-space: nowrap;">1</div></div></div></foreignObject><text x="824" y="180" fill="rgb(0, 0, 0)" font-family="Helvetica" font-size="12px" text-anchor="middle">1</text></switch></g><path d="M 932.33 143.73 L 902.72 133.8 C 901.71 133.41 901.02 132.2 901.02 130.99 L 901 127.12 C 901.02 126.34 901.18 125.73 901.87 125.36 L 931.87 116 L 960.89 124.71 C 962.35 125.18 963 126.61 963 127.41 L 963 133.29 L 933.02 143.69 C 932.78 143.75 932.54 143.8 932.33 143.73 Z" fill="url(#mx-gradient-637d8a-1-324752-1-s-0)" stroke="none" pointer-events="all"/><path d="M 933.89 142.07 C 933.89 143.2 933.21 144 932.15 143.69 L 902.68 133.78 C 901.49 133.33 901 131.87 901 130.93 L 901 126.86 C 901.1 125.63 901.83 125.11 902.64 125.32 L 932.25 135.32 C 933.45 135.85 933.89 137.34 933.89 138.02 Z" fill="#d0d1d3" stroke="none" pointer-events="all"/><path d="M 928.73 140.6 C 927.96 140.42 927.39 139.78 927.01 138.86 C 926.74 138.18 926.68 137.42 926.89 136.79 C 927.11 136.2 927.55 135.73 928.28 135.85 C 929.32 136.07 929.76 136.93 930.05 137.55 C 930.37 138.27 930.37 138.88 930.25 139.47 C 930.05 140.19 929.54 140.74 928.73 140.6 Z" fill="#39b24a" stroke="none" pointer-events="all"/><path d="M 921.96 137.06 C 921.96 137.49 921.66 138.04 921.05 137.86 L 905.35 132.63 C 904.81 132.45 904.4 131.77 904.4 131.1 L 904.4 128.9 C 904.4 128.39 904.77 127.92 905.27 128.09 L 921.05 133.39 C 921.56 133.59 921.96 134.35 921.96 134.84 Z" fill="#7a868b" stroke="none" pointer-events="all"/><path d="M 932.64 127.06 C 934.38 127.06 936.12 126.92 937.97 126.28 C 938.88 125.91 939.57 125.38 939.5 124.77 C 939.36 123.66 937.24 123.15 935.31 122.78 C 933.08 122.47 930.53 122.41 927.92 123.03 C 926.93 123.35 925.85 123.66 925.57 124.46 C 925.37 125.24 926.32 125.87 927.82 126.38 C 929.5 126.9 931.08 127.02 932.64 127.06 Z M 931.83 129.87 C 928.32 129.78 924.43 129.38 920.69 128.04 C 917.24 126.69 915.48 124.83 917.53 122.92 C 919.76 121.14 923.2 120.63 925.83 120.24 C 930.45 119.69 934.68 119.85 938.69 120.44 C 942.34 121.02 944.63 121.86 946.09 122.84 C 947.83 124.05 947.89 125.22 947.08 126.24 C 946.07 127.53 944 128.29 941.79 128.9 C 938.84 129.6 935.49 129.97 931.83 129.87 Z" fill="#d0d1d3" stroke="none" pointer-events="all"/><g transform="translate(-0.5 -0.5)"><switch><foreignObject pointer-events="none" width="100%" height="100%" requiredFeatures="http://www.w3.org/TR/SVG11/feature#Extensibility" style="overflow: visible; text-align: left;"><div xmlns="http://www.w3.org/1999/xhtml" style="display: flex; align-items: unsafe flex-start; justify-content: unsafe center; width: 1px; height: 1px; padding-top: 151px; margin-left: 932px;"><div data-drawio-colors="color: rgb(0, 0, 0); " style="box-sizing: border-box; font-size: 0px; text-align: center;"><div style="display: inline-block; font-size: 12px; font-family: Helvetica; color: rgb(0, 0, 0); line-height: 1.2; pointer-events: all; white-space: nowrap;">2<br />Backup ERP/CRM<br />Compta</div></div></div></foreignObject><text x="932" y="163" fill="rgb(0, 0, 0)" font-family="Helvetica" font-size="12px" text-anchor="middle">2...</text></switch></g><path d="M 741 1183 L 741 1160 L 1111 1160 L 1111 1183" fill="rgb(255, 255, 255)" stroke="rgb(0, 0, 0)" stroke-miterlimit="10" pointer-events="all"/><path d="M 741 1183 L 741 1360 L 1111 1360 L 1111 1183" fill="none" stroke="rgb(0, 0, 0)" stroke-miterlimit="10" pointer-events="none"/><path d="M 741 1183 L 1111 1183" fill="none" stroke="rgb(0, 0, 0)" stroke-miterlimit="10" pointer-events="none"/><g transform="translate(-0.5 -0.5)"><switch><foreignObject pointer-events="none" width="100%" height="100%" requiredFeatures="http://www.w3.org/TR/SVG11/feature#Extensibility" style="overflow: visible; text-align: left;"><div xmlns="http://www.w3.org/1999/xhtml" style="display: flex; align-items: unsafe center; justify-content: unsafe center; width: 368px; height: 1px; padding-top: 1172px; margin-left: 742px;"><div data-drawio-colors="color: rgb(0, 0, 0); " style="box-sizing: border-box; font-size: 0px; text-align: center;"><div style="display: inline-block; font-size: 12px; font-family: Helvetica; color: rgb(0, 0, 0); line-height: 1.2; pointer-events: all; font-weight: bold; white-space: normal; overflow-wrap: normal;">Serveurs</div></div></div></foreignObject><text x="926" y="1175" fill="rgb(0, 0, 0)" font-family="Helvetica" font-size="12px" text-anchor="middle" font-weight="bold">Serveurs</text></switch></g><image x="850.5" y="1232.5" width="42.6" height="54" xlink:href="file:///app/main/resources/app.asar/drawio/src/main/webapp/img/lib/allied_telesis/computer_and_terminals/Server_Desktop.svg"/><g transform="translate(-0.5 -0.5)"><switch><foreignObject pointer-events="none" width="100%" height="100%" requiredFeatures="http://www.w3.org/TR/SVG11/feature#Extensibility" style="overflow: visible; text-align: left;"><div xmlns="http://www.w3.org/1999/xhtml" style="display: flex; align-items: unsafe flex-start; justify-content: unsafe center; width: 1px; height: 1px; padding-top: 1294px; margin-left: 872px;"><div data-drawio-colors="color: rgb(0, 0, 0); " style="box-sizing: border-box; font-size: 0px; text-align: center;"><div style="display: inline-block; font-size: 12px; font-family: Helvetica; color: rgb(0, 0, 0); line-height: 1.2; pointer-events: all; white-space: nowrap;">AD + IIS</div></div></div></foreignObject><text x="872" y="1306" fill="rgb(0, 0, 0)" font-family="Helvetica" font-size="12px" text-anchor="middle">AD + IIS</text></switch></g><image x="960.5" y="1232.5" width="42.6" height="54" xlink:href="file:///app/main/resources/app.asar/drawio/src/main/webapp/img/lib/allied_telesis/computer_and_terminals/Server_Desktop.svg"/><g transform="translate(-0.5 -0.5)"><switch><foreignObject pointer-events="none" width="100%" height="100%" requiredFeatures="http://www.w3.org/TR/SVG11/feature#Extensibility" style="overflow: visible; text-align: left;"><div xmlns="http://www.w3.org/1999/xhtml" style="display: flex; align-items: unsafe flex-start; justify-content: unsafe center; width: 1px; height: 1px; padding-top: 1294px; margin-left: 982px;"><div data-drawio-colors="color: rgb(0, 0, 0); " style="box-sizing: border-box; font-size: 0px; text-align: center;"><div style="display: inline-block; font-size: 12px; font-family: Helvetica; color: rgb(0, 0, 0); line-height: 1.2; pointer-events: all; white-space: nowrap;">1<br />Serveur de Fichier<br />R&amp;D</div></div></div></foreignObject><text x="982" y="1306" fill="rgb(0, 0, 0)" font-family="Helvetica" font-size="12px" text-anchor="middle">1...</text></switch></g><image x="1040.5" y="1232.5" width="42.6" height="54" xlink:href="file:///app/main/resources/app.asar/drawio/src/main/webapp/img/lib/allied_telesis/computer_and_terminals/Server_Desktop.svg"/><g transform="translate(-0.5 -0.5)"><switch><foreignObject pointer-events="none" width="100%" height="100%" requiredFeatures="http://www.w3.org/TR/SVG11/feature#Extensibility" style="overflow: visible; text-align: left;"><div xmlns="http://www.w3.org/1999/xhtml" style="display: flex; align-items: unsafe flex-start; justify-content: unsafe center; width: 1px; height: 1px; padding-top: 1294px; margin-left: 1062px;"><div data-drawio-colors="color: rgb(0, 0, 0); " style="box-sizing: border-box; font-size: 0px; text-align: center;"><div style="display: inline-block; font-size: 12px; font-family: Helvetica; color: rgb(0, 0, 0); line-height: 1.2; pointer-events: all; white-space: nowrap;">1<br />ERP/CRM<br />Compta</div></div></div></foreignObject><text x="1062" y="1306" fill="rgb(0, 0, 0)" font-family="Helvetica" font-size="12px" text-anchor="middle">1...</text></switch></g><image x="770.5" y="1232.5" width="42.6" height="54" xlink:href="file:///app/main/resources/app.asar/drawio/src/main/webapp/img/lib/allied_telesis/computer_and_terminals/Server_Desktop.svg"/><g transform="translate(-0.5 -0.5)"><switch><foreignObject pointer-events="none" width="100%" height="100%" requiredFeatures="http://www.w3.org/TR/SVG11/feature#Extensibility" style="overflow: visible; text-align: left;"><div xmlns="http://www.w3.org/1999/xhtml" style="display: flex; align-items: unsafe flex-start; justify-content: unsafe center; width: 1px; height: 1px; padding-top: 1294px; margin-left: 792px;"><div data-drawio-colors="color: rgb(0, 0, 0); " style="box-sizing: border-box; font-size: 0px; text-align: center;"><div style="display: inline-block; font-size: 12px; font-family: Helvetica; color: rgb(0, 0, 0); line-height: 1.2; pointer-events: all; white-space: nowrap;">AD Primary</div></div></div></foreignObject><text x="792" y="1306" fill="rgb(0, 0, 0)" font-family="Helvetica" font-size="12px" text-anchor="middle">AD Prim...</text></switch></g><path d="M 70 755 L 141 755" fill="none" stroke="rgb(0, 0, 0)" stroke-miterlimit="10" pointer-events="stroke"/><path d="M 35.39 791 C 15.84 791 1.02 774.9 1.02 757.1 L 1 752.96 C 1 735.43 15.68 719 35.45 719 C 55.69 719 70 735.49 70 753.21 L 70 757.17 C 70 774.22 55.69 791 35.39 791 Z" fill="#f58534" stroke="none" pointer-events="all"/><path d="M 1 752.96 C 1 775.45 19.26 788.05 34.8 788.05 C 56.68 788.05 70 770.83 70 753.21 L 70 757.17 C 70 774.16 55.67 791 35.39 791 C 15.84 791 1.02 774.87 1.02 757.1 Z" fill-opacity="0.3" fill="#000000" stroke="none" pointer-events="all"/><rect x="1" y="719" width="0" height="0" fill="none" stroke="rgb(0, 0, 0)" pointer-events="all"/><path d="M 50.39 762.94 C 54.66 762.85 57.68 759.91 57.97 757.08 C 58.39 754.01 55.49 749.78 51.24 749.33 L 49.24 749.19 L 49.12 747.04 C 49 745.76 48.18 744.01 46.27 743.41 C 43.78 742.7 42.73 743.82 40.49 745.35 L 39.31 742.89 C 38.04 740.17 34.85 736.94 29.83 736.82 C 23.68 736.85 19.38 741.97 19.38 747.29 L 19.4 749.22 L 17.66 749.71 C 15.75 750.34 12.95 753.11 13.03 756.7 C 13.09 760.43 17.19 762.94 20.64 762.94 Z M 20.78 766.58 C 15.19 766.58 9.88 762.75 9.52 757.49 C 8.94 751.92 13.32 747.66 15.86 746.6 C 16.19 741.06 19.37 737.26 22.61 735.31 C 26.95 732.72 31.94 732.78 35.98 734.75 C 38.03 735.69 40.27 737.5 41.87 740.23 C 43.84 739.29 46.82 739.18 49.36 740.94 C 51.15 742.23 52.17 744.01 52.52 745.92 C 57.55 746.83 62.45 752.1 61.36 758.29 C 60.71 762.52 55.72 766.58 50.34 766.58 Z" fill="#ffffff" stroke="none" pointer-events="all"/><path d="M 221 755 L 241 755" fill="none" stroke="rgb(0, 0, 0)" stroke-miterlimit="10" pointer-events="stroke"/><image x="140.5" y="714.5" width="80" height="80" xlink:href="file:///app/main/resources/app.asar/drawio/src/main/webapp/img/lib/clip_art/networking/Firewall_02_128x128.png"/><g transform="translate(-0.5 -0.5)"><switch><foreignObject pointer-events="none" width="100%" height="100%" requiredFeatures="http://www.w3.org/TR/SVG11/feature#Extensibility" style="overflow: visible; text-align: left;"><div xmlns="http://www.w3.org/1999/xhtml" style="display: flex; align-items: unsafe flex-start; justify-content: unsafe center; width: 1px; height: 1px; padding-top: 802px; margin-left: 181px;"><div data-drawio-colors="color: rgb(0, 0, 0); background-color: rgb(255, 255, 255); " style="box-sizing: border-box; font-size: 0px; text-align: center;"><div style="display: inline-block; font-size: 12px; font-family: Helvetica; color: rgb(0, 0, 0); line-height: 1.2; pointer-events: all; background-color: rgb(255, 255, 255); white-space: nowrap;">193.68.98.1</div></div></div></foreignObject><text x="181" y="814" fill="rgb(0, 0, 0)" font-family="Helvetica" font-size="12px" text-anchor="middle">193.68.98.1</text></switch></g><path d="M 316.39 755.2 L 421 755.2 L 421 1260 L 525.4 1260" fill="none" stroke="rgb(0, 0, 0)" stroke-miterlimit="10" pointer-events="stroke"/><path d="M 316.39 755.2 L 421 755.2 L 421 1015 L 525.4 1015" fill="none" stroke="rgb(0, 0, 0)" stroke-miterlimit="10" pointer-events="stroke"/><path d="M 316.39 755.2 L 420.9 755.2 L 525.4 755.2" fill="none" stroke="rgb(0, 0, 0)" stroke-miterlimit="10" pointer-events="stroke"/><path d="M 316.39 755.2 L 421 755.2 L 421 596 L 525.4 596" fill="none" stroke="rgb(0, 0, 0)" stroke-miterlimit="10" pointer-events="stroke"/><image x="230.5" y="724.4" width="85.39" height="60.6" xlink:href="file:///app/main/resources/app.asar/drawio/src/main/webapp/img/lib/allied_telesis/security/Router_VPN.svg"/><path d="M 599.8 755.2 L 670.4 755.2 L 741 755" fill="none" stroke="rgb(0, 0, 0)" stroke-miterlimit="10" pointer-events="stroke"/><image x="524.9" y="729.2" width="74.4" height="51" xlink:href="file:///app/main/resources/app.asar/drawio/src/main/webapp/img/lib/allied_telesis/switch/Switch_24_port_L3.svg"/><path d="M 599.8 1015 L 741 1015" fill="none" stroke="rgb(0, 0, 0)" stroke-miterlimit="10" pointer-events="stroke"/><image x="524.9" y="989" width="74.4" height="51" xlink:href="file:///app/main/resources/app.asar/drawio/src/main/webapp/img/lib/allied_telesis/switch/Switch_24_port_L3.svg"/><path d="M 599.8 595.5 L 631 595.5 L 631 325 L 741 325" fill="none" stroke="rgb(0, 0, 0)" stroke-miterlimit="10" pointer-events="stroke"/><path d="M 562.6 570 L 562.6 130 L 741 130" fill="none" stroke="rgb(0, 0, 0)" stroke-miterlimit="10" pointer-events="stroke"/><path d="M 599.8 595.5 L 670 595.5 L 670 521 L 741 521" fill="none" stroke="rgb(0, 0, 0)" stroke-miterlimit="10" pointer-events="stroke"/><image x="524.9" y="569.5" width="74.4" height="51" xlink:href="file:///app/main/resources/app.asar/drawio/src/main/webapp/img/lib/allied_telesis/switch/Switch_24_port_L3.svg"/><rect x="20.5" y="890" width="30" height="50" fill="none" stroke="none" pointer-events="all"/><path d="M 20.5 940 L 20.5 890 L 35.89 890 L 35.89 940 Z M 37.86 906.35 L 39.7 906.35 L 39.7 901.22 L 41.91 901.22 L 41.91 896.24 L 43.46 896.24 L 43.46 891.56 L 44.81 891.56 L 44.81 896.24 L 46.4 896.24 L 46.4 901.22 L 48.72 901.22 L 48.72 906.35 L 50.45 906.35 L 50.5 940 L 37.86 940 Z M 27.01 893.92 L 22.86 893.92 L 22.86 898.25 L 27.01 898.25 Z M 28.99 898.25 L 33.18 898.25 L 33.18 893.92 L 28.99 893.92 Z M 27.01 900.36 L 22.86 900.36 L 22.86 904.79 L 27.01 904.79 Z M 28.99 904.79 L 33.18 904.79 L 33.18 900.36 L 28.99 900.36 Z M 27.01 906.9 L 22.86 906.9 L 22.86 911.08 L 27.01 911.08 Z M 28.99 911.08 L 33.18 911.08 L 33.18 906.9 L 28.99 906.9 Z M 27.01 913.34 L 22.86 913.34 L 22.86 917.67 L 27.01 917.67 Z M 28.99 917.67 L 33.18 917.67 L 33.18 913.34 L 28.99 913.34 Z M 27.01 919.83 L 22.86 919.83 L 22.86 924.1 L 27.01 924.1 Z M 28.99 924.1 L 33.18 924.1 L 33.18 919.83 L 28.99 919.83 Z M 27.01 926.27 L 22.86 926.27 L 22.86 930.54 L 27.01 930.54 Z M 28.99 930.54 L 33.18 930.54 L 33.18 926.27 L 28.99 926.27 Z M 44.09 913.44 L 44.09 909.06 L 39.89 909.06 L 39.89 913.44 Z M 44.71 915.6 L 44.71 919.98 L 48.91 919.98 L 48.91 915.6 Z M 44.09 922.29 L 39.89 922.29 L 39.89 926.62 L 44.09 926.62 Z" fill="#00bef2" stroke="none" pointer-events="all"/><g transform="translate(-0.5 -0.5)"><switch><foreignObject pointer-events="none" width="100%" height="100%" requiredFeatures="http://www.w3.org/TR/SVG11/feature#Extensibility" style="overflow: visible; text-align: left;"><div xmlns="http://www.w3.org/1999/xhtml" style="display: flex; align-items: unsafe flex-start; justify-content: unsafe center; width: 1px; height: 1px; padding-top: 947px; margin-left: 36px;"><div data-drawio-colors="color: rgb(0, 0, 0); " style="box-sizing: border-box; font-size: 0px; text-align: center;"><div style="display: inline-block; font-size: 12px; font-family: Helvetica; color: rgb(0, 0, 0); line-height: 1.2; pointer-events: all; white-space: nowrap;">Modelis 2000</div></div></div></foreignObject><text x="36" y="959" fill="rgb(0, 0, 0)" font-family="Helvetica" font-size="12px" text-anchor="middle">Model...</text></switch></g><path d="M 35.5 791 L 35.5 890" fill="none" stroke="rgb(0, 0, 0)" stroke-miterlimit="10" pointer-events="stroke"/><path d="M 599.8 1260 L 741 1260" fill="none" stroke="rgb(0, 0, 0)" stroke-miterlimit="10" pointer-events="stroke"/><image x="524.9" y="1234" width="74.4" height="51" xlink:href="file:///app/main/resources/app.asar/drawio/src/main/webapp/img/lib/allied_telesis/switch/Switch_24_port_L3.svg"/></g><switch><g requiredFeatures="http://www.w3.org/TR/SVG11/feature#Extensibility"/><a transform="translate(0,-5)" xlink:href="https://www.drawio.com/doc/faq/svg-export-text-problems" target="_blank"><text text-anchor="middle" font-size="10px" x="50%" y="100%">Text is not SVG - cannot display</text></a></switch></svg>