{
  "directory_name": ".",
  "tex": "lualatex",
  "texflags": "",
  "bib": "bibtex",
  "bibflags": "",
  "filename": "hw5",
  "shell": "bash",
  "use_bib": [
    "true",
    "false"
  ],
  "student_name": "",
	"class_name": "CS 6515",
	"algorithm2e_options": "linesnumbered,ruled,vlined"
}
