<?xml version="1.0" encoding="utf-8"?>
<!DOCTYPE eagle SYSTEM "eagle.dtd">
<eagle version="9.1.3">
<drawing>
<settings>
<setting alwaysvectorfont="no"/>
<setting verticaltext="up"/>
</settings>
<grid distance="1" unitdist="mm" unit="mm" style="lines" multiple="1" display="yes" altdistance="5" altunitdist="mil" altunit="mil"/>
<layers>
<layer number="1" name="Top" color="4" fill="1" visible="yes" active="yes"/>
<layer number="2" name="Route2" color="16" fill="1" visible="no" active="yes"/>
<layer number="3" name="Route3" color="17" fill="1" visible="no" active="yes"/>
<layer number="4" name="Route4" color="18" fill="1" visible="no" active="yes"/>
<layer number="5" name="Route5" color="19" fill="1" visible="no" active="yes"/>
<layer number="6" name="Route6" color="25" fill="1" visible="no" active="yes"/>
<layer number="7" name="Route7" color="26" fill="1" visible="no" active="yes"/>
<layer number="8" name="Route8" color="27" fill="1" visible="no" active="yes"/>
<layer number="9" name="Route9" color="28" fill="1" visible="no" active="yes"/>
<layer number="10" name="Route10" color="29" fill="1" visible="no" active="yes"/>
<layer number="11" name="Route11" color="30" fill="1" visible="no" active="yes"/>
<layer number="12" name="Route12" color="20" fill="1" visible="no" active="yes"/>
<layer number="13" name="Route13" color="21" fill="1" visible="no" active="yes"/>
<layer number="14" name="Route14" color="22" fill="1" visible="no" active="yes"/>
<layer number="15" name="Route15" color="23" fill="1" visible="no" active="yes"/>
<layer number="16" name="Bottom" color="1" fill="1" visible="yes" active="yes"/>
<layer number="17" name="Pads" color="2" fill="1" visible="yes" active="yes"/>
<layer number="18" name="Vias" color="2" fill="1" visible="yes" active="yes"/>
<layer number="19" name="Unrouted" color="6" fill="1" visible="yes" active="yes"/>
<layer number="20" name="Dimension" color="24" fill="1" visible="yes" active="yes"/>
<layer number="21" name="tPlace" color="7" fill="1" visible="yes" active="yes"/>
<layer number="22" name="bPlace" color="7" fill="1" visible="yes" active="yes"/>
<layer number="23" name="tOrigins" color="15" fill="1" visible="yes" active="yes"/>
<layer number="24" name="bOrigins" color="15" fill="1" visible="yes" active="yes"/>
<layer number="25" name="tNames" color="7" fill="1" visible="yes" active="yes"/>
<layer number="26" name="bNames" color="7" fill="1" visible="yes" active="yes"/>
<layer number="27" name="tValues" color="7" fill="1" visible="yes" active="yes"/>
<layer number="28" name="bValues" color="7" fill="1" visible="yes" active="yes"/>
<layer number="29" name="tStop" color="7" fill="3" visible="yes" active="yes"/>
<layer number="30" name="bStop" color="7" fill="6" visible="yes" active="yes"/>
<layer number="31" name="tCream" color="7" fill="4" visible="yes" active="yes"/>
<layer number="32" name="bCream" color="7" fill="5" visible="yes" active="yes"/>
<layer number="33" name="tFinish" color="6" fill="3" visible="yes" active="yes"/>
<layer number="34" name="bFinish" color="6" fill="6" visible="yes" active="yes"/>
<layer number="35" name="tGlue" color="7" fill="4" visible="yes" active="yes"/>
<layer number="36" name="bGlue" color="7" fill="5" visible="yes" active="yes"/>
<layer number="37" name="tTest" color="7" fill="1" visible="yes" active="yes"/>
<layer number="38" name="bTest" color="7" fill="1" visible="yes" active="yes"/>
<layer number="39" name="tKeepout" color="4" fill="11" visible="yes" active="yes"/>
<layer number="40" name="bKeepout" color="1" fill="11" visible="yes" active="yes"/>
<layer number="41" name="tRestrict" color="4" fill="10" visible="yes" active="yes"/>
<layer number="42" name="bRestrict" color="1" fill="10" visible="yes" active="yes"/>
<layer number="43" name="vRestrict" color="2" fill="10" visible="yes" active="yes"/>
<layer number="44" name="Drills" color="7" fill="1" visible="yes" active="yes"/>
<layer number="45" name="Holes" color="7" fill="1" visible="yes" active="yes"/>
<layer number="46" name="Milling" color="3" fill="1" visible="yes" active="yes"/>
<layer number="47" name="Measures" color="7" fill="1" visible="yes" active="yes"/>
<layer number="48" name="Document" color="7" fill="1" visible="yes" active="yes"/>
<layer number="49" name="Reference" color="7" fill="1" visible="yes" active="yes"/>
<layer number="51" name="tDocu" color="7" fill="1" visible="yes" active="yes"/>
<layer number="52" name="bDocu" color="7" fill="1" visible="yes" active="yes"/>
<layer number="88" name="SimResults" color="9" fill="1" visible="yes" active="yes"/>
<layer number="89" name="SimProbes" color="9" fill="1" visible="yes" active="yes"/>
<layer number="90" name="Modules" color="5" fill="1" visible="yes" active="yes"/>
<layer number="91" name="Nets" color="2" fill="1" visible="yes" active="yes"/>
<layer number="92" name="Busses" color="1" fill="1" visible="yes" active="yes"/>
<layer number="93" name="Pins" color="2" fill="1" visible="no" active="yes"/>
<layer number="94" name="Symbols" color="4" fill="1" visible="yes" active="yes"/>
<layer number="95" name="Names" color="7" fill="1" visible="yes" active="yes"/>
<layer number="96" name="Values" color="7" fill="1" visible="yes" active="yes"/>
<layer number="97" name="Info" color="7" fill="1" visible="yes" active="yes"/>
<layer number="98" name="Guide" color="6" fill="1" visible="yes" active="yes"/>
</layers>
<library>
<packages>
<package name="ZL266-32DG">
<description>&lt;b&gt;Milli-Grid™ Header, Surface Mount, Vertical, Shrouded, Lead-Free, 32 Circuits, 0.76µm Gold (Au) Plating, with Locking Windows and Center Polarization Slot, PCB Locator, Tube&lt;/b&gt;&lt;p&gt;&lt;a href =http://www.molex.com/pdm_docs/sd/878323221_sd.pdf&gt;Datasheet &lt;/a&gt;</description>
<wire x1="17.4" y1="3.75" x2="17.4" y2="-3.75" width="0.2032" layer="21"/>
<wire x1="17.4" y1="-3.75" x2="-17.4" y2="-3.75" width="0.2032" layer="21"/>
<wire x1="-17.4" y1="-3.75" x2="-17.4" y2="3.75" width="0.2032" layer="21"/>
<wire x1="-17.4" y1="3.75" x2="17.4" y2="3.75" width="0.2032" layer="21"/>
<wire x1="1" y1="-3.75" x2="1" y2="-3.25" width="0.0508" layer="51"/>
<wire x1="1" y1="-3.25" x2="1" y2="-3" width="0.0508" layer="51"/>
<wire x1="1" y1="-3" x2="2.75" y2="-3" width="0.0508" layer="51"/>
<wire x1="2.75" y1="-3" x2="2.75" y2="-2.75" width="0.0508" layer="51"/>
<wire x1="2.75" y1="-2.75" x2="3.25" y2="-2.75" width="0.0508" layer="51"/>
<wire x1="3.25" y1="-2.75" x2="3.25" y2="-3" width="0.0508" layer="51"/>
<wire x1="3.25" y1="-3" x2="16.5" y2="-3" width="0.0508" layer="51"/>
<wire x1="16.5" y1="-3" x2="16.5" y2="1" width="0.0508" layer="51"/>
<wire x1="16.5" y1="1" x2="16.5" y2="1.75" width="0.0508" layer="51"/>
<wire x1="16.5" y1="1.75" x2="16.5" y2="3" width="0.0508" layer="51"/>
<wire x1="16.5" y1="3" x2="15.25" y2="3" width="0.0508" layer="51"/>
<wire x1="15.25" y1="3" x2="15.25" y2="2.75" width="0.0508" layer="51"/>
<wire x1="15.25" y1="2.75" x2="14.75" y2="2.75" width="0.0508" layer="51"/>
<wire x1="14.75" y1="2.75" x2="14.75" y2="3" width="0.0508" layer="51"/>
<wire x1="14.75" y1="3" x2="13.25" y2="3" width="0.0508" layer="51"/>
<wire x1="13.25" y1="3" x2="13.25" y2="2.75" width="0.0508" layer="51"/>
<wire x1="13.25" y1="2.75" x2="12.75" y2="2.75" width="0.0508" layer="51"/>
<wire x1="12.75" y1="2.75" x2="12.75" y2="3" width="0.0508" layer="51"/>
<wire x1="12.75" y1="3" x2="11.25" y2="3" width="0.0508" layer="51"/>
<wire x1="11.25" y1="3" x2="11.25" y2="2.75" width="0.0508" layer="51"/>
<wire x1="11.25" y1="2.75" x2="10.75" y2="2.75" width="0.0508" layer="51"/>
<wire x1="10.75" y1="2.75" x2="10.75" y2="3" width="0.0508" layer="51"/>
<wire x1="10.75" y1="3" x2="9.25" y2="3" width="0.0508" layer="51"/>
<wire x1="9.25" y1="3" x2="9.25" y2="2.75" width="0.0508" layer="51"/>
<wire x1="9.25" y1="2.75" x2="8.75" y2="2.75" width="0.0508" layer="51"/>
<wire x1="8.75" y1="2.75" x2="8.75" y2="3" width="0.0508" layer="51"/>
<wire x1="8.75" y1="3" x2="7.25" y2="3" width="0.0508" layer="51"/>
<wire x1="7.25" y1="3" x2="7.25" y2="2.75" width="0.0508" layer="51"/>
<wire x1="7.25" y1="2.75" x2="6.75" y2="2.75" width="0.0508" layer="51"/>
<wire x1="6.75" y1="2.75" x2="6.75" y2="3" width="0.0508" layer="51"/>
<wire x1="6.75" y1="3" x2="5.25" y2="3" width="0.0508" layer="51"/>
<wire x1="5.25" y1="3" x2="5.25" y2="2.75" width="0.0508" layer="51"/>
<wire x1="5.25" y1="2.75" x2="4.75" y2="2.75" width="0.0508" layer="51"/>
<wire x1="4.75" y1="2.75" x2="4.75" y2="3" width="0.0508" layer="51"/>
<wire x1="4.75" y1="3" x2="3.25" y2="3" width="0.0508" layer="51"/>
<wire x1="3.25" y1="3" x2="3.25" y2="2.75" width="0.0508" layer="51"/>
<wire x1="3.25" y1="2.75" x2="2.75" y2="2.75" width="0.0508" layer="51"/>
<wire x1="2.75" y1="2.75" x2="2.75" y2="3" width="0.0508" layer="51"/>
<wire x1="2.75" y1="3" x2="1.25" y2="3" width="0.0508" layer="51"/>
<wire x1="1.25" y1="3" x2="1.25" y2="2.75" width="0.0508" layer="51"/>
<wire x1="1.25" y1="2.75" x2="0.75" y2="2.75" width="0.0508" layer="51"/>
<wire x1="0.75" y1="2.75" x2="0.75" y2="3" width="0.0508" layer="51"/>
<wire x1="0.75" y1="3" x2="-0.75" y2="3" width="0.0508" layer="51"/>
<wire x1="-0.75" y1="3" x2="-0.75" y2="2.75" width="0.0508" layer="51"/>
<wire x1="-0.75" y1="2.75" x2="-1.25" y2="2.75" width="0.0508" layer="51"/>
<wire x1="-1.25" y1="2.75" x2="-1.25" y2="3" width="0.0508" layer="51"/>
<wire x1="-1.25" y1="3" x2="-2.75" y2="3" width="0.0508" layer="51"/>
<wire x1="-2.75" y1="3" x2="-2.75" y2="2.75" width="0.0508" layer="51"/>
<wire x1="-2.75" y1="2.75" x2="-3.25" y2="2.75" width="0.0508" layer="51"/>
<wire x1="-3.25" y1="2.75" x2="-3.25" y2="3" width="0.0508" layer="51"/>
<wire x1="-3.25" y1="3" x2="-4.75" y2="3" width="0.0508" layer="51"/>
<wire x1="-4.75" y1="3" x2="-4.75" y2="2.75" width="0.0508" layer="51"/>
<wire x1="-4.75" y1="2.75" x2="-5.25" y2="2.75" width="0.0508" layer="51"/>
<wire x1="-5.25" y1="2.75" x2="-5.25" y2="3" width="0.0508" layer="51"/>
<wire x1="-5.25" y1="3" x2="-6.75" y2="3" width="0.0508" layer="51"/>
<wire x1="-6.75" y1="3" x2="-6.75" y2="2.75" width="0.0508" layer="51"/>
<wire x1="-6.75" y1="2.75" x2="-7.25" y2="2.75" width="0.0508" layer="51"/>
<wire x1="-7.25" y1="2.75" x2="-7.25" y2="3" width="0.0508" layer="51"/>
<wire x1="-7.25" y1="3" x2="-8.75" y2="3" width="0.0508" layer="51"/>
<wire x1="-8.75" y1="3" x2="-8.75" y2="2.75" width="0.0508" layer="51"/>
<wire x1="-8.75" y1="2.75" x2="-9.25" y2="2.75" width="0.0508" layer="51"/>
<wire x1="-9.25" y1="2.75" x2="-9.25" y2="3" width="0.0508" layer="51"/>
<wire x1="-9.25" y1="3" x2="-10.75" y2="3" width="0.0508" layer="51"/>
<wire x1="-10.75" y1="3" x2="-10.75" y2="2.75" width="0.0508" layer="51"/>
<wire x1="-10.75" y1="2.75" x2="-11.25" y2="2.75" width="0.0508" layer="51"/>
<wire x1="-11.25" y1="2.75" x2="-11.25" y2="3" width="0.0508" layer="51"/>
<wire x1="-11.25" y1="3" x2="-12.75" y2="3" width="0.0508" layer="51"/>
<wire x1="-12.75" y1="3" x2="-12.75" y2="2.75" width="0.0508" layer="51"/>
<wire x1="-12.75" y1="2.75" x2="-13.25" y2="2.75" width="0.0508" layer="51"/>
<wire x1="-13.25" y1="2.75" x2="-13.25" y2="3" width="0.0508" layer="51"/>
<wire x1="-13.25" y1="3" x2="-14.75" y2="3" width="0.0508" layer="51"/>
<wire x1="-14.75" y1="3" x2="-14.75" y2="2.75" width="0.0508" layer="51"/>
<wire x1="-14.75" y1="2.75" x2="-15.25" y2="2.75" width="0.0508" layer="51"/>
<wire x1="-15.25" y1="2.75" x2="-15.25" y2="3" width="0.0508" layer="51"/>
<wire x1="-15.25" y1="3" x2="-16.5" y2="3" width="0.0508" layer="51"/>
<wire x1="-16.5" y1="3" x2="-16.5" y2="-0.75" width="0.0508" layer="51"/>
<wire x1="-16.5" y1="-0.75" x2="-16.5" y2="-1.75" width="0.0508" layer="51"/>
<wire x1="-16.5" y1="-1.75" x2="-16.5" y2="-3" width="0.0508" layer="51"/>
<wire x1="-16.5" y1="-3" x2="-3.25" y2="-3" width="0.0508" layer="51"/>
<wire x1="-3.25" y1="-3" x2="-3.25" y2="-2.75" width="0.0508" layer="51"/>
<wire x1="-3.25" y1="-2.75" x2="-2.75" y2="-2.75" width="0.0508" layer="51"/>
<wire x1="-2.75" y1="-2.75" x2="-2.75" y2="-3" width="0.0508" layer="51"/>
<wire x1="-2.75" y1="-3" x2="-1" y2="-3" width="0.0508" layer="51"/>
<wire x1="-1" y1="-3" x2="-1" y2="-3.25" width="0.0508" layer="51"/>
<wire x1="-1" y1="-3.25" x2="-1" y2="-3.75" width="0.0508" layer="51"/>
<wire x1="-16.5" y1="-0.75" x2="-17" y2="-0.75" width="0.0508" layer="51"/>
<wire x1="-17" y1="-0.75" x2="-17.25" y2="-0.75" width="0.0508" layer="51"/>
<wire x1="-16.5" y1="-1.75" x2="-17" y2="-1.75" width="0.0508" layer="51"/>
<wire x1="-17" y1="-1.75" x2="-17.25" y2="-1.75" width="0.0508" layer="51"/>
<wire x1="16.5" y1="1.75" x2="17" y2="1.75" width="0.0508" layer="51"/>
<wire x1="17" y1="1.75" x2="17.25" y2="1.75" width="0.0508" layer="51"/>
<wire x1="16.5" y1="1" x2="17" y2="1" width="0.0508" layer="51"/>
<wire x1="17" y1="1" x2="17.25" y2="1" width="0.0508" layer="51"/>
<wire x1="-17" y1="-0.75" x2="-17" y2="3.25" width="0.0508" layer="51"/>
<wire x1="-17" y1="3.25" x2="17" y2="3.25" width="0.0508" layer="51"/>
<wire x1="17" y1="3.25" x2="17" y2="1.75" width="0.0508" layer="51"/>
<wire x1="17" y1="1" x2="17" y2="-3.25" width="0.0508" layer="51"/>
<wire x1="17" y1="-3.25" x2="1" y2="-3.25" width="0.0508" layer="51"/>
<wire x1="-1" y1="-3.25" x2="-17" y2="-3.25" width="0.0508" layer="51"/>
<wire x1="-17" y1="-3.25" x2="-17" y2="-1.75" width="0.0508" layer="51"/>
<smd name="2" x="-15" y="2.15" dx="1" dy="2.75" layer="1"/>
<smd name="4" x="-13" y="2.15" dx="1" dy="2.75" layer="1"/>
<smd name="1" x="-15" y="-2.15" dx="1" dy="2.75" layer="1"/>
<smd name="3" x="-13" y="-2.15" dx="1" dy="2.75" layer="1"/>
<smd name="5" x="-11" y="-2.15" dx="1" dy="2.75" layer="1"/>
<smd name="6" x="-11" y="2.15" dx="1" dy="2.75" layer="1"/>
<smd name="7" x="-9" y="-2.15" dx="1" dy="2.75" layer="1"/>
<smd name="8" x="-9" y="2.15" dx="1" dy="2.75" layer="1"/>
<smd name="9" x="-7" y="-2.15" dx="1" dy="2.75" layer="1" rot="R180"/>
<smd name="10" x="-7" y="2.15" dx="1" dy="2.75" layer="1" rot="R180"/>
<smd name="11" x="-5" y="-2.15" dx="1" dy="2.75" layer="1"/>
<smd name="12" x="-5" y="2.15" dx="1" dy="2.75" layer="1"/>
<smd name="13" x="-3" y="-2.15" dx="1" dy="2.75" layer="1"/>
<smd name="14" x="-3" y="2.15" dx="1" dy="2.75" layer="1"/>
<smd name="15" x="-1" y="-2.15" dx="1" dy="2.75" layer="1" rot="R180"/>
<smd name="16" x="-1" y="2.15" dx="1" dy="2.75" layer="1"/>
<smd name="17" x="1" y="-2.15" dx="1" dy="2.75" layer="1" rot="R180"/>
<smd name="18" x="1" y="2.15" dx="1" dy="2.75" layer="1"/>
<smd name="19" x="3" y="-2.15" dx="1" dy="2.75" layer="1" rot="R180"/>
<smd name="20" x="3" y="2.15" dx="1" dy="2.75" layer="1"/>
<smd name="21" x="5" y="-2.15" dx="1" dy="2.75" layer="1" rot="R180"/>
<smd name="22" x="5" y="2.15" dx="1" dy="2.75" layer="1"/>
<smd name="23" x="7" y="-2.15" dx="1" dy="2.75" layer="1" rot="R180"/>
<smd name="24" x="7" y="2.15" dx="1" dy="2.75" layer="1"/>
<smd name="25" x="9" y="-2.15" dx="1" dy="2.75" layer="1" rot="R180"/>
<smd name="26" x="9" y="2.15" dx="1" dy="2.75" layer="1"/>
<smd name="27" x="11" y="-2.15" dx="1" dy="2.75" layer="1" rot="R180"/>
<smd name="28" x="11" y="2.15" dx="1" dy="2.75" layer="1"/>
<smd name="29" x="13" y="-2.15" dx="1" dy="2.75" layer="1" rot="R180"/>
<smd name="30" x="13" y="2.15" dx="1" dy="2.75" layer="1"/>
<smd name="31" x="15" y="-2.15" dx="1" dy="2.75" layer="1" rot="R180"/>
<smd name="32" x="15" y="2.15" dx="1" dy="2.75" layer="1"/>
<text x="-18.0325" y="-3.4925" size="1.016" layer="25" ratio="10" rot="R90">&gt;NAME</text>
<text x="18.985" y="-3.4925" size="0.8128" layer="27" ratio="10" rot="R90">&gt;VALUE</text>
<text x="-16.25" y="-2.75" size="0.6096" layer="51" ratio="10">1</text>
<rectangle x1="-15.5" y1="0.5" x2="-14.5" y2="1.5" layer="51"/>
<rectangle x1="-13.5" y1="0.5" x2="-12.5" y2="1.5" layer="51"/>
<rectangle x1="-11.5" y1="0.5" x2="-10.5" y2="1.5" layer="51"/>
<rectangle x1="-9.5" y1="0.5" x2="-8.5" y2="1.5" layer="51"/>
<rectangle x1="-15.5" y1="-1.5" x2="-14.5" y2="-0.5" layer="51"/>
<rectangle x1="-13.5" y1="-1.5" x2="-12.5" y2="-0.5" layer="51"/>
<rectangle x1="-11.5" y1="-1.5" x2="-10.5" y2="-0.5" layer="51"/>
<rectangle x1="-9.5" y1="-1.5" x2="-8.5" y2="-0.5" layer="51"/>
<rectangle x1="-7.5" y1="0.5" x2="-6.5" y2="1.5" layer="51"/>
<rectangle x1="-7.5" y1="-1.5" x2="-6.5" y2="-0.5" layer="51"/>
<rectangle x1="-5.5" y1="0.5" x2="-4.5" y2="1.5" layer="51"/>
<rectangle x1="-5.5" y1="-1.5" x2="-4.5" y2="-0.5" layer="51"/>
<rectangle x1="-3.5" y1="0.5" x2="-2.5" y2="1.5" layer="51"/>
<rectangle x1="-3.5" y1="-1.5" x2="-2.5" y2="-0.5" layer="51"/>
<rectangle x1="-1.5" y1="0.5" x2="-0.5" y2="1.5" layer="51"/>
<rectangle x1="-1.5" y1="-1.5" x2="-0.5" y2="-0.5" layer="51"/>
<rectangle x1="0.5" y1="0.5" x2="1.5" y2="1.5" layer="51"/>
<rectangle x1="0.5" y1="-1.5" x2="1.5" y2="-0.5" layer="51"/>
<rectangle x1="2.5" y1="0.5" x2="3.5" y2="1.5" layer="51"/>
<rectangle x1="2.5" y1="-1.5" x2="3.5" y2="-0.5" layer="51"/>
<rectangle x1="4.5" y1="0.5" x2="5.5" y2="1.5" layer="51"/>
<rectangle x1="4.5" y1="-1.5" x2="5.5" y2="-0.5" layer="51"/>
<rectangle x1="6.5" y1="0.5" x2="7.5" y2="1.5" layer="51"/>
<rectangle x1="6.5" y1="-1.5" x2="7.5" y2="-0.5" layer="51"/>
<rectangle x1="8.5" y1="0.5" x2="9.5" y2="1.5" layer="51"/>
<rectangle x1="8.5" y1="-1.5" x2="9.5" y2="-0.5" layer="51"/>
<rectangle x1="10.5" y1="0.5" x2="11.5" y2="1.5" layer="51"/>
<rectangle x1="10.5" y1="-1.5" x2="11.5" y2="-0.5" layer="51"/>
<rectangle x1="12.5" y1="0.5" x2="13.5" y2="1.5" layer="51"/>
<rectangle x1="12.5" y1="-1.5" x2="13.5" y2="-0.5" layer="51"/>
<rectangle x1="14.5" y1="0.5" x2="15.5" y2="1.5" layer="51"/>
<rectangle x1="14.5" y1="-1.5" x2="15.5" y2="-0.5" layer="51"/>
</package>
</packages>
<symbols>
<symbol name="CON-2X16">
<wire x1="4.445" y1="19.05" x2="-1.905" y2="19.05" width="0.254" layer="94"/>
<wire x1="-1.905" y1="-21.59" x2="-1.905" y2="19.05" width="0.254" layer="94"/>
<wire x1="-1.905" y1="-21.59" x2="4.445" y2="-21.59" width="0.254" layer="94"/>
<wire x1="4.445" y1="19.05" x2="4.445" y2="-21.59" width="0.254" layer="94"/>
<wire x1="-2.54" y1="17.78" x2="-0.635" y2="17.78" width="0.1524" layer="94"/>
<wire x1="-2.54" y1="15.24" x2="-0.635" y2="15.24" width="0.1524" layer="94"/>
<wire x1="5.08" y1="17.78" x2="3.175" y2="17.78" width="0.1524" layer="94"/>
<wire x1="5.08" y1="15.24" x2="3.175" y2="15.24" width="0.1524" layer="94"/>
<wire x1="-2.54" y1="12.7" x2="-0.635" y2="12.7" width="0.1524" layer="94"/>
<wire x1="5.08" y1="12.7" x2="3.175" y2="12.7" width="0.1524" layer="94"/>
<wire x1="-2.54" y1="10.16" x2="-0.635" y2="10.16" width="0.1524" layer="94"/>
<wire x1="5.08" y1="10.16" x2="3.175" y2="10.16" width="0.1524" layer="94"/>
<wire x1="-2.54" y1="7.62" x2="-0.635" y2="7.62" width="0.1524" layer="94"/>
<wire x1="5.08" y1="7.62" x2="3.175" y2="7.62" width="0.1524" layer="94"/>
<wire x1="-2.54" y1="5.08" x2="-0.635" y2="5.08" width="0.1524" layer="94"/>
<wire x1="-2.54" y1="2.54" x2="-0.635" y2="2.54" width="0.1524" layer="94"/>
<wire x1="5.08" y1="5.08" x2="3.175" y2="5.08" width="0.1524" layer="94"/>
<wire x1="5.08" y1="2.54" x2="3.175" y2="2.54" width="0.1524" layer="94"/>
<wire x1="-2.54" y1="0" x2="-0.635" y2="0" width="0.1524" layer="94"/>
<wire x1="5.08" y1="0" x2="3.175" y2="0" width="0.1524" layer="94"/>
<wire x1="-2.54" y1="-2.54" x2="-0.635" y2="-2.54" width="0.1524" layer="94"/>
<wire x1="5.08" y1="-2.54" x2="3.175" y2="-2.54" width="0.1524" layer="94"/>
<wire x1="-2.54" y1="-5.08" x2="-0.635" y2="-5.08" width="0.1524" layer="94"/>
<wire x1="5.08" y1="-5.08" x2="3.175" y2="-5.08" width="0.1524" layer="94"/>
<wire x1="-2.54" y1="-7.62" x2="-0.635" y2="-7.62" width="0.1524" layer="94"/>
<wire x1="-2.54" y1="-10.16" x2="-0.635" y2="-10.16" width="0.1524" layer="94"/>
<wire x1="5.08" y1="-7.62" x2="3.175" y2="-7.62" width="0.1524" layer="94"/>
<wire x1="5.08" y1="-10.16" x2="3.175" y2="-10.16" width="0.1524" layer="94"/>
<wire x1="-2.54" y1="-12.7" x2="-0.635" y2="-12.7" width="0.1524" layer="94"/>
<wire x1="5.08" y1="-12.7" x2="3.175" y2="-12.7" width="0.1524" layer="94"/>
<wire x1="-2.54" y1="-15.24" x2="-0.635" y2="-15.24" width="0.1524" layer="94"/>
<wire x1="5.08" y1="-15.24" x2="3.175" y2="-15.24" width="0.1524" layer="94"/>
<wire x1="-2.54" y1="-17.78" x2="-0.635" y2="-17.78" width="0.1524" layer="94"/>
<wire x1="5.08" y1="-17.78" x2="3.175" y2="-17.78" width="0.1524" layer="94"/>
<wire x1="-2.54" y1="-20.32" x2="-0.635" y2="-20.32" width="0.1524" layer="94"/>
<wire x1="5.08" y1="-20.32" x2="3.175" y2="-20.32" width="0.1524" layer="94"/>
<wire x1="-0.635" y1="17.78" x2="0.635" y2="17.78" width="0.4064" layer="94"/>
<wire x1="-0.635" y1="15.24" x2="0.635" y2="15.24" width="0.4064" layer="94"/>
<wire x1="-0.635" y1="12.7" x2="0.635" y2="12.7" width="0.4064" layer="94"/>
<wire x1="-0.635" y1="10.16" x2="0.635" y2="10.16" width="0.4064" layer="94"/>
<wire x1="-0.635" y1="7.62" x2="0.635" y2="7.62" width="0.4064" layer="94"/>
<wire x1="-0.635" y1="5.08" x2="0.635" y2="5.08" width="0.4064" layer="94"/>
<wire x1="-0.635" y1="2.54" x2="0.635" y2="2.54" width="0.4064" layer="94"/>
<wire x1="-0.635" y1="0" x2="0.635" y2="0" width="0.4064" layer="94"/>
<wire x1="-0.635" y1="-2.54" x2="0.635" y2="-2.54" width="0.4064" layer="94"/>
<wire x1="-0.635" y1="-5.08" x2="0.635" y2="-5.08" width="0.4064" layer="94"/>
<wire x1="1.905" y1="17.78" x2="3.175" y2="17.78" width="0.4064" layer="94"/>
<wire x1="1.905" y1="15.24" x2="3.175" y2="15.24" width="0.4064" layer="94"/>
<wire x1="1.905" y1="12.7" x2="3.175" y2="12.7" width="0.4064" layer="94"/>
<wire x1="1.905" y1="10.16" x2="3.175" y2="10.16" width="0.4064" layer="94"/>
<wire x1="1.905" y1="7.62" x2="3.175" y2="7.62" width="0.4064" layer="94"/>
<wire x1="1.905" y1="5.08" x2="3.175" y2="5.08" width="0.4064" layer="94"/>
<wire x1="1.905" y1="2.54" x2="3.175" y2="2.54" width="0.4064" layer="94"/>
<wire x1="1.905" y1="0" x2="3.175" y2="0" width="0.4064" layer="94"/>
<wire x1="1.905" y1="-2.54" x2="3.175" y2="-2.54" width="0.4064" layer="94"/>
<wire x1="1.905" y1="-5.08" x2="3.175" y2="-5.08" width="0.4064" layer="94"/>
<wire x1="-0.635" y1="-7.62" x2="0.635" y2="-7.62" width="0.4064" layer="94"/>
<wire x1="-0.635" y1="-10.16" x2="0.635" y2="-10.16" width="0.4064" layer="94"/>
<wire x1="-0.635" y1="-12.7" x2="0.635" y2="-12.7" width="0.4064" layer="94"/>
<wire x1="1.905" y1="-7.62" x2="3.175" y2="-7.62" width="0.4064" layer="94"/>
<wire x1="1.905" y1="-10.16" x2="3.175" y2="-10.16" width="0.4064" layer="94"/>
<wire x1="1.905" y1="-12.7" x2="3.175" y2="-12.7" width="0.4064" layer="94"/>
<wire x1="-0.635" y1="-15.24" x2="0.635" y2="-15.24" width="0.4064" layer="94"/>
<wire x1="-0.635" y1="-17.78" x2="0.635" y2="-17.78" width="0.4064" layer="94"/>
<wire x1="-0.635" y1="-20.32" x2="0.635" y2="-20.32" width="0.4064" layer="94"/>
<wire x1="1.905" y1="-15.24" x2="3.175" y2="-15.24" width="0.4064" layer="94"/>
<wire x1="1.905" y1="-17.78" x2="3.175" y2="-17.78" width="0.4064" layer="94"/>
<wire x1="1.905" y1="-20.32" x2="3.175" y2="-20.32" width="0.4064" layer="94"/>
<text x="-1.905" y="20.32" size="1.778" layer="95">&gt;NAME</text>
<text x="-1.905" y="-24.4475" size="1.778" layer="96">&gt;VALUE</text>
<pin name="1" x="-5.08" y="17.78" visible="pad" length="short" direction="pas"/>
<pin name="2" x="7.62" y="17.78" visible="pad" length="short" direction="pas" rot="R180"/>
<pin name="3" x="-5.08" y="15.24" visible="pad" length="short" direction="pas"/>
<pin name="4" x="7.62" y="15.24" visible="pad" length="short" direction="pas" rot="R180"/>
<pin name="5" x="-5.08" y="12.7" visible="pad" length="short" direction="pas"/>
<pin name="6" x="7.62" y="12.7" visible="pad" length="short" direction="pas" rot="R180"/>
<pin name="7" x="-5.08" y="10.16" visible="pad" length="short" direction="pas"/>
<pin name="8" x="7.62" y="10.16" visible="pad" length="short" direction="pas" rot="R180"/>
<pin name="9" x="-5.08" y="7.62" visible="pad" length="short" direction="pas"/>
<pin name="10" x="7.62" y="7.62" visible="pad" length="short" direction="pas" rot="R180"/>
<pin name="11" x="-5.08" y="5.08" visible="pad" length="short" direction="pas"/>
<pin name="12" x="7.62" y="5.08" visible="pad" length="short" direction="pas" rot="R180"/>
<pin name="13" x="-5.08" y="2.54" visible="pad" length="short" direction="pas"/>
<pin name="14" x="7.62" y="2.54" visible="pad" length="short" direction="pas" rot="R180"/>
<pin name="15" x="-5.08" y="0" visible="pad" length="short" direction="pas"/>
<pin name="16" x="7.62" y="0" visible="pad" length="short" direction="pas" rot="R180"/>
<pin name="17" x="-5.08" y="-2.54" visible="pad" length="short" direction="pas"/>
<pin name="18" x="7.62" y="-2.54" visible="pad" length="short" direction="pas" rot="R180"/>
<pin name="19" x="-5.08" y="-5.08" visible="pad" length="short" direction="pas"/>
<pin name="20" x="7.62" y="-5.08" visible="pad" length="short" direction="pas" rot="R180"/>
<pin name="21" x="-5.08" y="-7.62" visible="pad" length="short" direction="pas"/>
<pin name="22" x="7.62" y="-7.62" visible="pad" length="short" direction="pas" rot="R180"/>
<pin name="23" x="-5.08" y="-10.16" visible="pad" length="short" direction="pas"/>
<pin name="24" x="7.62" y="-10.16" visible="pad" length="short" direction="pas" rot="R180"/>
<pin name="25" x="-5.08" y="-12.7" visible="pad" length="short" direction="pas"/>
<pin name="26" x="7.62" y="-12.7" visible="pad" length="short" direction="pas" rot="R180"/>
<pin name="27" x="-5.08" y="-15.24" visible="pad" length="short" direction="pas"/>
<pin name="28" x="7.62" y="-15.24" visible="pad" length="short" direction="pas" rot="R180"/>
<pin name="29" x="-5.08" y="-17.78" visible="pad" length="short" direction="pas"/>
<pin name="30" x="7.62" y="-17.78" visible="pad" length="short" direction="pas" rot="R180"/>
<pin name="31" x="-5.08" y="-20.32" visible="pad" length="short" direction="pas"/>
<pin name="32" x="7.62" y="-20.32" visible="pad" length="short" direction="pas" rot="R180"/>
</symbol>
</symbols>
<devicesets>
<deviceset name="ZL266-32DG" prefix="X">
<description>&lt;b&gt;Milli-Grid Header&lt;/b&gt;&lt;p&gt; 
2.00mm (.079") Pitch</description>
<gates>
<gate name="G$1" symbol="CON-2X16" x="0" y="-17.78"/>
</gates>
<devices>
<device name="" package="ZL266-32DG">
<connects>
<connect gate="G$1" pin="1" pad="1"/>
<connect gate="G$1" pin="10" pad="10"/>
<connect gate="G$1" pin="11" pad="11"/>
<connect gate="G$1" pin="12" pad="12"/>
<connect gate="G$1" pin="13" pad="13"/>
<connect gate="G$1" pin="14" pad="14"/>
<connect gate="G$1" pin="15" pad="15"/>
<connect gate="G$1" pin="16" pad="16"/>
<connect gate="G$1" pin="17" pad="17"/>
<connect gate="G$1" pin="18" pad="18"/>
<connect gate="G$1" pin="19" pad="19"/>
<connect gate="G$1" pin="2" pad="2"/>
<connect gate="G$1" pin="20" pad="20"/>
<connect gate="G$1" pin="21" pad="21"/>
<connect gate="G$1" pin="22" pad="22"/>
<connect gate="G$1" pin="23" pad="23"/>
<connect gate="G$1" pin="24" pad="24"/>
<connect gate="G$1" pin="25" pad="25"/>
<connect gate="G$1" pin="26" pad="26"/>
<connect gate="G$1" pin="27" pad="27"/>
<connect gate="G$1" pin="28" pad="28"/>
<connect gate="G$1" pin="29" pad="29"/>
<connect gate="G$1" pin="3" pad="3"/>
<connect gate="G$1" pin="30" pad="30"/>
<connect gate="G$1" pin="31" pad="31"/>
<connect gate="G$1" pin="32" pad="32"/>
<connect gate="G$1" pin="4" pad="4"/>
<connect gate="G$1" pin="5" pad="5"/>
<connect gate="G$1" pin="6" pad="6"/>
<connect gate="G$1" pin="7" pad="7"/>
<connect gate="G$1" pin="8" pad="8"/>
<connect gate="G$1" pin="9" pad="9"/>
</connects>
<technologies>
<technology name="">
<attribute name="MF" value="MOLEX" constant="no"/>
<attribute name="MPN" value="" constant="no"/>
<attribute name="OC_FARNELL" value="unknown" constant="no"/>
<attribute name="OC_NEWARK" value="unknown" constant="no"/>
</technology>
</technologies>
</device>
</devices>
</deviceset>
</devicesets>
</library>
</drawing>
</eagle>
