// input, output, X, Y

earth		detail/iris_lake/571b9e68	128	128
earth2		detail/iris_lake/571b9e68	64	64
coast		detail/iris_lake/571b9e68	6	1
coast2		detail/iris_lake/571b9e68	4	1
{hill		detail/iris_lake/571b9e68	20	10
{hill2		detail/iris_lake/571b9e68	20	10
48e10c96	detail/iris_lake/concrete	2	2
0e7df5b3	detail/iris_lake/concrete	2	2
918c4b05	detail/iris_lake/concrete	2	2
becfe5fc	detail/iris_lake/concrete	2	2
4fa716a6	detail/iris_lake/brickwall	8	8
f65c8a4e	detail/iris_lake/f65c8a4e	8	8
