06/24/2010 18:41:15 [HLGUARD 1.9.n10] -> XxElC@P()xX<186.88.234.123> <Crash Script Detected> on de_dust2_2x2 <2 horas ban>
06/24/2010 19:03:05 [HLGUARD 1.9.n10] -> rata mcbo<186.90.74.146> <Crash Script Detected> on de_dust2_2x2 <2 horas ban>
06/24/2010 19:31:13 [HLGUARD 1.9.n10] -> MaXiS<186.90.243.24> <Crash Script Detected> on de_dust2_2x2 <2 horas ban>
06/25/2010 14:02:58 [HLGUARD 1.9.n10] -> -=Rx=- vnzla--xX<186.89.157.213> <Crash Script Detected> on de_dust2_2x2 <2 horas ban>
06/25/2010 15:58:18 [HLGUARD 1.9.n10] -> (JEAC)(General)*Luck!<186.88.180.207> <CD Hack Detected> on de_dust2_2x2 <Ban Permanente>
06/25/2010 15:58:21 [HLGUARD 1.9.n10] -> (JEAC)(General)*Luck!<186.88.180.207> <CD Hack Detected> on de_dust2_2x2 <Ban Permanente>
06/25/2010 16:23:37 [HLGUARD 1.9.n10] -> _!o!_<186.89.38.1> <Crash Script Detected> on de_dust2_2x2 <2 horas ban>
06/25/2010 17:31:16 [HLGUARD 1.9.n10] -> [ABF 4x4] Kirex_!<186.89.20.183> <Crash Script Detected> on de_dust2_2x2 <2 horas ban>
06/25/2010 17:39:17 [HLGUARD 1.9.n10] -> [K$] Erick-RamboxX<190.73.47.113> <Crash Script Detected> on de_dust2_2x2 <2 horas ban>
06/25/2010 17:43:26 [HLGUARD 1.9.n10] -> Jezz;Bbe!<186.89.93.121> <Crash Script Detected> on de_dust2_2x2 <2 horas ban>
06/25/2010 18:24:44 [HLGUARD 1.9.n10] -> iTzDario[vZ]<186.90.142.147> <Crash Script Detected> on de_dust2_2x2 <2 horas ban>
06/29/2010 15:45:35 [HLGUARD 1.9.n10] -> Numbeerone;DJFranco[:<186.89.146.171> <Bunny Hop Script Detected> on de_dust2 <1/2 Hora ban>
06/29/2010 16:03:57 [HLGUARD 1.9.n10] -> Dar_martillo<186.90.20.147> <Bunny Hop Script Detected> on de_dust2 <1/2 Hora ban>
06/29/2010 21:34:48 [HLGUARD 1.9.n10] -> <- Killer -> 'Smile<186.89.72.71> <Crash Script Detected> on de_dust2 <1/2 Hora ban>
06/30/2010 17:18:17 [HLGUARD 1.9.n10] -> karlox :X<186.90.48.91> <Crash Script Detected> on de_dust2 <1/2 Hora ban>
06/30/2010 20:27:02 [HLGUARD 1.9.n10] -> [K$] Erick-RamboxX<190.75.208.131> <Crash Script Detected> on de_dust2 <1/2 Hora ban>
06/30/2010 22:03:13 [HLGUARD 1.9.n10] -> AH?<201.208.101.66> <Crash Script Detected> on de_dust2 <1/2 Hora ban>
07/01/2010 14:04:43 [HLGUARD 1.9.n10] -> CS PA<190.200.244.187> <Bunny Hop Script Detected> on de_dust2 <1/2 Hora ban>
07/01/2010 15:12:26 [HLGUARD 1.9.n10] -> [K$] Erick-RamboxX<190.75.208.131> <Crash Script Detected> on de_dust2 <1/2 Hora ban>
07/02/2010 18:54:48 [HLGUARD 1.9.n10] -> Alejandro xD<190.204.228.167> <Chase Cam Exploit Script Detected> on de_dust2 <1/2 Hora ban>
10/21/2011 17:43:43 [HLGUARD 1.9.n10] -> 2s<STEAM_ID_LAN><186.88.167.203> <Code 10#9 - Rapid/Burstfire> on de_dust2 <Ban Permanente x Chitero>
10/21/2011 17:43:43 [HLGUARD 1.9.n10] -> 2s<186.88.167.203> <Code 10#9 - Rapid/Burstfire> on de_dust2 <24 horas ban>
10/21/2011 17:43:43 [HLGUARD 1.9.n10] -> 2s<STEAM_ID_LAN><186.88.167.203> <Code 10#9 - Rapid/Burstfire> on de_dust2
10/21/2011 17:46:39 [HLGUARD 1.9.n10] -> 2s<STEAM_ID_LAN><186.88.167.203> <Code 10#11 - Rapid/Burstfire> on de_dust2 <Ban Permanente x Chitero>
10/21/2011 17:46:39 [HLGUARD 1.9.n10] -> 2s<186.88.167.203> <Code 10#11 - Rapid/Burstfire> on de_dust2 <24 horas ban>
10/21/2011 17:46:39 [HLGUARD 1.9.n10] -> 2s<STEAM_ID_LAN><186.88.167.203> <Code 10#11 - Rapid/Burstfire> on de_dust2
