"Resource/NewGameDialog.res"
{
	"NewGameDialog"
	{
		"ControlName"		"Frame"
		"fieldName"			"NewGameDialog"
		"xpos"				"500"
		"ypos"				"480"
		"wide"				"513"
		"tall"				"420"
		"autoResize"		"3"
		"pinCorner"			"3"
		"visible"			"1"
		"enabled"			"1"
		"tabPosition"		"0"
	}
	"Border"
	{
		"ControlName"		"ImagePanel"
		"fieldName"			"border"
		"xpos"				"16"
		"ypos"				"36"
		"wide"				"486"
		"tall"				"339"
		"autoResize"		"0"
		"pinCorner"			"0"
		"visible"			"1"
		"enabled"			"1"
		"tabPosition"		"0"
		"paintbackground"	"1"
		"border"			"InsetBorder"
		"scaleImage"		"0"
	}	
	"Button"
	{
		"ControlName"		"Label"
		"fieldName"			"Label"
		"labelText"			"#GameUI_InfoTextOnline"
		"dulltext"			"0"
		"brighttext"		"0"
		"xpos"				"15"
		"ypos"				"35" //100
		"wide"				"485" //490
		"tall"				"338" //288
	}
	// "Button1"
	// {
		// "ControlName"		"Label"
		// "fieldName"			"Label"
		// "labelText"			"#GameUI_infoTextCP"
		// "dulltext"			"1"
		// "brighttext"		"0"
		// "xpos"				"35"
		// "ypos"				"390"
		// "wide"				"300"
		// "tall"				"24"
	// }
	// "Image"
	// {
		// "ControlName"		"ImagePanel"
		// "fieldName"			"VACImage"
		// "xpos"				"105"
		// "ypos"				"34"
		// "wide"				"287"
		// "tall"				"64"
		// "autoResize"		"0"
		// "pinCorner"			"0"
		// "visible"			"1"
		// "enabled"			"1"
		// "border"			""
		// "scaleimage"		"1"
		// "image"				"resource/credits"
	// }
	"Cancel"
	{
		"ControlName"		"Button"
		"fieldName"			"Cancel"
		"xpos"				"416" //442
		"ypos"				"388"
		"wide"				"84" //64
		"tall"				"24"
		"autoResize"		"0"
		"pinCorner"			"3"
		"visible"			"1"
		"enabled"			"1"
		"tabPosition"		"0"
		"labelText"			"#GameUI_Close"
		"textAlignment"		"west"
		"dulltext"			"0"
		"brighttext"		"0"
		"wrap"				"0"
		"Command"			"Close"
		"Default"			"0"
	}
	"HelpText"
	{
		"ControlName"		"Label"
		"fieldName"			"HelpText"
		"xpos"				"0"
		"ypos"				"0"
		"wide"				"0"
		"tall"				"0"
		"autoResize"		"0"
		"pinCorner"			"0"
		"visible"			"1"
		"enabled"			"1"
		"tabPosition"		"0"
		"labelText"			"#GameUI_NewGameHelpText"
		"textAlignment"		"west"
		"dulltext"			"1"
	}
	"Training"
	{
		"ControlName"		"RadioButton"
		"fieldName"			"Training"
		"xpos"				"0"
		"ypos"				"0"
		"wide"				"0"
		"tall"				"0"
		"autoResize"		"0"
		"pinCorner"			"0"
		"visible"			"1"
		"enabled"			"1"
		"tabPosition"		"1"
		"labelText"			"#GameUI_TrainingRoom"
		"textAlignment"		"west"
		"dulltext"			"0"
		"default"			"0"
		"SubTabPosition"	"1"
	}
	"Easy"
	{
		"ControlName"		"RadioButton"
		"fieldName"			"Easy"
		"xpos"				"0"
		"ypos"				"0"
		"wide"				"0"
		"tall"				"0"
		"autoResize"		"0"
		"pinCorner"			"0"
		"visible"			"1"
		"enabled"			"1"
		"tabPosition"		"1"
		"labelText"			"#GameUI_Easy"
		"textAlignment"		"west"
		"dulltext"			"0"
		"default"			"0"
		"SubTabPosition"	"2"
	}
	"Medium"
	{
		"ControlName"		"RadioButton"
		"fieldName"			"Medium"
		"xpos"				"0"
		"ypos"				"0"
		"wide"				"0"
		"tall"				"0"
		"autoResize"		"0"
		"pinCorner"			"0"
		"visible"			"1"
		"enabled"			"1"
		"tabPosition"		"1"
		"labelText"			"#GameUI_Medium"
		"textAlignment"		"west"
		"dulltext"			"0"
		"default"			"0"
		"SubTabPosition"	"3"
	}
	"Hard"
	{
		"ControlName"		"RadioButton"
		"fieldName"			"Hard"
		"xpos"				"0"
		"ypos"				"0"
		"wide"				"0"
		"tall"				"0"
		"autoResize"		"0"
		"pinCorner"			"0"
		"visible"			"1"
		"enabled"			"1"
		"tabPosition"		"1"
		"labelText"			"#GameUI_Hard"
		"textAlignment"		"west"
		"dulltext"			"0"
		"default"			"0"
		"SubTabPosition"	"4"
	}
	"Play"
	{
		"ControlName"		"Button"
		"fieldName"			"Play"
		"xpos"				"0"
		"ypos"				"0"
		"wide"				"0"
		"tall"				"0"
		"autoResize"		"0"
		"pinCorner"			"0"
		"visible"			"1"
		"enabled"			"1"
		"tabPosition"		"2"
		"labelText"			"#GameUI_Play"
		"textAlignment"		"west"
		"dulltext"			"0"
		"command"			"Play"
		"default"			"1"
	}
}