Scheme
{
	Colors
	{
		// Base colors
		
		"BaseText"			"230 230 230 200"	// used in text windows, lists
		"BrightBaseText"	"222 222 222 255"	// brightest text
		"SelectedText"		"230 230 230 255"	// selected text
		"DimBaseText"		"200 200 200 200"	// dim base text (command menu)
		"LabelDimText"		"255 176 0 164"		// used for info text
		"ControlText"		"255 176 0 255"		// used in all text controls
		"BrightControlText" "215 215 215 200"	// use for selected controls	(scoreboard)
		"DisabledText1"		"80 48 0 255"		// disabled text
		"DisabledText2"		"0 0 0 0"			// overlay color for disabled text (to give that inset look)
		"DimListText"		"188 112 0 255"		// offline friends, unsubscribed games, etc.

		"ButtonFocusBorder"	"64 48 0 255"		// keyboard focus dashed line for buttons

		// Background colors
		
		"ControlBG"			"0 0 0 0"		// background color of most controls
		"ButtonBG"			"0 0 0 64"		// background color of buttons
		"ControlDarkBG"		"0 0 0 128"		// darker background color; used for background of scrollbars
		"WindowBG"			"0 0 0 200"		// background color of text edit panes (chat, text entries, etc.)
		"SelectionBG"		"30 144 255 25"	// background color of any selected text or menu item
		"SelectionBG2"		"30 144 255 25"	// selection background in window w/o focus
		"ListBG"			"0 0 0 0"		// background of scoreboard
		"ViewportBG"		"0 0 0 0"		// motd background (outer)
		"CareerBoxBG"		"0 0 0 227"
		"Menu/BgColor"		"0 0 0 25"

		// Credits
		
		"CreditsNormalFG"	"255 255 255 255"
		"CreditsNormalBG"	"0 0 0 255"

		"CreditsTitleFG"	"255 174 0 255"
		"CreditsTitleBG"	"0 0 0 255"

		"CreditsStudioTitleFG"	"255 174 0 255"
		"CreditsStudioTitleBG"	"0 0 0 255"

		"CreditsIndividualTitleFG"	"255 174 0 255"
		"CreditsIndividualTitleBG"	"0 0 0 255"

		// Titlebar colors
		
		"TitleText"			"255 255 255 255"
		"TitleDimText"		"255 255 255 255"
		"TitleBG"			"255 255 0 0"
		"TitleDimBG"		"255 255 0 0"
		"TitleIcon"			"255 255 255 255" // big '!' icon in top left
		
		// Slider tick colors
		
		"SliderTickColor"	"127 140 127 255"
		"SliderTrackColor"	"31 31 31 255"

		// Border colors
		
		"BorderBright"		"66 66 66 150"		// the lit side of a control
		"BorderDark"		"66 66 66 75"		// the dark/unlit side of a control
		"BorderSelection"	"188 112 0 0"		// the additional border color for displaying the default/selected button
		"BorderBuyPreset"	"255 176 0 255"		// the lit side of a control

		"team0"	"165 165 165 200"		// Spectators
		"team1"	"201 119 112 255"		// CT's
		"team2"	"119 201 124 255"		// T's

		// Statistics text
		
		"StatisticsText"			"255 255 255 255"
		"SelectedStatisticsText"	"128 128 128 255"

		"BuyPresetBG"			"0 0 0 64"
		"BuyPresetAltBG"		"0 0 0 128"

		"MapDescriptionText" 	"222 222 222 255" // the text used in the map description window
	}

	///////////////////// BASE SETTINGS ////////////////////////
	// default settings for all panels
	// controls use these to determine their settings
	BaseSettings
	{
		"FgColor"			"ControlText"
		"BgColor"			"ControlBG"
		"ButtonBgColor"		"ButtonBG"
		"LabelBgColor"		"ControlBG"
		"SubPanelBgColor"	"ControlBG"

		"DisabledFgColor1"		"DisabledText1" 
		"DisabledFgColor2"		"DisabledText2"	// set this to the BgColor if you don't want it to draw

		"TitleBarFgColor"			"TitleText"
		"TitleBarDisabledFgColor"	"TitleDimText"
		"TitleBarBgColor"			"TitleBG"
		"TitleBarDisabledBgColor"	"TitleDimBG"

		"TitleBarIcon"				"resource/popup"
		"TitleBarDisabledIcon"		"resource/popup"

		"TitleButtonFgColor"			"BorderBright"
		"TitleButtonBgColor"			"ControlBG"
		"TitleButtonDisabledFgColor"	"TitleDimText"
		"TitleButtonDisabledBgColor"	"TitleDimBG"

		"TextCursorColor"			"BaseText"			// color of the blinking text cursor in text entries
		"URLTextColor"				"BrightBaseText"	// color that URL's show up in chat window

		Menu
		{
			"FgColor"			"DimBaseText"
			"BgColor"			"ControlBG"
			"ArmedFgColor"		"BrightBaseText"
			"ArmedBgColor"		"SelectionBG"
			"DividerColor"		"BorderDark"
			"TextInset"			"6"
		}

		MenuButton	// the little arrow on the side of boxes that triggers drop down menus
		{
			"ButtonArrowColor"	"DimBaseText"		// color of arrows
		   	"ButtonBgColor"		"WindowBG"			// bg color of button. same as background color of text edit panes 
			"ArmedArrowColor"	"BrightBaseText"	// color of arrow when mouse is over button
			"ArmedBgColor"		"DimBaseText"		// bg color of button when mouse is over button
		}

		Slider
		{
			"SliderFgColor"		"ControlBG"			// handle with which the slider is grabbed
			"SliderBgColor"		"ControlDarkBG"		// area behind handle
		}

		ScrollBarSlider
		{
			"BgColor"					"ControlBG"		// this isn't really used
			"ScrollBarSliderFgColor"	"ControlBG"		// handle with which the slider is grabbed
			"ScrollBarSliderBgColor"	"ControlDarkBG"	// area behind handle
			"ButtonFgColor"				"DimBaseText"	// color of arrows
		}

		// text edit windows
		
		"WindowFgColor"				"BaseText"		// off-white
		"WindowBgColor"				"WindowBG"		// redundant. can we get rid of WindowBgColor and just use WindowBG?
		"WindowDisabledFgColor"		"DimBaseText"
		"WindowDisabledBgColor"		"ListBG"		// background of chat conversation
		"SelectionFgColor"			"SelectedText"	// fg color of selected text
		"SelectionBgColor"			"SelectionBG"
		"ListSelectionFgColor"		"SelectedText"
		"ListBgColor"				"ListBG"		// background of server browser control, etc
		"BuddyListBgColor"			"ListBG"		// background of buddy list pane
		
		// App-specific stuff
		
		"ChatBgColor"				"WindowBG"

		// status selection
		
		"StatusSelectFgColor"		"BrightBaseText"
		"StatusSelectFgColor2"		"BrightControlText"	// this is the color of the friends status

		// checkboxes
		
		"CheckButtonBorder1"   		"BorderDark"		// the left checkbutton border
		"CheckButtonBorder2"   		"BorderBright"		// the right checkbutton border
		"CheckButtonCheck"			"BrightControlText"	// color of the check itself
		"CheckBgColor"				"ListBG"

		// buttons (default fg/bg colors are used if these are not set)
		
//		"ButtonArmedFgColor"
		"ButtonArmedBgColor"		"SelectionBG"
//		"ButtonDepressedFgColor"	"BrightControlText"
//		"ButtonDepressedBgColor"

		// buddy buttons
		
		BuddyButton
		{
			"FgColor1"				"ControlText"
			"FgColor2"				"DimListText"
			"ArmedFgColor1"			"BrightBaseText"
			"ArmedFgColor2"			"BrightBaseText"
			"ArmedBgColor"			"SelectionBG"
		}

		Chat
		{
			"TextColor"				"BrightControlText"
			"SelfTextColor"			"BaseText"
			"SeperatorTextColor"	"DimBaseText"
		}

		Statistics
		{
			"Font"			"DefaultSmall"
			"TextColor"		"StatisticsText"
			"SelectedTextColor"	"SelectedStatisticsText"
		}

		"SectionTextColor"		"BrightControlText"	// text color for IN-GAME, ONLINE, OFFLINE sections of buddy list
		"SectionDividerColor"	"BorderDark"		// color of line that runs under section name in buddy list
	}

	//
	//////////////////////// FONTS /////////////////////////////
	//
	// describes all the fonts
	Fonts
	{
		// fonts are used in order that they are listed
		// fonts listed later in the order will only be used if they fulfill a range not already filled
		// if a font fails to load then the subsequent fonts will replace
		"Default"
		{
			"1"
			{
				"name"		"Verdana"
				"tall"		"12"
				"weight"	"600"
				"yres"	"480 599"
			}
			"2"
			{
				"name"		"Verdana"
				"tall"		"13"
				"weight"	"600"
				"yres"	"600 767"
			}
			"3"
			{
				"name"		"Verdana"
				"tall"		"14"
				"weight"	"600"
				"yres"	"768 1023"
				"antialias"	"1"
			}
			"4"
			{
				"name"		"Verdana"
				"tall"		"20"
				"weight"	"600"
				"yres"	"1024 1199"
				"antialias"	"1"
			}
			"5"
			{
				"name"		"Verdana"
				"tall"		"24"
				"weight"	"600"
				"yres"	"1200 6000"
				"antialias"	"1"
			}
		}
		"DefaultUnderline"
		{
			"1"
			{
				"name"		"Tahoma"
				"tall"		"12"
				"weight"	"500"
				"underline" "1"
			}
		}
		"DefaultSmall"
		{
			"1"
			{
				"name"		"Verdana"
				"tall"		"12"
				"weight"	"0"
				"yres"	"480 599"
			}
			"2"
			{
				"name"		"Verdana"
				"tall"		"13"
				"weight"	"0"
				"yres"	"600 767"
			}
			"3"
			{
				"name"		"Verdana"
				"tall"		"14"
				"weight"	"0"
				"yres"	"768 1023"
				"antialias"	"1"
			}
			"4"
			{
				"name"		"Verdana"
				"tall"		"20"
				"weight"	"0"
				"yres"	"1024 1199"
				"antialias"	"1"
			}
			"5"
			{
				"name"		"Verdana"
				"tall"		"24"
				"weight"	"0"
				"yres"	"1200 6000"
				"antialias"	"1"
			}
		}
		"DefaultVerySmall"
		{
			"1"
			{
				"name"		"Verdana"
				"tall"		"12"
				"weight"	"600"
				"yres"	"480 599"
			}
			"2"
			{
				"name"		"Verdana"
				"tall"		"13"
				"weight"	"600"
				"yres"	"600 767"
			}
			"3"
			{
				"name"		"Verdana"
				"tall"		"14"
				"weight"	"600"
				"yres"	"768 1023"
				"antialias"	"1"
			}
			"4"
			{
				"name"		"Verdana"
				"tall"		"20"
				"weight"	"600"
				"yres"	"1024 1199"
				"antialias"	"1"
			}
			"5"
			{
				"name"		"Verdana"
				"tall"		"24"
				"weight"	"600"
				"yres"	"1200 6000"
				"antialias"	"1"
			}
		}
		// Used by scoreboard and spectator UI for names which don't map in the normal fashion
		"DefaultVerySmallFallBack"
		{
			"1"
			{
				"name"		"Verdana"
				"tall"		"10"
				"weight"	"0"
				"range"		"0x0000 0x017F" //	Basic Latin, Latin-1 Supplement, Latin Extended-A
				"yres"		"480 599"
				"antialias"	"1"
			}
			"2"
			{
				"name"		"Verdana"
				"tall"		"12"
				"weight"	"0"
				"range"		"0x0000 0x017F" //	Basic Latin, Latin-1 Supplement, Latin Extended-A
				"yres"		"600 1199"
				"antialias"	"1"
			}
			"3"
			{
				"name"		"Verdana"
				"tall"		"15"
				"weight"	"0"
				"range"		"0x0000 0x017F" //	Basic Latin, Latin-1 Supplement, Latin Extended-A
				"yres"		"1200 6000"
				"antialias"	"1"
			}
		}
		"Title"
		{
			"1"
			{
				"name"		"Verdana Bold"
				"tall"		"18"
				"weight"	"500"
			}
			"2"
			{
				"name"		"Arial"
				"tall"		"16"
				"weight"	"600"
			}
		}
		// Credits
		"CreditsTitle"
		{
			"1"
			{
				"name"		"Tahoma"
				"tall"		"26"
				"weight"	"800"
			}
			"2"
			{
				"name"		"Arial"
				"tall"		"26"
				"weight"	"700"
			}
		}
		"CreditsStudioTitle"
		{
			"1"
			{
				"name"		"Tahoma"
				"tall"		"24"
				"weight"	"800"
			}
			"2"
			{
				"name"		"Arial"
				"tall"		"24"
				"weight"	"700"
			}
		}
		"CreditsIndividualTitle"
		{
			"1"
			{
				"name"		"Tahoma"
				"tall"		"22"
				"weight"	"800"
			}
			"2"
			{
				"name"		"Arial"
				"tall"		"22"
				"weight"	"700"
			}
		}
		"CreditsNormal"
		{
			"1"
			{
				"name"		"Tahoma"
				"tall"		"20"
				"weight"	"800"
			}
			"2"
			{
				"name"		"Arial"
				"tall"		"20"
				"weight"	"700"
			}
		}

		"DialogTitle"
		{
			"1"
			{
				"name"		"Verdana Bold"
				"tall"		"14"
				"weight"	"500"
			}
			"2"
			{
				"name"		"Arial"
				"tall"		"13"
				"weight"	"600"
			}
		}

		"Marlett"
		{
			"1"
			{
				"name"		"Marlett"
				"tall"		"11"
				"weight"	"0"
				"symbol"	"1"
			}
		}
		// Spectator
		"Spec"
		{
			"1"
			{				
				"name"		"Bebas Neue"
				"tall"		"20"
				"weight"	"400"
				"antialias" 	"1"	
				"dropshadow"	"1"
			}
		}
		"SpecLabel"
		{
			"1"
			{				
				"name"		"Bebas Neue"
				"tall"		"16"
				"weight"	"400"
				"antialias" 	"1"
				"dropshadow"	"1"
			}
		}
		"SpecScore"
		{
			"1"
			{				
				"name"		"Bebas Neue"
				"tall"		"26"
				"weight"	"400"
				"antialias" 	"1"
				"dropshadow"	"1"
			}
		}
		"SpectatorScore"
		{
			"1"
			{
				"name"		"csp_font"
				"tall"		"18"
				"weight"	"600"
				"range"		"0x0000 0x017F"
				"antialias"	"1"
				"dropshadow"	"1"
			}
		}
		"SpectatorTeam"
		{
			"1"
			{
				"name"		"csp_font"
				"tall"		"10"
				"weight"	"600"
				"range"		"0x0000 0x017F"
				"antialias"	"1"
				"dropshadow"	"1"
			}
		}
		"SpecTimer"
		{
			"1"
			{				
				"name"		"Bebas Neue"
				"tall"		"10"
				"weight"	"400"
				"antialias" 	"1"
				"dropshadow"	"1"
			}
		}
	}

	//
	//////////////////// BORDERS //////////////////////////////
	//
	// describes all the border types
	Borders
	{
		BaseBorder
		{
			"inset" "0 0 1 1"
			Left
			{
				"1"
				{
					"color" "BorderDark"
					"offset" "0 1"
				}
			}
			Right
			{
				"1"
				{
					"color" "BorderBright"
					"offset" "1 0"
				}
			}
			Top
			{
				"1"
				{
					"color" "BorderDark"
					"offset" "0 0"
				}
			}
			Bottom
			{
				"1"
				{
					"color" "BorderBright"
					"offset" "0 0"
				}
			}
		}
		
		TitleButtonBorder
		{
			"inset" "0 0 1 1"
			Left
			{
				"1"
				{
					"color" "BorderBright"
					"offset" "0 1"
				}
			}
			Right
			{
				"1"
				{
					"color" "BorderDark"
					"offset" "1 0"
				}
			}
			Top
			{
				"1"
				{
					"color" "BorderBright"
					"offset" "0 0"
				}
			}
			Bottom
			{
				"1"
				{
					"color" "BorderDark"
					"offset" "0 0"
				}
			}
		}

		TitleButtonDisabledBorder
		{
			"inset" "0 0 1 1"
			Left
			{
				"1"
				{
					"color" "BgColor"
					"offset" "0 1"
				}
			}
			Right
			{
				"1"
				{
					"color" "BgColor"
					"offset" "1 0"
				}
			}
			Top
			{
				"1"
				{
					"color" "BgColor"
					"offset" "0 0"
				}
			}
			Bottom
			{
				"1"
				{
					"color" "BgColor"
					"offset" "0 0"
				}
			}
		}

		TitleButtonDepressedBorder
		{
			"inset" "1 1 1 1"
			Left
			{
				"1"
				{
					"color" "BorderDark"
					"offset" "0 1"
				}
			}

			Right
			{
				"1"
				{
					"color" "BorderBright"
					"offset" "1 0"
				}
			}

			Top
			{
				"1"
				{
					"color" "BorderDark"
					"offset" "0 0"
				}
			}

			Bottom
			{
				"1"
				{
					"color" "BorderBright"
					"offset" "0 0"
				}
			}
		}

		ScrollBarButtonBorder
		{
			"inset" "1 0 0 0"
			Left
			{
				"1"
				{
					"color" "BorderBright"
					"offset" "0 1"
				}
			}

			Right
			{
				"1"
				{
					"color" "BorderDark"
					"offset" "1 0"
				}
			}

			Top
			{
				"1"
				{
					"color" "BorderBright"
					"offset" "0 0"
				}
			}

			Bottom
			{
				"1"
				{
					"color" "BorderDark"
					"offset" "0 0"
				}
			}
		}

		ScrollBarButtonDepressedBorder
		{
			"inset" "2 2 0 0"
			Left
			{
				"1"
				{
					"color" "BorderDark"
					"offset" "0 1"
				}
			}

			Right
			{
				"1"
				{
					"color" "BorderBright"
					"offset" "1 0"
				}
			}

			Top
			{
				"1"
				{
					"color" "BorderDark"
					"offset" "0 0"
				}
			}

			Bottom
			{
				"1"
				{
					"color" "BorderBright"
					"offset" "0 0"
				}
			}
		}
		
		ButtonBorder
		{
			"inset" "0 0 0 0"
			Left
			{
				"1"
				{
					"color" "BorderBright"
					"offset" "0 1"
				}
			}

			Right
			{
				"1"
				{
					"color" "BorderDark"
					"offset" "0 0"
				}
			}

			Top
			{
				"1"
				{
					"color" "BorderBright"
					"offset" "1 1"
				}
			}

			Bottom
			{
				"1"
				{
					"color" "BorderDark"
					"offset" "0 0"
				}
			}
		}

		BuyPresetBorder
		{
			"inset" "0 0 0 0"
			Left
			{
				"1"
				{
					"color" "BorderBuyPreset"
					"offset" "0 1"
				}
			}

			Right
			{
				"1"
				{
					"color" "BorderBuyPreset"
					"offset" "0 0"
				}
			}

			Top
			{
				"1"
				{
					"color" "BorderBuyPreset"
					"offset" "1 1"
				}
			}

			Bottom
			{
				"1"
				{
					"color" "BorderBuyPreset"
					"offset" "0 0"
				}
			}
		}

		FrameBorder
		{
			"inset" "0 0 1 1"
			Left
			{
				"1"
				{
					"color" "ControlBG"
					"offset" "0 1"
				}
			}

			Right
			{
				"1"
				{
					"color" "ControlBG"
					"offset" "0 0"
				}
			}

			Top
			{
				"1"
				{
					"color" "ControlBG"
					"offset" "0 1"
				}
			}

			Bottom
			{
				"1"
				{
					"color" "ControlBG"
					"offset" "0 0"
				}
			}
		}

		TabBorder
		{
			"inset" "0 0 1 1"
			Left
			{
				"1"
				{
					"color" "BorderBright"
					"offset" "0 1"
				}
			}

			Right
			{
				"1"
				{
					"color" "BorderDark"
					"offset" "1 0"
				}
			}

			Top
			{
				"1"
				{
					"color" "BorderBright"
					"offset" "0 0"
				}
			}

			Bottom
			{
				"1"
				{
					"color" "BorderBright"
					"offset" "0 0"
				}
			}
		}

		TabActiveBorder
		{
			"inset" "0 0 1 0"
			Left
			{
				"1"
				{
					"color" "BorderBright"
					"offset" "0 0"
				}
			}

			Right
			{
				"1"
				{
					"color" "BorderDark"
					"offset" "1 0"
				}
			}

			Top
			{
				"1"
				{
					"color" "BorderBright"
					"offset" "0 0"
				}
			}

			Bottom
			{
				"1"
				{
					"color" "ControlBG"
					"offset" "6 2"
				}
			}
		}


		ToolTipBorder
		{
			"inset" "0 0 1 0"
			Left
			{
				"1"
				{
					"color" "BorderDark"
					"offset" "0 0"
				}
			}

			Right
			{
				"1"
				{
					"color" "BorderDark"
					"offset" "1 0"
				}
			}

			Top
			{
				"1"
				{
					"color" "BorderDark"
					"offset" "0 0"
				}
			}

			Bottom
			{
				"1"
				{
					"color" "BorderDark"
					"offset" "0 0"
				}
			}
		}

		// this is the border used for default buttons (the button that gets pressed when you hit enter)
		ButtonKeyFocusBorder
		{
			"inset" "0 0 0 0"
			Left
			{
				"1"
				{
					"color" "BorderBright"
					"offset" "0 1"
				}
			}

			Right
			{
				"1"
				{
					"color" "BorderDark"
					"offset" "0 0"
				}
			}

			Top
			{
				"1"
				{
					"color" "BorderBright"
					"offset" "1 1"
				}
			}

			Bottom
			{
				"1"
				{
					"color" "BorderDark"
					"offset" "0 0"
				}
			}
		}

		ButtonDepressedBorder
		{
			"inset" "0 0 0 0"
			Left
			{
				"1"
				{
					"color" "BorderBright"
					"offset" "0 1"
				}
			}

			Right
			{
				"1"
				{
					"color" "BorderDark"
					"offset" "0 0"
				}
			}

			Top
			{
				"1"
				{
					"color" "BorderBright"
					"offset" "1 1"
				}
			}

			Bottom
			{
				"1"
				{
					"color" "BorderDark"
					"offset" "0 0"
				}
			}
		}

		ComboBoxBorder
		{
			"inset" "0 0 1 1"
			Left
			{
				"1"
				{
					"color" "BorderDark"
					"offset" "0 1"
				}
			}

			Right
			{
				"1"
				{
					"color" "BorderBright"
					"offset" "1 0"
				}
			}

			Top
			{
				"1"
				{
					"color" "BorderDark"
					"offset" "0 0"
				}
			}

			Bottom
			{
				"1"
				{
					"color" "BorderBright"
					"offset" "0 0"
				}
			}
		}

		MenuBorder
		{
			"inset" "1 1 1 1"
			Left
			{
				"1"
				{
					"color" "BorderBright"
					"offset" "0 1"
				}
			}

			Right
			{
				"1"
				{
					"color" "BorderDark"
					"offset" "1 0"
				}
			}

			Top
			{
				"1"
				{
					"color" "BorderBright"
					"offset" "0 0"
				}
			}

			Bottom
			{
				"1"
				{
					"color" "BorderDark"
					"offset" "0 0"
				}
			}
		}
		BrowserBorder
		{
			"inset" "0 0 0 1"
			Left
			{
				"1"
				{
					"color" "BorderDark"
					"offset" "0 1"
				}
			}

			Right
			{
				"1"
				{
					"color" "BorderBright"
					"offset" "0 0"
				}
			}

			Top
			{
				"1"
				{
					"color" "BorderDark"
					"offset" "0 0"
				}
			}

			Bottom
			{
				"1"
				{
					"color" "BorderBright"
					"offset" "0 0"
				}
			}
		}

		BuyPresetButtonBorder
		{
			"inset" "0 0 0 0"
			Left
			{
				"1"
				{
					"color" "ControlBG"
					"offset" "0 1"
				}
			}

			Right
			{
				"1"
				{
					"color" "BorderDark"
					"offset" "0 0"
				}
			}

			Top
			{
				"1"
				{
					"color" "BorderBright"
					"offset" "1 1"
				}
			}

			Bottom
			{
				"1"
				{
					"color" "ControlBG"
					"offset" "0 0"
				}
			}
		}
	}
	
	CustomFontFiles
	{
		"1"		"resource/csp-font.ttf"
		"2"		"resource/bebaneue-regular.ttf"
	}
}
// 
// Line-Strike GUI by Geekrainian.
// (c) 2009-2014
// https://cuzus.games
// 