"Resource/UI/SpectatorGUI.res"
{
	"SpectatorGUI" // by LazzR
	{
		"ControlName"	"Frame"
		"fieldName"		"SpectatorGUI"
		"tall"			"0"
		"autoResize"	"0"
		"pinCorner"		"0"
		"visible"		"0"
		"enabled"		"0"
		"tabPosition"	"0"
	}
	"TopBar"
	{
		"ControlName"	"Panel"
		"fieldName"		"TopBar"
		"xpos"			"0"
		"ypos"			"0"
		"tall"			"0"
		"autoResize"	"0"
		"pinCorner"		"0"
		"visible"		"0"
		"enabled"		"0"
		"tabPosition"	"0"
	}
	"BottomBar"
	{
		"ControlName"	"Frame"
		"fieldName"		"BottomBar"
		"xpos"			"0"
		"ypos"			"0"
		"tall"			"0"
		"autoResize"	"0"
		"pinCorner"		"0"
		"visible"		"0"
		"enabled"		"0"
		"tabPosition"	"0"
	}
	"bottombarblank"
	{
		"ControlName"	"Panel"
		"fieldName"		"bottombarblank"
		"xpos"			"0"
		"ypos"			"0"
		"tall"			"0"
		"autoResize"	"0"
		"pinCorner"		"0"
		"visible"		"0"
		"enabled"		"0"
		"tabPosition"	"0"
	}
	"playerlabel"
	{
		"ControlName"	"Label"
		"fieldName"		"playerlabel"
		"xpos"			"c-075"
		"ypos"			"0"
		"wide"			"0"
		"tall"			"0"
		"autoResize"	"0"
		"pinCorner"		"0"
		"visible"		"0"
		"enabled"		"0"
		"tabPosition"	"0"
		"textAlignment"	"center"
	}
	"CTScoreLabel"
	{
		"ControlName"	"Label"
		"fieldName"		"CTScoreLabel"
		"xpos"			"r233"
		//"xpos"			"r268"
		"ypos"			"02"
		"wide"			"050"
		"tall"			"05"
		"autoResize"	"0"
		"pinCorner"		"0"
		"visible"		"0"
		"enabled"		"0"
		"labelText"		"#Cstrike_Spec_CT_Score"
		"textAlignment"	"east"
		"dulltext"		"0"
		"brighttext"	"0"
	}
	"CTScoreValue"
	{
		"ControlName"	"Label"
		"fieldName"		"CTScoreValue"
		"xpos"			"r80"
		//"xpos"			"r002"
		"ypos"			"02"
		"wide"			"00"
		//"wide"			"05"
		"tall"			"05"
		"autoResize"	"0"
		"pinCorner"		"0"
		"visible"		"0"
		"enabled"		"0"
		"labelText"		""
		"textAlignment"	"west"
		"dulltext"		"0"
		"brighttext"	"0"
	}
	"TERScoreLabel"
	{
		"ControlName"	"Label"
		"fieldName"		"TERScoreLabel"
		"xpos"			"r233"
		//"xpos"			"r268"
		"ypos"			"24"
		"wide"			"050"
		"tall"			"05"
		"autoResize"	"0"
		"pinCorner"		"0"
		"visible"		"0"
		"enabled"		"0"
		"labelText"		"#Cstrike_Spec_Ter_Score"
		"textAlignment"	"east"
		"dulltext"		"0"
		"brighttext"	"0"
	}
	"TERScoreValue"
	{
		"ControlName"	"Label"
		"fieldName"		"TERScoreValue"
		"xpos"			"r80"
		//"xpos"			"r002"
		"ypos"			"24"
		"wide"			"00"
		//"wide"			"05"
		"tall"			"05"
		"autoResize"	"0"
		"pinCorner"		"0"
		"visible"		"0"
		"enabled"		"0"
		"labelText"		""
		"textAlignment"	"west"
		"dulltext"		"0"
		"brighttext"	"0"
	}
	"DividerBar"
	{
		"ControlName"	"ImagePanel"
		"fieldName"		"DividerBar"
		"xpos"			"r64"
		"ypos"			"02"
		"wide"			"0"
		"tall"			"30"
		"autoResize"	"0"
		"pinCorner"		"0"
		"visible"		"0"
		"enabled"		"0"
		"tabPosition"	"0"
		"fillcolor"		"BorderBright"
		"labelText"		""
		"textAlignment"	"center"
	}
	"timerimage"
	{
		"ControlName"	"ImagePanel"
		"fieldName"		"timerimage"
		"xpos"			"r56"
		"ypos"			"26"
		"wide"			"02"
		"tall"			"02"
		"autoResize"	"0"
		"pinCorner"		"0"
		"visible"		"0"
		"enabled"		"0"
		"labelText"		""
		"textAlignment"	"center"
		"dulltext"		"0"
		"brighttext"	"0"
		"image"			"gfx/vgui/timer"
		"scaleImage"	"0"
	}
	"timerlabel"
	{
		"ControlName"	"Label"
		"fieldName"		"timerlabel"
		"xpos"			"r42"
		"ypos"			"24"
		"wide"			"40"
		"tall"			"05"
		"autoResize"	"0"
		"pinCorner"		"0"
		"visible"		"0"
		"enabled"		"0"
		"labelText"		"00:00"
		"textAlignment"	"west"
		"dulltext"		"0"
		"brighttext"	"0"
	}
	"extrainfo"
	{
		"ControlName"	"Label"
		"fieldName"		"extrainfo"
		"xpos"			"r56"
		"ypos"			"02"
		"wide"			"44"
		"tall"			"05"
		"autoResize"	"0"
		"pinCorner"		"0"
		"visible"		"0"
		"enabled"		"0"
		"labelText"		""
		"textAlignment"	"west"
		"dulltext"		"0"
		"brighttext"	"0"
	}
}
