"Resource/LoadingDialogDualProgress.res"
{
	"LoadingDialog"
	{
		"ControlName"			"Frame"
		"fieldName"				"LoadingDialog"
		"xpos"					""
		"ypos"					""
		"wide"					"9999"
		"tall"					"9999"
		"autoResize"			"0"
		"pinCorner"				"0"
		"visible"				"1"
		"enabled"				"1"
		"tabPosition"			"0"
	}
	"InfoLabel"
	{
		"ControlName"			"Label"
		"fieldName"				"InfoLabel"
		"xpos"					"9999"
		"ypos"					"9999"
		"wide"					"340"
		"tall"					"24"
		"autoResize"			"0"
		"pinCorner"				"0"
		"visible"				"0"
		"enabled"				"0"
		"tabPosition"			"0"
		"labelText"				"#GameUI_ParseBaseline"
		"textAlignment"			"west"
		"dulltext"				"1"
		"brighttext"			"0"
		"zpos"					"3"
	}
	"SecondaryProgressLabel"
	{
		"ControlName"			"Label"
		"fieldName"				"SecondaryProgressLabel"
		"xpos"					"9999"
		"ypos"					"9999"
		"wide"					"260"
		"tall"					"24"
		"autoResize"			"0"
		"pinCorner"				"0"
		"visible"				"0"
		"enabled"				"0"
		"tabPosition"			"0"
		"labelText"				"Label"
		"textAlignment"			"west"
		"dulltext"				"1"
		"brighttext"			"0"
	}
	"TimeRemainingLabel"
	{
		"ControlName"			"Label"
		"fieldName"				"TimeRemainingLabel"
		"xpos"					"9999"
		"ypos"					"9999"
		"wide"					"260"
		"tall"					"24"
		"autoResize"			"0"
		"pinCorner"				"0"
		"visible"				"0"
		"enabled"				"0"
		"tabPosition"			"0"
		"labelText"				""
		"textAlignment"			"west"
		"dulltext"				"1"
		"brighttext"			"0"
		"zpos"					"3"
	}
	// "NameLabel"
	// {
		// "ControlName"			"Label"
		// "fieldName"				"NameLabel"
		// "xpos"					"4915"
		// "ypos"					"4999"
		// "wide"					"169"
		// "tall"					"24"
		// "autoResize"				"0"
		// "pinCorner"				"0"
		// "visible"				"1"
		// "enabled"				"1"
		// "tabPosition"			"0"
		// "paintbackground"		"0"
		// "labelText"				"Connecting..."
		// "dulltext"				"0"
		// "brighttext"				"1"
		// "wrap"					"0"
	// }
}
// 
// Line-Strike GUI by Geekrainian.
// (c) 2009-2014
// https://cuzus.games
// 