///////////////////////////////////////////////////////////
// Tracker scheme resource file
//
// sections:
//		Colors			- all the colors used by the scheme
//		BaseSettings	- contains settings for app to use to draw controls
//		Fonts			- list of all the fonts used by app
//		Borders			- description of all the borders
//
///////////////////////////////////////////////////////////
Scheme
{
	//////////////////////// COLORS ///////////////////////////
	// color details
	// this is a list of all the colors used by the scheme
	Colors
	{
		// custom
		"KFRed"				"204 54 53 255"
		"KFRedActive"				"223 34 33 255"
		
		// base colors
		"Orange"			"255 176 0 255"
		"OrangeDim"			"255 176 0 120"
		"LightOrange"		"188 112 0 128"
		
		"Red"				"192 28 0 140"
		"Black"				"0 0 0 255"
		"TransparentBlack"	"0 0 0 196"
		"TransparentLightBlack"	"0 0 0 90"
		"RoundWinPanelBackground" "0 0 0 179"

		"Blank"				"0 0 0 0"
		"ForTesting"		"255 0 0 32"
		"ForTesting_Magenta"	"255 0 255 255"
		"ForTesting_MagentaDim"	"255 0 255 120"
		
		//These were ripped from SourceScheme
		"SteamLightGreen"	"157 194 80 255"
		"AchievementsLightGrey"		"79 79 79 255"
		"White"				"255 255 255 255"
	}

	///////////////////// BASE SETTINGS ////////////////////////
	//
	// default settings for all panels
	// controls use these to determine their settings
	BaseSettings
	{
		// vgui_controls color specifications
		// Border.Bright					"LightOrange"		// the lit side of a control
		Border.Bright "KFRed"
		// Border.Dark						"LightOrange"		// the dark/unlit side of a control
		Border.Dark "KFRed"
		Border.Selection				"Blank"				// the additional border color for displaying the default/selected button
		Border.BuyPreset				"Orange"

		// Button.TextColor				"Orange"
		Button.TextColor "KFRed"
		// Button.BgColor					"0 0 0 64"
		Button.BgColor "0 0 0 128"
		Button.ArmedTextColor			"Orange"
		Button.ArmedBgColor				"Red"
		Button.DepressedTextColor		"Orange"
		Button.DepressedBgColor			"Red"

		CheckButton.TextColor			"Orange"
		CheckButton.SelectedTextColor	"Orange"
		CheckButton.BgColor				"TransparentBlack"
		CheckButton.Border1  			"Border.Dark" 		// the left checkbutton border
		CheckButton.Border2  			"Border.Bright"		// the right checkbutton border
		CheckButton.Check				"Orange"				// color of the check itself

		ComboBoxButton.ArrowColor		"Orange"
		ComboBoxButton.ArmedArrowColor	"Orange"
		ComboBoxButton.BgColor			"TransparentBlack"
		ComboBoxButton.DisabledBgColor	"Blank"

		Frame.BgColor					"TransparentBlack"
		Frame.OutOfFocusBgColor			"TransparentBlack"
		Frame.FocusTransitionEffectTime	"0.0"	// time it takes for a window to fade in/out on focus/out of focus
		Frame.TransitionEffectTime		"0.0"	// time it takes for a window to fade in/out on open/close
		Frame.AutoSnapRange				"0"
		FrameGrip.Color1				"Blank"
		FrameGrip.Color2				"Blank"
		FrameTitleButton.FgColor		"Blank"
		FrameTitleButton.BgColor		"Blank"
		FrameTitleButton.DisabledFgColor	"Blank"
		FrameTitleButton.DisabledBgColor	"Blank"
		FrameSystemButton.FgColor		"Blank"
		FrameSystemButton.BgColor		"Blank"
		FrameSystemButton.Icon			""
		FrameSystemButton.DisabledIcon	""
		FrameTitleBar.TextColor			"Orange"
		FrameTitleBar.BgColor			"Blank"
		FrameTitleBar.DisabledTextColor	"Orange"
		FrameTitleBar.DisabledBgColor	"Blank"

		GraphPanel.FgColor				"Orange"
		GraphPanel.BgColor				"TransparentBlack"

		Label.TextDullColor				"Orange"
		Label.TextColor					"Orange"
		Label.TextBrightColor			"Orange"
		Label.SelectedTextColor			"Orange"
		Label.BgColor					"Blank"
		Label.DisabledFgColor1			"Blank"
		Label.DisabledFgColor2			"LightOrange"

		ListPanel.TextColor					"Orange"
		ListPanel.BgColor					"TransparentBlack"
		ListPanel.SelectedTextColor			"Black"
		ListPanel.SelectedBgColor			"Red"
		ListPanel.SelectedOutOfFocusBgColor	"Red"
		ListPanel.EmptyListInfoTextColor	"Orange"

		Menu.TextColor					"Orange"
		Menu.BgColor					"TransparentBlack"
		Menu.ArmedTextColor				"Orange"
		Menu.ArmedBgColor				"Red"
		Menu.TextInset					"6"

		Chat.TypingText					"Orange"

		//Panel.FgColor					"OrangeDim"
		Panel.FgColor					"KFRed" // modifies color of armor, timer, hostages, ammo
		Panel.BgColor					"Blank"

		HTML.BgColor					"Black"

		"BuyPreset.BgColor"				"0 0 0 128"
		"BuyPresetListBox.BgColor"			"0 0 0 128"
		"Popup.BgColor"					"0 0 0 230"

		//ProgressBar.FgColor				"Orange"
		ProgressBar.FgColor				"Panel.FgColor"
		ProgressBar.BgColor				"TransparentBlack"

		PropertySheet.TextColor			"Orange"
		PropertySheet.SelectedTextColor	"Orange"
		PropertySheet.TransitionEffectTime	"0.25"	// time to change from one tab to another

		RadioButton.TextColor			"Orange"
		RadioButton.SelectedTextColor	"Orange"

		RichText.TextColor				"Orange"
		RichText.BgColor				"Blank"
		RichText.SelectedTextColor		"Orange"
		RichText.SelectedBgColor		"Blank"

		ScrollBarButton.FgColor				"Orange"
		ScrollBarButton.BgColor				"Blank"
		ScrollBarButton.ArmedFgColor		"Orange"
		ScrollBarButton.ArmedBgColor		"Blank"
		ScrollBarButton.DepressedFgColor	"Orange"
		ScrollBarButton.DepressedBgColor	"Blank"

		ScrollBarSlider.FgColor				"Blank"		// nob color
		ScrollBarSlider.BgColor				"Blank"		// slider background color

		SectionedListPanel.HeaderTextColor	"Orange"
		SectionedListPanel.HeaderBgColor	"Blank"
		SectionedListPanel.DividerColor		"Black"
		SectionedListPanel.TextColor		"Orange"
		SectionedListPanel.BrightTextColor	"Orange"
		SectionedListPanel.BgColor			"TransparentLightBlack"
		SectionedListPanel.SelectedTextColor			"Black"
		SectionedListPanel.SelectedBgColor				"Red"
		SectionedListPanel.OutOfFocusSelectedTextColor	"Black"
		SectionedListPanel.OutOfFocusSelectedBgColor	"255 255 255 32"

		Slider.NobColor				"108 108 108 255"
		Slider.TextColor			"127 140 127 255"
		Slider.TrackColor			"31 31 31 255"
		Slider.DisabledTextColor1	"117 117 117 255"
		Slider.DisabledTextColor2	"30 30 30 255"

		TextEntry.TextColor			"Orange"
		TextEntry.BgColor			"TransparentBlack"
		TextEntry.CursorColor		"Orange"
		TextEntry.DisabledTextColor	"Orange"
		TextEntry.DisabledBgColor	"Blank"
		TextEntry.SelectedTextColor	"Black"
		TextEntry.SelectedBgColor	"Red"
		TextEntry.OutOfFocusSelectedBgColor	"Red"
		TextEntry.FocusEdgeColor	"TransparentBlack"

		ToggleButton.SelectedTextColor	"Orange"

		Tooltip.TextColor			"TransparentBlack"
		Tooltip.BgColor				"Red"

		TreeView.BgColor			"TransparentBlack"

		WizardSubPanel.BgColor		"Blank"

		// scheme-specific colors
		// "FgColor"		"Orange"
		"FgColor" "0 0 0 0" // cstrike icon color of choose team
		// "BgColor"		"TransparentBlack"
		"BgColor"		"0 0 0 0" // background color of MOTD window, choose team

		"ViewportBG"		"Blank"
		"team0"			"204 204 204 255" // Spectators
		"team1"			"255 64 64 255" // CT's
		"team2"			"153 204 255 255" // T's

		"MapDescriptionText"	"Orange" // the text used in the map description window
		"CT_Blue"			"153 204 255 255"
		"T_Red"				"255 64 64 255"
		"Hostage_Yellow"	"Panel.FgColor"
		//"HudIcon_Green"		"0 160 0 255"
		"HudIcon_Green"		"Panel.FgColor"
		"HudIcon_Red"		"160 0 0 255"

		// CHudMenu
		"ItemColor" "KFRedActive" //"255 167 42 200"	// default 255 167 42 255 // sourcemod menu active item text color
		"MenuColor" "137 128 128 255" //"233 208 173 255" // sourcemod menu disabled text color
		"MenuBoxBg" "0 0 0 200" //"0 0 0 100" // sourcemod menu background color

		// weapon selection colors
		//"SelectionNumberFg"		"255 220 0 200" // number in the top left of each panel
		"SelectionNumberFg"		"Panel.FgColor"
		//"SelectionTextFg"		"255 220 0 200" // text title of the weapon at the bottom
		"SelectionTextFg"		"Panel.FgColor"
		"SelectionEmptyBoxBg" 	"0 0 0 80" // background of the weapon boxes, the type you have not got yet, like C4 (slot 5) 
		"SelectionBoxBg" 		"0 0 0 80" // background of the weapon boxes, the one that do have weapons in that slot, but NOT selected
		"SelectionSelectedBoxBg" "0 0 0 190" // background of the weapon boxes, the one that do have weapons in that slot, and ARE selected

		// HL1-style HUD colors
		"Yellowish" "255 160 0 255"
		//"Normal" "255 208 64 255"
		"Normal" "Panel.FgColor"
		"Caution" "255 48 0 255"

		// Hint message colors
		"HintMessageFg"			"255 255 255 255"
		"HintMessageBg" 		"0 0 0 60"

		"ProgressBarFg"			"255 30 13 255"

		// Top-left corner of the "Counter-Strike" on the main screen
		"Main.Title1.X"		"32"
		"Main.Title1.Y"		"180"
		// "Main.Title1.Color"	"255 255 255 255"
		"Main.Title1.Color"	"255 232 174 100"

		// Top-left corner of the "SOURCE" on the main screen
		"Main.Title2.X"		"380"
		"Main.Title2.Y"		"205"
		// "Main.Title2.Color"	"255 255 255 80"
		"Main.Title2.Color"	"255 232 174 75"

		// Top-left corner of the "BETA" on the main screen
		"Main.Title3.X"		"460"
		"Main.Title3.Y"		"-10"
		// "Main.Title3.Color"	"255 255 0 255"
		"Main.Title3.Color"	"255 232 174 75"

		// Top-left corner of the menu on the main screen
		"Main.Menu.X"		"32"
		"Main.Menu.Y"		"248"

		// Blank space to leave beneath the menu on the main screen
		"Main.BottomBorder"	"32"
	}

	//
	//////////////////////// FONTS /////////////////////////////
	//
	// describes all the fonts
	Fonts
	{
		// fonts are used in order that they are listed
		// fonts listed later in the order will only be used if they fulfill a range not already filled
		// if a font fails to load then the subsequent fonts will replace
		"Default"
		{
			"1"
			{
				"name"		"Verdana"
				"tall"		"10"
				"weight"	"900"
				"range"		"0x0000 0x017F" //	Basic Latin, Latin-1 Supplement, Latin Extended-A
				"yres"	"480 599"
				"antialias"	"1"
			}
			"2"
			{
				"name"		"Verdana"
				"tall"		"12"
				"weight"	"900"
				"range"		"0x0000 0x017F" //	Basic Latin, Latin-1 Supplement, Latin Extended-A
				"yres"	"600 767"
				"antialias"	"1"
			}
			"3"
			{
				"name"		"Verdana"
				"tall"		"15"
				"weight"	"900"
				"range"		"0x0000 0x017F" //	Basic Latin, Latin-1 Supplement, Latin Extended-A
				"yres"	"768 1023"
				"antialias"	"1"
			}
			"4"
			{
				"name"		"Verdana"
				"tall"		"20"
				"weight"	"900"
				"range"		"0x0000 0x017F" //	Basic Latin, Latin-1 Supplement, Latin Extended-A
				"yres"	"1024 1199"
				"antialias"	"1"
			}
			"5"
			{
				"name"		"Verdana"
				"tall"		"24"
				"weight"	"900"
				"range"		"0x0000 0x017F" //	Basic Latin, Latin-1 Supplement, Latin Extended-A
				"yres"	"1200 6000"
				"antialias"	"1"
			}
			"6"
			{
				"name"		"Verdana"
				"tall"		"12"
				"range" 		"0x0000 0x00FF"
				"weight"		"900"
				"antialias"	"1"
			}
			"7"
			{
				"name"		"Arial"
				"tall"		"12"
				"range" 		"0x0000 0x00FF"
				"weight"		"800"
				"antialias"	"1"
			}
		}
		"DefaultBig"
		{
			"1"
			{
				"name"		"Verdana"
				"tall"		"12"
				"weight"	"1100"
				"range"		"0x0000 0x017F" //	Basic Latin, Latin-1 Supplement, Latin Extended-A
				"yres"	"480 599"
			}
			"2"
			{
				"name"		"Verdana"
				"tall"		"15"
				"weight"	"1100"
				"range"		"0x0000 0x017F" //	Basic Latin, Latin-1 Supplement, Latin Extended-A
				"yres"	"600 767"
			}
			"3"
			{
				"name"		"Verdana"
				"tall"		"19"
				"weight"	"1100"
				"range"		"0x0000 0x017F" //	Basic Latin, Latin-1 Supplement, Latin Extended-A
				"yres"	"768 1023"
				"antialias"	"1"
			}
			"4"
			{
				"name"		"Verdana"
				"tall"		"26"
				"weight"	"1100"
				"range"		"0x0000 0x017F" //	Basic Latin, Latin-1 Supplement, Latin Extended-A
				"yres"	"1024 1199"
				"antialias"	"1"
			}
			"5"
			{
				"name"		"Verdana"
				"tall"		"30"
				"weight"	"1100"
				"range"		"0x0000 0x017F" //	Basic Latin, Latin-1 Supplement, Latin Extended-A
				"yres"	"1200 6000"
				"antialias"	"1"
			}
			"6"
			{
				"name"		"Verdana"
				"tall"		"18"
				"range" 		"0x0000 0x00FF"
				"weight"		"900"
			}
		}
		"DefaultLarge"
		{
			"1"
			{
				"name"		"Verdana"
				"tall"		"14"
				"weight"	"1100"
				"range"		"0x0000 0x017F" //	Basic Latin, Latin-1 Supplement, Latin Extended-A
				"yres"	"480 599"
			}
			"2"
			{
				"name"		"Verdana"
				"tall"		"18"
				"weight"	"1100"
				"range"		"0x0000 0x017F" //	Basic Latin, Latin-1 Supplement, Latin Extended-A
				"yres"	"600 767"
			}
			"3"
			{
				"name"		"Verdana"
				"tall"		"23"
				"weight"	"1100"
				"range"		"0x0000 0x017F" //	Basic Latin, Latin-1 Supplement, Latin Extended-A
				"yres"	"768 1023"
				"antialias"	"1"
			}
			"4"
			{
				"name"		"Verdana"
				"tall"		"31"
				"weight"	"1100"
				"range"		"0x0000 0x017F" //	Basic Latin, Latin-1 Supplement, Latin Extended-A
				"yres"	"1024 1199"
				"antialias"	"1"
			}
			"5"
			{
				"name"		"Verdana"
				"tall"		"36"
				"weight"	"1100"
				"range"		"0x0000 0x017F" //	Basic Latin, Latin-1 Supplement, Latin Extended-A
				"yres"	"1200 6000"
				"antialias"	"1"
			}
			"6"
			{
				"name"		"Verdana"
				"tall"		"22"
				"range" 		"0x0000 0x00FF"
				"weight"		"900"
			}
		}
		
		"DefaultLarger"
		{
			"1"
			{
				"name"		"Verdana"
				"tall"		"19"
				"weight"	"1100"
				"range"		"0x0000 0x017F" //	Basic Latin, Latin-1 Supplement, Latin Extended-A
				"yres"	"480 599"
			}
			"2"
			{
				"name"		"Verdana"
				"tall"		"24"
				"weight"	"1100"
				"range"		"0x0000 0x017F" //	Basic Latin, Latin-1 Supplement, Latin Extended-A
				"yres"	"600 767"
			}
			"3"
			{
				"name"		"Verdana"
				"tall"		"31"
				"weight"	"1100"
				"range"		"0x0000 0x017F" //	Basic Latin, Latin-1 Supplement, Latin Extended-A
				"yres"	"768 1023"
				"antialias"	"1"
			}
			"4"
			{
				"name"		"Verdana"
				"tall"		"41"
				"weight"	"1100"
				"range"		"0x0000 0x017F" //	Basic Latin, Latin-1 Supplement, Latin Extended-A
				"yres"	"1024 1199"
				"antialias"	"1"
			}
			"5"
			{
				"name"		"Verdana"
				"tall"		"48"
				"weight"	"1100"
				"range"		"0x0000 0x017F" //	Basic Latin, Latin-1 Supplement, Latin Extended-A
				"yres"	"1200 6000"
				"antialias"	"1"
			}
			"6"
			{
				"name"		"Verdana"
				"tall"		"22"
				"range" 		"0x0000 0x00FF"
				"weight"		"900"
			}
		}
		
		"DefaultVeryLarge"
		{
			"1"
			{
				"name"		"Verdana"
				"tall"		"22"
				"weight"	"1300"
				"range"		"0x0000 0x017F" //	Basic Latin, Latin-1 Supplement, Latin Extended-A
				"yres"	"480 599"
			}
			"2"
			{
				"name"		"Verdana"
				"tall"		"28"
				"weight"	"1300"
				"range"		"0x0000 0x017F" //	Basic Latin, Latin-1 Supplement, Latin Extended-A
				"yres"	"600 767"
			}
			"3"
			{
				"name"		"Verdana"
				"tall"		"36"
				"weight"	"1300"
				"range"		"0x0000 0x017F" //	Basic Latin, Latin-1 Supplement, Latin Extended-A
				"yres"	"768 1023"
				"antialias"	"1"
			}
			"4"
			{
				"name"		"Verdana"
				"tall"		"48"
				"weight"	"1300"
				"range"		"0x0000 0x017F" //	Basic Latin, Latin-1 Supplement, Latin Extended-A
				"yres"	"1024 1199"
				"antialias"	"1"
			}
			"5"
			{
				"name"		"Verdana"
				"tall"		"56"
				"weight"	"1300"
				"range"		"0x0000 0x017F" //	Basic Latin, Latin-1 Supplement, Latin Extended-A
				"yres"	"1200 6000"
				"antialias"	"1"
			}
			"6"
			{
				"name"		"Verdana"
				"tall"		"28"
				"range" 		"0x0000 0x00FF"
				"weight"		"900"
			}
		}
		
		"DefaultGigantic"
		{
			"1"
			{
				"name"		"Verdana"
				"tall"		"24"
				"weight"	"1300"
				"range"		"0x0000 0x017F" //	Basic Latin, Latin-1 Supplement, Latin Extended-A
				"yres"	"480 599"
			}
			"2"
			{
				"name"		"Verdana"
				"tall"		"34"
				"weight"	"1300"
				"range"		"0x0000 0x017F" //	Basic Latin, Latin-1 Supplement, Latin Extended-A
				"yres"	"600 767"
			}
			"3"
			{
				"name"		"Verdana"
				"tall"		"42"
				"weight"	"1300"
				"range"		"0x0000 0x017F" //	Basic Latin, Latin-1 Supplement, Latin Extended-A
				"yres"	"768 1023"
				"antialias"	"1"
			}
			"4"
			{
				"name"		"Verdana"
				"tall"		"54"
				"weight"	"1300"
				"range"		"0x0000 0x017F" //	Basic Latin, Latin-1 Supplement, Latin Extended-A
				"yres"	"1024 1199"
				"antialias"	"1"
			}
			"5"
			{
				"name"		"Verdana"
				"tall"		"64"
				"weight"	"1300"
				"range"		"0x0000 0x017F" //	Basic Latin, Latin-1 Supplement, Latin Extended-A
				"yres"	"1200 6000"
				"antialias"	"1"
			}
			"6"
			{
				"name"		"Verdana"
				"tall"		"32"
				"range" 		"0x0000 0x00FF"
				"weight"		"900"
			}
		}

		"UiHeadline"
		{
			"1"
			{
				"name"		"Verdana"
				"tall"		"14"
				"weight"	"700"
				"range"		"0x0000 0x017F" //	Basic Latin, Latin-1 Supplement, Latin Extended-A
				"antialias"	"1"
			}
		}			
		"DefaultUnderline"
		{
			"1"
			{
				"name"		"Tahoma"
				"tall"		"12"
				"weight"	"500"
				"underline" "1"
				"range"		"0x0000 0x017F" //	Basic Latin, Latin-1 Supplement, Latin Extended-A
			}
			"2"
			{
				"name"		"Arial"
				"tall"		"11"
				"range" 		"0x0000 0x00FF"
				"weight"		"800"
			}
		}
		"DefaultSmall"
		{
			"1"
			{
				"name"		"Verdana"
				"tall"		"10"
				"weight"	"0"
				"range"		"0x0000 0x017F"
				"yres"	"480 599"
				"antialias"	"1"
			}
			"2"
			{
				"name"		"Verdana"
				"tall"		"12"
				"weight"	"0"
				"range"		"0x0000 0x017F"
				"yres"	"600 767"
				"antialias"	"1"
			}
			"3"
			{
				"name"		"Verdana"
				"tall"		"15"
				"weight"	"0"
				"range"		"0x0000 0x017F"
				"yres"	"768 1023"
				"antialias"	"1"
			}
			"4"
			{
				"name"		"Verdana"
				"tall"		"20"
				"weight"	"0"
				"range"		"0x0000 0x017F"
				"yres"	"1024 1199"
				"antialias"	"1"
			}
			"5"
			{
				"name"		"Verdana"
				"tall"		"24"
				"weight"	"0"
				"range"		"0x0000 0x017F"
				"yres"	"1200 6000"
				"antialias"	"1"
			}
			"6"
			{
				"name"		"Arial"
				"tall"		"12"
				"range" 		"0x0000 0x00FF"
				"weight"		"0"
				"antialias"	"1"
			}
		}
		"CSUnderline"
		{
			"1"
			{
				"name"		"Verdana"
				"tall"		"12"
				"weight"	"0"
				"range"		"0x0000 0x017F"
				"yres"	"480 599"
				"underline" "1"
			}
			"2"
			{
				"name"		"Verdana"
				"tall"		"13"
				"weight"	"0"
				"range"		"0x0000 0x017F"
				"yres"	"600 767"
				"underline" "1"
			}
			"3"
			{
				"name"		"Verdana"
				"tall"		"14"
				"weight"	"0"
				"range"		"0x0000 0x017F"
				"yres"	"768 1023"
				"antialias"	"1"
				"underline" "1"
			}
			"4"
			{
				"name"		"Verdana"
				"tall"		"20"
				"weight"	"0"
				"range"		"0x0000 0x017F"
				"yres"	"1024 1199"
				"antialias"	"1"
				"underline" "1"
			}
			"5"
			{
				"name"		"Verdana"
				"tall"		"24"
				"weight"	"0"
				"range"		"0x0000 0x017F"
				"yres"	"1200 6000"
				"antialias"	"1"
				"underline" "1"
			}
			"6"
			{
				"name"		"Arial"
				"tall"		"12"
				"range" 		"0x0000 0x00FF"
				"weight"		"0"
				"underline" "1"
			}
		}
		"DefaultVerySmall"
		{
			"1"
			{
				"name"		"Verdana"
				"tall"		"10"
				"weight"	"0"
				"range"		"0x0000 0x017F" //	Basic Latin, Latin-1 Supplement, Latin Extended-A
				"yres"	"480 599"
			}
			"2"
			{
				"name"		"Verdana"
				"tall"		"12"
				"weight"	"0"
				"range"		"0x0000 0x017F" //	Basic Latin, Latin-1 Supplement, Latin Extended-A
				"yres"	"600 767"
			}
			"3"
			{
				"name"		"Verdana"
				"tall"		"15"
				"weight"	"0"
				"range"		"0x0000 0x017F" //	Basic Latin, Latin-1 Supplement, Latin Extended-A
				"yres"	"768 1023"
				"antialias"	"1"
			}
			"4"
			{
				"name"		"Verdana"
				"tall"		"20"
				"weight"	"0"
				"range"		"0x0000 0x017F" //	Basic Latin, Latin-1 Supplement, Latin Extended-A
				"yres"	"1024 1199"
				"antialias"	"1"
			}
			"5"
			{
				"name"		"Verdana"
				"tall"		"24"
				"weight"	"0"
				"range"		"0x0000 0x017F" //	Basic Latin, Latin-1 Supplement, Latin Extended-A
				"yres"	"1200 6000"
				"antialias"	"1"
			}
			"6"
			{
				"name"		"Verdana"
				"tall"		"12"
				"range" 		"0x0000 0x00FF"
				"weight"		"0"
			}
			"7"
			{
				"name"		"Arial"
				"tall"		"11"
				"range" 		"0x0000 0x00FF"
				"weight"		"0"
			}
		}
		// Used by scoreboard and spectator UI for names which don't map in the normal fashion
		"DefaultVerySmallFallBack"
		{
			"1"
			{
				"name"		"Verdana"
				"tall"		"10"
				"weight"	"0"
				"range"		"0x0000 0x017F" //	Basic Latin, Latin-1 Supplement, Latin Extended-A
				"yres"		"480 599"
				"antialias"	"1"
			}
			"2"
			{
				"name"		"Verdana"
				"tall"		"12"
				"weight"	"0"
				"range"		"0x0000 0x017F" //	Basic Latin, Latin-1 Supplement, Latin Extended-A
				"yres"		"600 1199"
				"antialias"	"1"
			}
			"3"
			{
				"name"		"Verdana"
				"tall"		"15"
				"weight"	"0"
				"range"		"0x0000 0x017F" //	Basic Latin, Latin-1 Supplement, Latin Extended-A
				"yres"		"1200 6000"
				"antialias"	"1"
			}
		}
		CenterPrintText
		{
			// note that this scales with the screen resolution
			"1"
			{
				"name"		"Trebuchet MS" [!$OSX]
				"name"		"Helvetica" [$OSX]
				"tall"		"18"
				"weight"	"900"
				"antialias" "1"
				"additive"	"1"
			}
		}
		HudHintText
		{
			"1"
			{
				"name"		"Verdana"
				"tall"		"12"
				"weight"	"700"
				"yres"	"480 599"
			}
			"2"
			{
				"name"		"Verdana"
				"tall"		"13"
				"weight"	"700"
				"yres"	"600 767"
			}
			"3"
			{
				"name"		"Verdana"
				"tall"		"14"
				"weight"	"700"
				"yres"	"768 1023"
			}
			"4"
			{
				"name"		"Verdana"
				"tall"		"20"
				"weight"	"700"
				"yres"	"1024 1199"
			}
			"5"
			{
				"name"		"Verdana"
				"tall"		"24"
				"weight"	"700"
				"yres"	"1200 10000"
			}
		}
		HudNumbersSmall
		{
			"1"
			{
				"name"		"Arial"
				"tall"		"16"
				"weight"	"1000"
				"additive"	"1"
				"antialias" "1"
				"range"		"0x0000 0x017F"
			}
		}

		HudSelectionNumbers
		{
			"1"
			{
				"name"		"Verdana"
				"tall"		"11"
				"weight"	"700"
				"antialias" "1"
				"additive"	"1"
				"range"		"0x0000 0x017F" //	Basic Latin, Latin-1 Supplement, Latin Extended-A
			}
		}

		HudSelectionText
		{
			"1"
			{
				"name"		"Verdana"
				"tall"		"11"
				"weight"	"700"
				"antialias" "1"
				"yres"	"1 599"
				"range"		"0x0000 0x017F" //	Basic Latin, Latin-1 Supplement, Latin Extended-A
				"additive"	"1"
			}
			"2"
			{
				"name"		"Verdana"
				"tall"		"11"
				"weight"	"700"
				"antialias" "1"
				"yres"	"600 767"
				"range"		"0x0000 0x017F" //	Basic Latin, Latin-1 Supplement, Latin Extended-A
				"additive"	"1"
			}
			"3"
			{
				"name"		"Verdana"
				"tall"		"12"
				"weight"	"900"
				"antialias" "1"
				"yres"	"768 1023"
				"range"		"0x0000 0x017F" //	Basic Latin, Latin-1 Supplement, Latin Extended-A
			}
			"4"
			{
				"name"		"Verdana"
				"tall"		"16"
				"weight"	"900"
				"antialias" "1"
				"yres"	"1024 1199"
				"range"		"0x0000 0x017F" //	Basic Latin, Latin-1 Supplement, Latin Extended-A
			}
			"5"
			{
				"name"		"Verdana"
				"tall"		"17"
				"weight"	"1000"
				"antialias" "1"
				"yres"	"1200 10000"
				"range"		"0x0000 0x017F" //	Basic Latin, Latin-1 Supplement, Latin Extended-A
			}
		}

		BudgetLabel
		{
			"1"
			{
				"name"		"Courier New"
				"tall"		"14"
				"weight"	"400"
				"outline"	"1"
				"range"		"0x0000 0x017F" //	Basic Latin, Latin-1 Supplement, Latin Extended-A
			}
		}
		DebugOverlay
		{
			"1"
			{
				"name"		"Courier New"
				"tall"		"14"
				"weight"	"400"
				"outline"	"1"
				"range"		"0x0000 0x017F" //	Basic Latin, Latin-1 Supplement, Latin Extended-A
			}
		}
		CSType
		  {
		   "1"
		   {
			"name"  "cs" // cs.ttf
			"tall"  "80"
			"weight" "0"
			"additive" "1"
			"antialias" "1"
			"custom" "1" [$OSX]
		   }
		  }

		CSweapons // temporary, for testing. overlaps with CSType, above
		  {
		   "1"
		   {
			"name"  "Counter-Strike" // Cstrike.ttf
			"tall"  "70"
			"weight" "0"
			"additive" "1"
			"antialias" "1"
			"custom" "1" [$OSX]
		   }
		  }

		CSweaponsSmall 
		  {
		   "1"
		   {
			"name"  "Counter-Strike" // Cstrike.ttf
			"tall"  "60"
			"weight" "0"
			"additive" "1"
			"antialias" "1"
			"custom" "1" [$OSX]
		   }
		  }

		
		CSTypeSmall
		  {
		   "1"
		   {
			"name"  "cs" // cs.ttf
			"tall"  "40"
			"weight" "20"
			"additive" "1"
			"antialias" "1"
			"custom" "1" [$OSX]
		   }
		  }
		  
		  CSTypelr
		  {
		   "1"
		   {
			"name"  "cs" // cs.ttf
			"tall"  "30"
			"weight" "0"
			"additive" "1"
			"antialias" "1"
			"custom" "1" [$OSX]
		   }
		  }

		  CSTypeDeath
		  {
		   "1"
		   {
			"name"  "csd" // csd.ttf
			"tall"  "42"
			"weight" "0"
			"additive" "1"
			"antialias" "1"
			"custom" "1" [$OSX]
		   }
		  }
		
		Icons
		{
			"1"
			 {
			"name"  "Counter-Strike" // Cstrike.ttf
			"tall"  "28"
			"weight" "0"
			"additive" "1"
			"antialias" "1"
			"custom" "1" [$OSX]
			 }
		}
		IconsSmall
		{
			"1"
			 {
			"name"  "Counter-Strike" // Cstrike.ttf
			"tall"  "20"
			"weight" "0"
			"additive" "0"
			"antialias" "1"
			"custom" "1" [$OSX]
			 }
		}		

		ClientTitleFont
		{
			"1"
			{
				"name"  "Counter-Strike Logo" // CSlogo.ttf
				"tall"  "60"
				"weight" "0"
				"additive" "0"
				"antialias" "1"
			}
		}

		"BetaFont"
		{
			"1"
			{
				"name"		"Courier New"
				"tall"		"90"
				"weight"	"900"
				"range"		"0x0000 0x007F"	//	Basic Latin
				"antialias" "1"
				"additive"	"0"
			}
		}

		HudNumbers
		{
			"1"
			{
				"name"  "Counter-Strike" // Cstrike.ttf
				"tall"  "28"
				"weight" "0"
				"additive" "1"
				"antialias" "1"
			}
			"2"
			{
				"name"  "Verdana"
				"tall"  "28"
				"weight" "0"
				"additive" "1"
				"antialias" "1"
			}
		}
		"CloseCaption_Normal"
		{
			"1"
			{
				"name"		"Tahoma"
				"tall"		"16"
				"weight"	"500"
				"range"		"0x0000 0x017F" //	Basic Latin, Latin-1 Supplement, Latin Extended-A
			}
		}
		"CloseCaption_Italic"
		{
			"1"
			{
				"name"		"Tahoma"
				"tall"		"16"
				"weight"	"500"
				"italic"	"1"
				"range"		"0x0000 0x017F" //	Basic Latin, Latin-1 Supplement, Latin Extended-A
			}
		}
		"CloseCaption_Bold"
		{
			"1"
			{
				"name"		"Tahoma"
				"tall"		"16"
				"weight"	"900"
				"range"		"0x0000 0x017F" //	Basic Latin, Latin-1 Supplement, Latin Extended-A
			}
		}
		"CloseCaption_BoldItalic"
		{
			"1"
			{
				"name"		"Tahoma"
				"tall"		"16"
				"weight"	"900"
				"italic"	"1"
				"range"		"0x0000 0x017F" //	Basic Latin, Latin-1 Supplement, Latin Extended-A
			}
		}
		// this is the symbol font
		"Marlett"
		{
			"1"
			{
				"name"		"Marlett"
				"tall"		"11"
				"weight"	"0"
				"symbol"	"1"
				"range"		"0x0000 0x007F"	//	Basic Latin
			}
		}
		"MenuTitle"
		{
			"1"
			{
				"name"		"Verdana Bold"
				"tall"		"18"
				"weight"	"500"
				"antialias"	"1"
			}
		}
		"Trebuchet24"
		{
			"1"
			{
				"name"		"Trebuchet MS"
				"tall"		"24"
				"weight"	"900"
				"range"		"0x0000 0x007F"	//	Basic Latin
				"antialias" "1"
				"additive"	"1"
			}
		}
		"Trebuchet20"
		{
			"1"
			{
				"name"		"Trebuchet MS"
				"tall"		"20"
				"weight"	"900"
				"range"		"0x0000 0x007F"	//	Basic Latin
				"antialias" "1"
				"additive"	"1"
			}
		}
		"Trebuchet18"
		{
			"1"
			{
				"name"		"Trebuchet MS"
				"tall"		"18"
				"weight"	"900"
				"range"		"0x0000 0x007F"	//	Basic Latin
				"antialias" "1"
				"additive"	"1"
			}
		}
		"TargetID"
		{
			"1"
			{
				"name"		"Verdana"
				"tall"		"12"
				"weight"	"700"
				"yres"	"480 599"
				"dropshadow"	"0"
			}
			"2"
			{
				"name"		"Verdana"
				"tall"		"13"
				"weight"	"700"
				"yres"	"600 767"
				"dropshadow"	"0"
			}
			"3"
			{
				"name"		"Verdana"
				"tall"		"14"
				"weight"	"700"
				"yres"	"768 1023"
				"dropshadow"	"0"
			}
			"4"
			{
				"name"		"Verdana"
				"tall"		"20"
				"weight"	"700"
				"yres"	"1024 1199"
				"dropshadow"	"0"
			}
			"5"
			{
				"name"		"Verdana"
				"tall"		"24"
				"weight"	"700"
				"yres"	"1200 10000"
				"dropshadow"	"0"
			}
		}
		"ChatFont"
		{
			"1"
			{
				"name"		"Verdana"
				"tall"		"12"
				"weight"	"700"
				"yres"	"480 599"
				"dropshadow"	"1"
			}
			"2"
			{
				"name"		"Verdana"
				"tall"		"13"
				"weight"	"700"
				"yres"	"600 767"
				"dropshadow"	"1"
			}
			"3"
			{
				"name"		"Verdana"
				"tall"		"14"
				"weight"	"700"
				"yres"	"768 1023"
				"dropshadow"	"1"
			}
			"4"
			{
				"name"		"Verdana"
				"tall"		"20"
				"weight"	"700"
				"yres"	"1024 1199"
				"dropshadow"	"1"
			}
			"5"
			{
				"name"		"Verdana"
				"tall"		"24"
				"weight"	"700"
				"yres"	"1200 10000"
				"dropshadow"	"1"
			}
		}
		
		//Stolen from SourceScheme to make the fonts a little smaller
		"AchievementTitleFont"
		{
			"1"
			{
				"name"		"Verdana" [!$OSX]
				"name"		"Verdana Bold" [$OSX]
				"tall"		"16"
				"weight"	"1200"
				"antialias" "1"
				"outline" "1"
			}
		}
		"AchievementDescriptionFont"
		{
			"1"
			{
				"name"		"Verdana" [!$OSX]
				"name"		"Verdana Bold" [$OSX]
				"tall"		"12"
				"weight"	"1200"
				"antialias" "1"
				"outline" "1"
				"yres"		"0 480"
			}
			"2"
			{
				"name"		"Verdana" [!$OSX]
				"name"		"Verdana Bold" [$OSX]
				"tall"		"16"
				"weight"	"1200"
				"antialias" "1"
				"outline" "1"
				"yres"	 "481 10000"
			}
		}	
		
		
		AchievementItemTitle	[$WIN32]
		{
			"1"
			{
				"name"		"Arial" [!$OSX]
				"name"		"Helvetica Bold" [$OSX]
				"weight"		"1200"
				"tall"			"11"
				"antialias"		"1"
			}
		}
		
		AchievementItemDescription	[$WIN32]
		{
			"1"
			{
				"name"		"Arial" [!$OSX]
				"name"		"Helvetica" [$OSX]
				"weight"		"800"
				"tall"			"9"
				"antialias"		"1"
			}
		}
		
		AchievementPopupTitle	[$WIN32]
		{
			"1"
			{
				"name"		"Verdana" [!$OSX]
				"name"		"Helvetica Bold" [$OSX]
				"weight"		"1200"
				"tall"			"12"
				"antialias"		"1"
			}
		}
		
		AchievementPopupDescription	[$WIN32]
		{
			"1"
			{
				"name"		"Verdana" [!$OSX]
				"name"		"Helvetica" [$OSX]
				"weight"		"700"
				"tall"			"9"
				"antialias"		"1"
			}
		}
		
		"FreezeSmall"
		{		
			"1"
			{
				"name"		"Verdana Bold" [!$OSX]
				"name"		"Helvetica" [$OSX]
				"tall"		"9"
				"weight"	"900"
				"range"		"0x0000 0x017F" //	Basic Latin, Latin-1 Supplement, Latin Extended-A			
				"antialias"	"1" [!$OSX]
			}	
		}
		
		"FreezeMedium"	// used by the freeze panel
		{		
			"1"
			{
				"name"		"Verdana Bold" [!$OSX]
				"name"		"Helvetica" [$OSX]
				"tall"		"14"
				"weight"	"600"
				"range"		"0x0000 0x017F" //	Basic Latin, Latin-1 Supplement, Latin Extended-A				
				"antialias"	"1"
			}	
		}
		
		"FreezeLarge"
		{	
			"1"
			{
				"name"		"Verdana Bold" [!$OSX]
				"name"		"Helvetica" [$OSX]
				"tall"		"18"
				"weight"	"600"
				"range"		"0x0000 0x017F" //	Basic Latin, Latin-1 Supplement, Latin Extended-A				
				"antialias"	"1"
			}	
		}

		"WinPanelLarge"
		{
			"1"
			{
				"name"		"Verdana" [!$OSX]
				"name"		"Helvetica" [$OSX]
				"tall"		"14"
				"weight"	"700"
				"range"		"0x0000 0x017F" //	Basic Latin, Latin-1 Supplement, Latin Extended-A
				"antialias"	"1" [!$OSX]
			}
		}

		"WinPanelTiny"
		{
			"1"
			{
				"name"		"Verdana Bold" [!$OSX]
				"name"		"Verdana" [$OSX]
				"tall"		"9" 
				"weight"	"0"
				"range"		"0x0000 0x017F" //	Basic Latin, Latin-1 Supplement, Latin Extended-A
				"antialias"	"1" [!$OSX]
			}
		}

		WinPanelClock
		{
			"1"
			{
				"name"		"Counter-Strike" // Cstrike.ttf
				"tall"		"14"
				"weight"	"0"
				"additive"	"1"
				"antialias"	"1"
			}
		}

		"HUDAchievementTiny"
		{
			"1"
			{
				"name"		"Verdana"
				"tall"		"6"
				"weight"	"0"
				"range"		"0x0000 0x017F" //	Basic Latin, Latin-1 Supplement, Latin Extended-A
				"yres"		"480 599"
			}
			"2"
			{
				"name"		"Verdana"
				"tall"		"8"
				"weight"	"0"
				"range"		"0x0000 0x017F" //	Basic Latin, Latin-1 Supplement, Latin Extended-A
				"yres"		"600 767"
			}
			"3"
			{
				"name"		"Verdana"
				"tall"		"10"
				"weight"	"0"
				"range"		"0x0000 0x017F" //	Basic Latin, Latin-1 Supplement, Latin Extended-A
				"yres"		"768 959"
				"antialias"	"1"
			}
			"4"
			{
				"name"		"Verdana"
				"tall"		"13"
				"weight"	"0"
				"range"		"0x0000 0x017F" //	Basic Latin, Latin-1 Supplement, Latin Extended-A
				"yres"		"960 1023"
				"antialias"	"1" [!$OSX]
			}
			"5"
			{
				"name"		"Verdana"
				"tall"		"14"
				"weight"	"0"
				"range"		"0x0000 0x017F" //	Basic Latin, Latin-1 Supplement, Latin Extended-A
				"yres"		"1024 1199"
				"antialias"	"1" [!$OSX]
			}
			"6"
			{
				"name"		"Verdana"
				"tall"		"16"
				"weight"	"0"
				"range"		"0x0000 0x017F" //	Basic Latin, Latin-1 Supplement, Latin Extended-A
				"yres"		"1200 6000"
				"antialias"	"1" [!$OSX]
			}
		}

		"ScoreboardHeader"
		{
			"1"
			{
				"name"		"verdana bold"
				"tall"		"8"
				"weight"	"0"
				"range"		"0x0000 0x017F" //	Basic Latin, Latin-1 Supplement, Latin Extended-A
				"antialias"	"1"
			}
		}

		"ScoreboardTeamName"
		{
			"1"
			{
				"name"		"verdana bold"
				"tall"		"14"
				"weight"	"0"
				"range"		"0x0000 0x017F" //	Basic Latin, Latin-1 Supplement, Latin Extended-A
				"antialias"	"1"
			}
		}

		"ScoreboardScore"
		{
			"1"
			{
				"name"		"verdana bold"
				"tall"		"45"
				"weight"	"0"
				"range"		"0x0000 0x017F" //	Basic Latin, Latin-1 Supplement, Latin Extended-A
				"antialias"	"1"
			}
		}

		"ScoreboardColumns"
		{
			"1"
			{
				"name"		"verdana bold"
				"tall"		"8"
				"weight"	"0"
				"range"		"0x0000 0x017F" //	Basic Latin, Latin-1 Supplement, Latin Extended-A
				"antialias"	"1" [!$OSX]
			}
		}
		
		"ScoreboardPlayersAlive"
		{
			"1"
			{
				"name"		"verdana bold"
				"tall"		"12"
				"weight"	"0"
				"range"		"0x0000 0x017F" //	Basic Latin, Latin-1 Supplement, Latin Extended-A
				"antialias"	"1"
			}
		}
		
		"ScoreboardPlayersAliveSuffix"
		{
			"1"
			{
				"name"		"verdana bold"
				"tall"		"10"
				"weight"	"0"
				"range"		"0x0000 0x017F" //	Basic Latin, Latin-1 Supplement, Latin Extended-A
				"antialias"	"1"
			}
		}

		"ScoreboardBody_1"
		{
			"1"
			{
				"name"		"verdana" 
				"tall"		"10" [!$OSX]
				"tall"		"11" [$OSX]
				"weight"	"0"
				"range"		"0x0000 0x017F" //	Basic Latin, Latin-1 Supplement, Latin Extended-A
				"antialias"	"1"
			}
		}

		"ScoreboardBody_2"
		{
			"1"
			{
				"name"		"verdana" 
				"tall"		"8" [!$OSX]
				"tall"		"9" [$OSX]
				"weight"	"0"
				"range"		"0x0000 0x017F" //	Basic Latin, Latin-1 Supplement, Latin Extended-A
				"antialias"	"1"
			}
		}

		"ScoreboardBody_3"
		{
			"1"
			{
				"name"		"verdana" 
				"tall"		"7" [!$OSX]
				"tall"		"8" [$OSX]
				"weight"	"0"
				"range"		"0x0000 0x017F" //	Basic Latin, Latin-1 Supplement, Latin Extended-A
				"antialias"	"1"
			}
		}

		"ScoreboardMVP"
		{
			"1"
			{
				"name"		"verdana"
				"tall"		"10"
				"weight"	"0"
				"range"		"0x0000 0x017F" //	Basic Latin, Latin-1 Supplement, Latin Extended-A
				"antialias"	"1"
			}
		}
	}

	//
	//////////////////// BORDERS //////////////////////////////
	//
	// describes all the border types
	Borders
	{
		BaseBorder
		{
			"inset" "0 0 1 1"
			Left
			{
				"1"
				{
					"color" "Border.Dark"
					"offset" "0 1"
				}
			}

			Right
			{
				"1"
				{
					"color" "Border.Bright"
					"offset" "1 0"
				}
			}

			Top
			{
				"1"
				{
					"color" "Border.Dark"
					"offset" "0 0"
				}
			}

			Bottom
			{
				"1"
				{
					"color" "Border.Bright"
					"offset" "0 0"
				}
			}
		}
		
		TitleButtonBorder
		{
			"inset" "0 0 1 1"
			Left
			{
				"1"
				{
					"color" "Border.Bright"
					"offset" "0 1"
				}
			}

			Right
			{
				"1"
				{
					"color" "Border.Dark"
					"offset" "1 0"
				}
			}

			Top
			{
				"1"
				{
					"color" "Border.Bright"
					"offset" "0 0"
				}
			}

			Bottom
			{
				"1"
				{
					"color" "Border.Dark"
					"offset" "0 0"
				}
			}
		}

		TitleButtonDisabledBorder
		{
			"inset" "0 0 1 1"
			Left
			{
				"1"
				{
					"color" "BgColor"
					"offset" "0 1"
				}
			}

			Right
			{
				"1"
				{
					"color" "BgColor"
					"offset" "1 0"
				}
			}
			Top
			{
				"1"
				{
					"color" "BgColor"
					"offset" "0 0"
				}
			}

			Bottom
			{
				"1"
				{
					"color" "BgColor"
					"offset" "0 0"
				}
			}
		}

		TitleButtonDepressedBorder
		{
			"inset" "1 1 1 1"
			Left
			{
				"1"
				{
					"color" "Border.Dark"
					"offset" "0 1"
				}
			}

			Right
			{
				"1"
				{
					"color" "Border.Bright"
					"offset" "1 0"
				}
			}

			Top
			{
				"1"
				{
					"color" "Border.Dark"
					"offset" "0 0"
				}
			}

			Bottom
			{
				"1"
				{
					"color" "Border.Bright"
					"offset" "0 0"
				}
			}
		}

		ScrollBarButtonBorder
		{
			"inset" "1 0 0 0"
			Left
			{
				"1"
				{
					"color" "Border.Bright"
					"offset" "0 1"
				}
			}

			Right
			{
				"1"
				{
					"color" "Border.Dark"
					"offset" "1 0"
				}
			}

			Top
			{
				"1"
				{
					"color" "Border.Bright"
					"offset" "0 0"
				}
			}

			Bottom
			{
				"1"
				{
					"color" "Border.Dark"
					"offset" "0 0"
				}
			}
		}

		ScrollBarButtonDepressedBorder
		{
			"inset" "2 2 0 0"
			Left
			{
				"1"
				{
					"color" "Border.Dark"
					"offset" "0 1"
				}
			}

			Right
			{
				"1"
				{
					"color" "Border.Bright"
					"offset" "1 0"
				}
			}

			Top
			{
				"1"
				{
					"color" "Border.Dark"
					"offset" "0 0"
				}
			}

			Bottom
			{
				"1"
				{
					"color" "Border.Bright"
					"offset" "0 0"
				}
			}
		}
		
		ButtonBorder
		{
			"inset" "0 0 0 0"
			Left
			{
				"1"
				{
					"color" "Border.Bright"
					"offset" "0 1"
				}
			}

			Right
			{
				"1"
				{
					"color" "Border.Dark"
					"offset" "0 0"
				}
			}

			Top
			{
				"1"
				{
					"color" "Border.Bright"
					"offset" "1 1"
				}
			}

			Bottom
			{
				"1"
				{
					"color" "Border.Dark"
					"offset" "0 0"
				}
			}
		}

		FrameBorder
		{
			"inset" "0 0 1 1"
			Left
			{
				"1"
				{
					"color" "ControlBG"
					"offset" "0 1"
				}
			}

			Right
			{
				"1"
				{
					"color" "ControlBG"
					"offset" "0 0"
				}
			}

			Top
			{
				"1"
				{
					"color" "ControlBG"
					"offset" "0 1"
				}
			}

			Bottom
			{
				"1"
				{
					"color" "ControlBG"
					"offset" "0 0"
				}
			}
		}

		TabBorder
		{
			"inset" "0 0 1 1"
			Left
			{
				"1"
				{
					"color" "Border.Bright"
					"offset" "0 1"
				}
			}

			Right
			{
				"1"
				{
					"color" "Border.Dark"
					"offset" "1 0"
				}
			}

			Top
			{
				"1"
				{
					"color" "Border.Bright"
					"offset" "0 0"
				}
			}

			Bottom
			{
				"1"
				{
					"color" "Border.Bright"
					"offset" "0 0"
				}
			}
		}

		TabActiveBorder
		{
			"inset" "0 0 1 0"
			Left
			{
				"1"
				{
					"color" "Border.Bright"
					"offset" "0 0"
				}
			}

			Right
			{
				"1"
				{
					"color" "Border.Dark"
					"offset" "1 0"
				}
			}

			Top
			{
				"1"
				{
					"color" "Border.Bright"
					"offset" "0 0"
				}
			}

			Bottom
			{
				"1"
				{
					"color" "ControlBG"
					"offset" "6 2"
				}
			}
		}


		ToolTipBorder
		{
			"inset" "0 0 1 0"
			Left
			{
				"1"
				{
					"color" "Border.Dark"
					"offset" "0 0"
				}
			}

			Right
			{
				"1"
				{
					"color" "Border.Dark"
					"offset" "1 0"
				}
			}

			Top
			{
				"1"
				{
					"color" "Border.Dark"
					"offset" "0 0"
				}
			}

			Bottom
			{
				"1"
				{
					"color" "Border.Dark"
					"offset" "0 0"
				}
			}
		}

		// this is the border used for default buttons (the button that gets pressed when you hit enter)
		ButtonKeyFocusBorder
		{
			"inset" "0 0 0 0"
			Left
			{
				"1"
				{
					"color" "Border.Bright"
					"offset" "0 1"
				}
			}

			Right
			{
				"1"
				{
					"color" "Border.Dark"
					"offset" "0 0"
				}
			}

			Top
			{
				"1"
				{
					"color" "Border.Bright"
					"offset" "1 1"
				}
			}

			Bottom
			{
				"1"
				{
					"color" "Border.Dark"
					"offset" "0 0"
				}
			}
		}

		ButtonDepressedBorder
		{
			"inset" "0 0 0 0"
			Left
			{
				"1"
				{
					"color" "Border.Bright"
					"offset" "0 1"
				}
			}

			Right
			{
				"1"
				{
					"color" "Border.Dark"
					"offset" "0 0"
				}
			}

			Top
			{
				"1"
				{
					"color" "Border.Bright"
					"offset" "1 1"
				}
			}

			Bottom
			{
				"1"
				{
					"color" "Border.Dark"
					"offset" "0 0"
				}
			}
		}

		ComboBoxBorder
		{
			"inset" "0 0 1 1"
			Left
			{
				"1"
				{
					"color" "Border.Dark"
					"offset" "0 1"
				}
			}

			Right
			{
				"1"
				{
					"color" "Border.Bright"
					"offset" "1 0"
				}
			}

			Top
			{
				"1"
				{
					"color" "Border.Dark"
					"offset" "0 0"
				}
			}

			Bottom
			{
				"1"
				{
					"color" "Border.Bright"
					"offset" "0 0"
				}
			}
		}

		MenuBorder
		{
			"inset" "1 1 1 1"
			Left
			{
				"1"
				{
					"color" "Border.Bright"
					"offset" "0 1"
				}
			}

			Right
			{
				"1"
				{
					"color" "Border.Dark"
					"offset" "1 0"
				}
			}

			Top
			{
				"1"
				{
					"color" "Border.Bright"
					"offset" "0 0"
				}
			}

			Bottom
			{
				"1"
				{
					"color" "Border.Dark"
					"offset" "0 0"
				}
			}
		}
		BrowserBorder
		{
			"inset" "0 0 0 0"
			Left
			{
				"1"
				{
					"color" "Border.Dark"
					"offset" "0 0"
				}
			}

			Right
			{
				"1"
				{
					"color" "Border.Bright"
					"offset" "0 0"
				}
			}

			Top
			{
				"1"
				{
					"color" "Border.Dark"
					"offset" "0 0"
				}
			}

			Bottom
			{
				"1"
				{
					"color" "Border.Bright"
					"offset" "0 0"
				}
			}
		}

		BuyPresetBorder
		{
			"inset" "0 0 0 0"
			Left
			{
				"1"
				{
					"color" "Border.BuyPreset"
					"offset" "0 1"
				}
			}

			Right
			{
				"1"
				{
					"color" "Border.BuyPreset"
					"offset" "0 0"
				}
			}

			Top
			{
				"1"
				{
					"color" "Border.BuyPreset"
					"offset" "1 1"
				}
			}

			Bottom
			{
				"1"
				{
					"color" "Border.BuyPreset"
					"offset" "0 0"
				}
			}
		}

		BuyPresetButtonBorder
		{
			"inset" "0 0 0 0"
			Left
			{
				"1"
				{
					"color" "Blank"
					"offset" "0 1"
				}
			}

			Right
			{
				"1"
				{
					"color" "Border.Dark"
					"offset" "0 0"
				}
			}

			Top
			{
				"1"
				{
					"color" "Border.Bright"
					"offset" "1 1"
				}
			}

			Bottom
			{
				"1"
				{
					"color" "Blank"
					"offset" "0 0"
				}
			}
		}
		
		BlackBorder
		{
			"inset" "0 0 0 0"
			Left
			{
				"1"
				{
					"color" "Black"
					"offset" "0 1"
				}
			}

			Right
			{
				"1"
				{
					"color" "Black"
					"offset" "0 0"
				}
			}

			Top
			{
				"1"
				{
					"color" "Black"
					"offset" "1 1"
				}
			}

			Bottom
			{
				"1"
				{
					"color" "Black"
					"offset" "0 0"
				}
			}
		}
	}

	//////////////////////// CUSTOM FONT FILES /////////////////////////////
	//
	// specifies all the custom (non-system) font files that need to be loaded to service the above described fonts
	CustomFontFiles
	{
		"1"		"resource/cs.ttf"
		"2"		"resource/csd.ttf"
		"3"		"resource/Cstrike.ttf"
		"4"		"resource/CSlogo.ttf"
	}

}
