"Resource/UI/TextWindow.res"
{
	"info"
	{
		"ControlName"		"CTextWindow"
		"fieldName"		"TextWindow"
		"xpos"			"0"
		"ypos"			"0"
		"wide"			"640"
		"tall"			"480"
		"autoResize"		"0"
		"pinCorner"		"0"
		"visible"		"0"
		"enabled"		"1"
		"tabPosition"	"0"
	}

	// full screen vgui/motd
	"HTMLMessage"
	{
		"ControlName"		"HTML"
		"fieldName"		"HTMLMessage"
		// "xpos"			"76"
		// "ypos"			"116"
		"xpos"			"-110"
		"ypos"			"0"
		// "wide"			"480"
		// "tall"			"240"
		"wide"			"858"
		"tall"			"480"
		"autoResize"		"0"
		"pinCorner"		"0"
		"visible"		"1"
		"enabled"		"1"
	}
	
	"TextMessage"
	{
		"ControlName"		"TextEntry"
		"fieldName"		"TextMessage"
		// "xpos"			"76"
		// "ypos"			"116"
		"xpos"			"0"
		"ypos"			"0"
		// "wide"			"480"
		// "tall"			"240"
		"wide"			"0"
		"tall"			"0"
		"autoResize"		"0"
		"pinCorner"		"0"
		"visible"		"1"
		"enabled"		"1"
		"textAlignment"		"northwest"
		"textHidden"		"0"
		"editable"		"0"
		"maxchars"		"-1"
		"NumericInputOnly"	"0"
	}
	
	"MessageTitle"
	{
		"ControlName"		"Label"
		"fieldName"		"MessageTitle"
		// "xpos"		"76"
		// "ypos"		"22"
		"xpos"		"0"
		"ypos"		"0"
		// "wide"		"450"
		// "tall"		"48"
		"wide"		"0"
		"tall"		"0"
		"autoResize"		"0"
		"pinCorner"		"0"
		// "visible"		"1"
		// "enabled"		"1"
		"visible"		"0"
		"enabled"		"0"
		"labelText"		"Message Title"
		"textAlignment"		"west"
		"dulltext"		"0"
		"brighttext"		"0"
		"font"		"MenuTitle"
	}
	
	"ok"
	{
		"ControlName"		"Button"
		"fieldName"		"ok"
		// "xpos"			"76"
		// "ypos"			"364"
		"xpos"			"520"
		"ypos"			"440"
		"wide"			"128"
		"tall"			"20"
		"autoResize"		"0"
		// "pinCorner"		"2"
		"pinCorner"		"0"
		// "visible"		"1"
		// "enabled"		"1"
		"visible"		"0"
		"enabled"		"0"
		"labelText"		"#PropertyDialog_OK"
		"textAlignment"		"center"
		"dulltext"		"0"
		"brighttext"		"0"
		"command"		"okay"
		"default"		"1"
	}
}
