
"Resource/HudLayout.res"
{
	HudHealth
	{
		"fieldName"		"HudHealth"
		"xpos"	"8"
		"ypos"	"446"
		"zpos"	"0"
		"wide"	"80"
		"tall"  "25"
		"visible" "1"
		"enabled" "1"

		"PaintBackgroundType"	"2"
		"bgcolor_override"		"0 0 0 96"
		
		"icon_xpos"	"8"
		"icon_ypos"	"-4"
		"digit_xpos" "35"
		"digit_ypos" "-4"
		"LowHealthColor"	"HudIcon_Red"
	}
	
	HudArmor
	{
		"fieldName"		"HudArmor"
		//"xpos"	"148"
		"xpos"	"98"
		"ypos"	"446"
		"zpos"	"1"
		"wide"	"80"
		"tall"  "25"
		"visible" "1"
		"enabled" "1"

		"PaintBackgroundType"	"2"
		"bgcolor_override"		"0 0 0 96"
		
		"icon_xpos"	"8"
		"icon_ypos"	"-4"
		"digit_xpos" "34"
		"digit_ypos" "-4"
	}
	
	HudRoundTimer
	{
		"fieldName" "HudRoundTimer"
		"xpos"	"c-28"
		"ypos"	"446"
		"zpos"	"1"
		"wide"	"98"
		"tall"  "25"
		"visible" "1"
		"enabled" "1"
		
		"PaintBackgroundType"	"2"
 		"bgcolor_override"		"0 0 0 96"

		"FlashColor" "HudIcon_Red"		

		"icon_xpos"		"8"
		"icon_ypos"		"-4"
		"digit_xpos"	"42"
		"digit_ypos"	"-4"
	}

	HudAmmo
	{
		"fieldName" "HudAmmo"
		"xpos"	"r157"
		"ypos"	"446"
		"zpos"	"1"
		"wide"	"142"
		"tall"  "25"
		"visible" "1"
		"enabled" "1"

		"PaintBackgroundType"	"2"
 		"bgcolor_override"		"0 0 0 96"

		"digit_xpos" "8"
		"digit_ypos" "-4"
		"digit2_xpos" "63"
		"digit2_ypos" "-4"
	
		"bar_xpos"		"53"
		"bar_ypos"		"3"
		"bar_height"	"20"
		"bar_width"		"2"

		"icon_xpos"		"110"
		"icon_ypos"		"2"
	}

	HudAccount
	{
		"fieldName" "HudAccount"
		"xpos"	"r123"
		"ypos"	"394"
		"wide"	"108"
		"tall"  "45"
		"visible" "1"
		"enabled" "1"

		"PaintBackgroundType"	"2"
		// "bgcolor_override"		"0 0 0 96"

		"icon_xpos"	"9"
		"icon_ypos"	"16"
		"digit_xpos" "100"
		"digit_ypos" "16"
		"icon2_xpos" "9"
		"icon2_ypos" "-4"
		"digit2_xpos" "100"
		"digit2_ypos" "-4"
	}

	overview
	{
		"fieldname"				"overview"
		"visible"				"1"
		"enabled"				"1"
		"xpos"					"0"
		"ypos"					"480"
		"wide"					"0"
		"tall"					"0"
	}

	HudCommentary
	{
		"fieldName" "HudCommentary"
		"xpos"	"c-190"
		"ypos"	"350"
		"wide"	"380"
		"tall"  "40"
		"visible" "1"
		"enabled" "1"
		
		"PaintBackgroundType"	"2"
		
		"bar_xpos"		"50"
		"bar_ypos"		"20"
		"bar_height"	"8"
		"bar_width"		"320"
		"speaker_xpos"	"50"
		"speaker_ypos"	"8"
		"count_xpos_from_right"	"10"	// Counts from the right side
		"count_ypos"	"8"
		
		"icon_texture"	"vgui/hud/icon_commentary"
		"icon_xpos"		"0"
		"icon_ypos"		"0"		
		"icon_width"	"40"
		"icon_height"	"40"
	}
	
	HudHDRDemo
	{
		"fieldName" "HudHDRDemo"
		"xpos"	"0"
		"ypos"	"0"
		"wide"	"640"
		"tall"  "480"
		"visible" "0"
		"enabled" "1"
		
		"Alpha"	"255"
		"PaintBackgroundType"	"2"
		
		"BorderColor"	"0 0 0 255"
		"BorderLeft"	"16"
		"BorderRight"	"16"
		"BorderTop"		"16"
		"BorderBottom"	"64"
		"BorderCenter"	"0"
		
		"TextColor"		"255 255 255 255"
		"LeftTitleY"	"422"
		"RightTitleY"	"422"
	}

	TargetID
	{
		"fieldName" "TargetID"
		"visible" "1"
		"enabled" "1"
		"wide"	 "640"
		"tall"	 "480"
	}

	HudSuit
	{
		"fieldName"		"HudSuit"
		"xpos"	"140"
		"ypos"	"432"
		"wide"	"108"
		"tall"  "36"
		"visible" "1"
		"enabled" "1"

		"PaintBackgroundType"	"2"

		
		"text_xpos" "8"
		"text_ypos" "20"
		"digit_xpos" "50"
		"digit_ypos" "2"
	}

	HudProgressBar
	{
		"fieldName" "HudProgressBar"
		"xpos"	"c-150"
		"ypos"	"300"
		"wide"	"300"
		"tall"  "15"
		"visible" "1"
		"enabled" "1"

		"BorderThickness" "1"

		"PaintBackgroundType"	"2"
	}

	HudShoppingCart
	{
		"fieldName" "HudShoppingCart"
		"xpos"	"64"
		"ypos"	"240"
		"wide"	"40"
		"tall"  "40"
		"visible" "1"
		"enabled" "1"

		"PaintBackgroundType"	"2"
		"IconColor"			"HudIcon_Green"

	}

	HudC4
	{
		"fieldName" "HudC4"
		"xpos"	"16"
		"ypos"	"240"
		"wide"	"40"
		"tall"  "40"
		"visible" "1"
		"enabled" "1"
	

		"PaintBackgroundType"	"2"
		"IconColor"			"HudIcon_Green"
		"FlashColor"		"HudIcon_Red"

	}

	HudDefuser
	{
		"fieldName" "HudDefuser"
		"xpos"	"16"
		"ypos"	"240"
		"wide"	"40"
		"tall"  "40"
		"visible" "1"
		"enabled" "1"

		"PaintBackgroundType"	"2"

		"IconColor"				"HudIcon_Green"

	}

	HudHostageRescueZone
	{
		"fieldName" "HudHostageRescueZone"
		"xpos"	"16"
		"ypos"	"240"
		"wide"	"40"
		"tall"  "40"
		"visible" "1"
		"enabled" "1"
	

		"PaintBackgroundType"	"2"
		"IconColor"			"HudIcon_Green"
		"FlashColor"		"HudIcon_Red"
	}

	HudScenarioIcon 
	{
		"fieldName" "HudScenarioIcon"
		"xpos"	"c110"
		"ypos"	"443"
		"wide"	"40"
		"tall"  "44"
		"visible" "1"
		"enabled" "1"

		"PaintBackgroundType"	"2"

		"IconColor"				"Hostage_Yellow"	
	}

	HudFlashlight
	{
		"fieldName" "HudFlashlight"
		"visible" "1"
		"enabled" "1"
		"xpos"	"16"
		"ypos"	"370"
		"wide"	"102"
		"tall"	"20"
		
		"text_xpos" "8"
		"text_ypos" "6"
		"TextColor"	"255 170 0 220"

		"PaintBackgroundType"	"2"
	}
	
	HudDamageIndicator
	{
		"fieldName" "HudDamageIndicator"
		"visible" "1"
		"enabled" "1"
		"DmgColorLeft" "255 0 0 0"
		"DmgColorRight" "255 0 0 0"
		
		"dmg_xpos" "30"
		"dmg_ypos" "100"
		"dmg_wide" "36"
		"dmg_tall1" "240"
		"dmg_tall2" "200"
	}

	HudZoom
	{
		"fieldName" "HudZoom"
		"visible" "1"
		"enabled" "1"
		"Circle1Radius" "66"
		"Circle2Radius"	"74"
		"DashGap"	"16"
		"DashHeight" "4"
		"BorderThickness" "88"
	}

	HudWeaponSelection
	{
		"fieldName" "HudWeaponSelection"
		"xpos"	"r640"
		"wide"	"640"
		"ypos" 	"16"
		"visible" "1"
		"enabled" "1"
		"SmallBoxSize" "60"
		"LargeBoxWide" "108"
		"LargeBoxTall" "80"
		"BoxGap" "8"
		"SelectionNumberXPos" "4"
		"SelectionNumberYPos" "4"
		"SelectionGrowTime"	"0.4"
		"IconXPos" "8"
		"IconYPos" "0"
		"TextYPos" "68"	
		"TextColor" "SelectionTextFg"
		"MaxSlots"	"5"
		"PlaySelectSounds"	"0"
	}

	HudCrosshair
	{
		"fieldName" "HudCrosshair"
		"visible" "1"
		"enabled" "1"
		"wide"	 "640"
		"tall"	 "480"
	}

	HudDeathNotice
	{
		"fieldName" "HudDeathNotice"
		"visible" "1"
		"enabled" "1"
		//"xpos"	 "r640"
		"xpos"	 "8"
		//"ypos"	 "12"
		"ypos"	 "8"
		"wide"	 "628"
		"tall"	 "468"

		"MaxDeathNotices" "4"
		"LineHeight"	  "22"
		//"RightJustify"	  "1"	// If 1, draw notices from the right
		"RightJustify"	  "0"
		
		"TextFont"				"Default"
		"CTTextColor"			"CT_Blue"
		"TerroristTextColor"	"T_Red"	
	}

	HudVehicle
	{
		"fieldName" "HudVehicle"
		"visible" "1"
		"enabled" "1"
		"wide"	 "640"
		"tall"	 "480"
	}

	CVProfPanel
	{
		"fieldName" "CVProfPanel"
		"visible" "1"
		"enabled" "1"
		"wide"	 "640"
		"tall"	 "480"
	}

	ScorePanel
	{
		"fieldName" "ScorePanel"
		"visible" "1"
		"enabled" "1"
		"wide"	 "640"
		"tall"	 "480"
	}

	HudTrain
	{
		"fieldName" "HudTrain"
		"visible" "1"
		"enabled" "1"
		"wide"	 "640"
		"tall"	 "480"
	}

	HudMOTD
	{
		"fieldName" "HudMOTD"
		"visible" "1"
		"enabled" "1"
		"wide"	 "640"
		"tall"	 "480"
	}

	HudMessage
	{
		"fieldName" "HudMessage"
		"visible" "1"
		"enabled" "1"
		"wide"	 "f0"
		"tall"	 "480"
	}

	HudMenu
	{
		"fieldName" "HudMenu"
		"visible" "1"
		"enabled" "1"
		"wide"	 "640"
		"tall"	 "480"
		"zpos" "1"

		"TextFont"				"Default"
		"ItemFont"				"Default"
		"ItemFontPulsing"		"Default"
	}

	HudCloseCaption
	{
		"fieldName" "HudCloseCaption"
		"visible" "1"
		"enabled" "1"
		"wide"	 "640"
		"tall"	 "480"
	}

	HudHistoryResource 
	{
		"fieldName" "HudHistoryResource"
		"visible" "1"
		"enabled" "1"
		"xpos"	 "r640"
		"wide"	 "640"
		"tall"	 "350"
		"history_gap" "50"
	}

	HudGeiger
	{
		"fieldName" "HudGeiger"
		"visible" "1"
		"enabled" "1"
		"wide"	 "640"
		"tall"	 "480"
	}

	HUDQuickInfo
	{
		"fieldName" "HUDQuickInfo"
		"visible" "1"
		"enabled" "1"
		"wide"	 "640"
		"tall"	 "480"
	}

	HudWeapon
	{
		"fieldName" "HudWeapon"
		"visible" "1"
		"enabled" "1"
		"wide"	 "640"
		"tall"	 "480"
	}

	HudAnimationInfo
	{
		"fieldName" "HudAnimationInfo"
		"visible" "1"
		"enabled" "1"
		"wide"	 "640"
		"tall"	 "480"
	}

	CBudgetPanel
	{
		"fieldName" "CBudgetPanel"
		"visible" "1"
		"enabled" "1"
		"wide"	 "640"
		"tall"	 "480"
	}

	CTextureBudgetPanel
	{
		"fieldName" "CTextureBudgetPanel"
		"visible" "1"
		"enabled" "1"
		"wide"	 "640"
		"tall"	 "480"
	}

	HudPredictionDump
	{
		"fieldName" "HudPredictionDump"
		"visible" "1"
		"enabled" "1"
		"wide"	 "640"
		"tall"	 "480"
	}

	HudRadar
	{
		"fieldName" "HudRadar"
		"visible"	"1"
		"enabled"	"1"
		//"xpos"		"16"
		"xpos"		"r104"
		//"ypos"		"16"
		"ypos"		"8"
		"wide"		"96"
		"tall"		"96"
	}

	HudLocation
	{
		"fieldName" "HudLocation"
		"visible"	"1"
		"enabled"	"1"
		"xpos"		"16"
		"ypos"		"112"
		"wide"		"96"
		"tall"		"16"
		"textAlignment"	"north"
	}

	HudScope
	{
		"fieldName" "HudZoom"
		"visible" "1"
		"enabled" "1"
		"wide"	 "640"
		"tall"	 "480"
	}

	HudVoiceSelfStatus
	{
		"fieldName" "HudVoiceSelfStatus"
		"visible" "1"
		"enabled" "1"
		"xpos" "r34"
		"ypos" "355"
		"wide" "24"
		"tall" "24"
	}

	HudVoiceStatus
	{
		"fieldName" "HudVoiceStatus"
		"visible" "1"
		"enabled" "1"
		"xpos" "r200"
		"ypos" "0"
		"wide" "200"
		"tall" "400"

		"item_tall"	"16"
		"item_wide"	"195"
		"item_spacing" "2"
		
		"show_avatar"		"1"
		"show_friend"		"1"
		"show_voice_icon"	"0"
		"show_dead_icon"	"1"

		"dead_xpos"	"0"
		"dead_ypos"	"0"
		"dead_wide"	"16"
		"dead_tall"	"16"

		"avatar_xpos"	"14"
		"avatar_ypos"	"0"
		"avatar_wide"	"16"
		"avatar_tall"	"16"
		
		"text_xpos"	"42"
		
		"fade_in_time" "0.07"
		"fade_out_time" "1.0"
	}

	HudFlashbang
	{
	}
	
	HudHintDisplay
	{
		"fieldName"	"HudHintDisplay"
		"visible"	"0"
		"enabled" "1"
		"xpos"		"c-240"
		"ypos"		"c60"
		"wide"		"480"
		"tall"		"100"
		"text_xpos"	"8"
		"text_ypos"	"8"
		"center_x"	"0"	// center text horizontally
		"center_y"	"-1"	// align text on the bottom
		"HintSize"	"1"
	}

	HudHintKeyDisplay
	{
		"fieldName"	"HudHintKeyDisplay"
		"visible"	"0"
		"enabled" 	"1"
		"xpos"		"r120"
		"ypos"		"r340"
		"wide"		"100"
		"tall"		"200"
		"text_xpos"	"8"
		"text_ypos"	"8"
		"text_xgap"	"8"
		"text_ygap"	"8"
		"TextColor"	"255 170 0 220"

		"PaintBackgroundType"	"2"
	}

	HudTerritory
	{
		"fieldName" "HudTerritory"
		"visible" "1"
		"enabled" "1"
		"xpos"	"240"
		"ypos"	"432"
		"wide" "240"
		"tall" "48"
	}

	TerritorySCore
	{
		"fieldName" "TerritoryScore"
		"visible" "0"
		"enabled" "0"
		"xpos"	"240"
		"ypos"	"450"
		"wide" "200"
		"tall" "200"
		"text_xpos" "8"
		"text_ypos" "4"
	}

	"HudChat"
	{
		"ControlName"		"EditablePanel"
		"fieldName" 		"HudChat"
		"visible" 		"1"
		"enabled" 		"1"
		"xpos"			"10"	[$WIN32]
		"xpos"			"42"	[$X360]
		"ypos"			"275"
		"wide"	 		"320"
		"tall"	 		"120"
		"PaintBackgroundType"	"2"
	}
	
	WinPanel_Round
	{
		"fieldName"				"WinPanel_Round"
		"visible"				"1"
		"enabled"				"1"
		"xpos"					"c-110"
		"ypos"					"287"		
		"zpos"					"0"		
		"wide"					"220"
		"tall"					"138"		
		"PaintBackgroundType"	"2"
	}
	
	WinPanel_Match
	{
		"fieldName"				"WinPanel_Match"	
		"visible"				"1"
		"enabled"				"1"
		"xpos"					"c-150"
		"ypos"					"c-175"
		"wide"					"300"
		"tall"					"350"
		"PaintBackgroundType"	"2"
	}
	
	FreezePanel
	{
		"fieldName"				"FreezePanel"
		"visible"				"1"
		"enabled"				"1"
		"xpos"					"0"
		"ypos"					"0"
		"wide"					"f0"
		"tall"					"480"
	}

	FreezePanelCallout
	{
		"fieldName"				"FreezePanelCallout"
		"visible"				"1"
		"enabled"				"1"
		"xpos"					"200"
		"ypos"					"200"
		"wide"					"100"
		"tall"					"50"
	}
	
	AchievementAnnouncePanel
	{
		"fieldName"				"AchievementAnnouncePanel"
		"visible"				"1"
		"enabled"				"1"
		"xpos"					"0"
		"ypos"					"0"
		"wide"					"f0"
		"tall"					"480"
	}
	
	StatPanel
	{
		"fieldName"				"StatPanel"
		"visible"				"0"
		"enabled"				"1"
	}
	
	AchievementNotificationPanel
	{
		"fieldName"				"AchievementNotificationPanel"
		"visible"				"0"
		"enabled"				"1"
	}
	
	HUDAutoAim
	{
		"fieldName"				"HUDAutoAim"
		"visible"				"0"
		"enabled"				"1"
	}

	"HudAchievementTracker"
	{
		"ControlName"	"EditablePanel"
		"fieldName"		"HudAchievementTracker"
		"xpos"			"10"
		"NormalY"		"120"
		"EngineerY"		"170"
		"zpos"			"20"
		"wide"			"250"
		"tall"			"280"
		"visible"		"1"
		"enabled"		"1"	
	}

}