"Resource/UI/SpectatorGUI.res"
{
	"SpectatorGUI"
	{
		"ControlName"	"Frame"
		"fieldName"		"SpectatorGUI"
		"tall"			"480"
		"autoResize"	"0"
		"pinCorner"		"0"
		"visible"		"1"
		"enabled"		"1"
		"tabPosition"	"0"
	}
	"topbar"
	{
		"ControlName"	"Panel"
		"fieldName"		"topbar"
		// "xpos"			"0"
		// "ypos"			"0"
		"xpos"			"0"
		"ypos"			"0"
		// "tall"			"52"
		"tall"			"0"
		// "wide"			"640"
		"wide"			"0"
		"autoResize"	"0"
		"pinCorner"		"0"
		// "visible"		"1"
		// "enabled"		"1"
		"visible"		"0"
		"enabled"		"0"
		"tabPosition"	"0"

		"PaintBackgroundType" "0"
		"bgcolor_override" "0 0 0 0"
		"fgcolor_override" "0 0 0 0"
	}
	"bottombarblank"
	{
		"ControlName"	"Panel"
		"fieldName"		"bottombarblank"
		// "xpos"			"0"
		// "ypos"			"428"
		"xpos"			"-9999"
		"ypos"			"-9999"
		// "tall"			"55"		// this needs to match the size of BottomBar
		// "wide"			"640"
		"tall"			"0"
		"wide"			"0"
		"autoResize"	"0"
		"pinCorner"		"0"
		// "visible"		"1"
		// "enabled"		"1"
		"visible"		"0"
		"enabled"		"0"
		"tabPosition"	"0"

		"PaintBackgroundType" "0"
		"bgcolor_override" "0 0 0 0"
		"fgcolor_override" "0 0 0 0"
	}
	"playerlabel"
	{
		"ControlName"	"Label"
		"fieldName"		"playerlabel"
		"xpos"			"c-175"
		"ypos"			"441"
		"wide"			"350"
		"tall"			"26"
		"autoResize"	"0"
		"pinCorner"		"0"
		"visible"		"0"
		"enabled"		"1"
		"tabPosition"	"0"
		"textAlignment"	"center"

		"PaintBackgroundType" "0"
		"bgcolor_override" "0 0 0 0"
		"fgcolor_override" "0 0 0 0"
	}
	"CTScoreLabel"
	{
		"ControlName"	"Label"
		"fieldName"		"CTScoreLabel"
		"xpos"			"r268"
		"ypos"			"12"
		"wide"			"150"
		"tall"			"15"
		"autoResize"	"0"
		"pinCorner"		"0"
		"visible"		"1"
		"enabled"		"1"
		"labelText"		"#Cstrike_Spec_CT_Score"
		"textAlignment"	"east"
		"dulltext"		"0"
		"brighttext"	"0"

		"PaintBackgroundType" "0"
		"bgcolor_override" "0 0 0 0"
		"fgcolor_override" "0 0 0 0"
	}
	"CTScoreValue"
	{
		"ControlName"	"Label"
		"fieldName"		"CTScoreValue"
		"xpos"			"r112"
		"ypos"			"12"
		"wide"			"15"
		"tall"			"15"
		"autoResize"	"0"
		"pinCorner"		"0"
		"visible"		"1"
		"enabled"		"1"
		"labelText"		""
		"textAlignment"	"west"
		"dulltext"		"0"
		"brighttext"	"0"

		"PaintBackgroundType" "0"
		"bgcolor_override" "0 0 0 0"
		"fgcolor_override" "0 0 0 0"
	}
	"TERScoreLabel"
	{
		"ControlName"	"Label"
		"fieldName"		"TERScoreLabel"
		"xpos"			"r268"
		"ypos"			"24"
		"wide"			"150"
		"tall"			"15"
		"autoResize"	"0"
		"pinCorner"		"0"
		"visible"		"1"
		"enabled"		"1"
		"labelText"		"#Cstrike_Spec_Ter_Score"
		"textAlignment"	"east"
		"dulltext"		"0"
		"brighttext"	"0"

		"PaintBackgroundType" "0"
		"bgcolor_override" "0 0 0 0"
		"fgcolor_override" "0 0 0 0"
	}
	"TERScoreValue"
	{
		"ControlName"	"Label"
		"fieldName"		"TERScoreValue"
		"xpos"			"r112"
		"ypos"			"24"
		"wide"			"15"
		"tall"			"15"
		"autoResize"	"0"
		"pinCorner"		"0"
		"visible"		"1"
		"enabled"		"1"
		"labelText"		""
		"textAlignment"	"west"
		"dulltext"		"0"
		"brighttext"	"0"

		"PaintBackgroundType" "0"
		"bgcolor_override" "0 0 0 0"
		"fgcolor_override" "0 0 0 0"
	}
	"DividerBar"
	{
		"ControlName"	"ImagePanel"
		"fieldName"		"DividerBar"
		"xpos"			"r94"
		"ypos"			"12"
		"wide"			"1"
		"tall"			"30"
		"autoResize"	"0"
		"pinCorner"		"0"
		"visible"		"1"
		"enabled"		"1"
		"tabPosition"	"0"
		"fillcolor"		"BorderBright"
		"labelText"		""
		"textAlignment"	"center"
	}
	"timerclock"
	{
		"ControlName"	"Label"
		"fieldName"		"timerclock"
		"xpos"			"r86"
		"ypos"			"24"
		"wide"			"16"
		"tall"			"19"
		"autoResize"	"1"
		"pinCorner"		"0"
		"visible"		"1"
		"enabled"		"1"
		"textAlignment"	"west"
		"dulltext"		"0"
		"brighttext"	"0"
		// "labelText"		"e"
		"labelText"		" "
		"font"		"IconsSmall"

		// "PaintBackgroundType" "0"
		// "bgcolor_override" "0 0 0 0"
		"fgcolor_override" 	"0 0 0 0"
	}
	"timerlabel"
	{
		"ControlName"	"Label"
		"fieldName"		"timerlabel"
		"xpos"			"r69"
		"ypos"			"26"
		"wide"			"40"
		"tall"			"15"
		"autoResize"	"0"
		"pinCorner"		"0"
		"visible"		"1"
		"enabled"		"1"
		"labelText"		"00:00"
		"textAlignment"	"west"
		"dulltext"		"0"
		"brighttext"	"0"

		"PaintBackgroundType" "0"
		"bgcolor_override" "0 0 0 0"
		"fgcolor_override" "0 0 0 0"
	}
	"extrainfo"
	{
		"ControlName"	"Label"
		"fieldName"		"extrainfo"
		"xpos"			"r86"
		"ypos"			"12"
		"wide"			"81"
		"tall"			"15"
		"autoResize"	"0"
		"pinCorner"		"0"
		"visible"		"1"
		"enabled"		"1"
		"labelText"		""
		"textAlignment"	"west"
		"dulltext"		"0"
		"brighttext"	"0"

		"PaintBackgroundType" "0"
		"bgcolor_override" "0 0 0 0"
		"fgcolor_override" "0 0 0 0"
	}
	"titlelabel"
	{
		"ControlName"	"Label"
		"fieldName"		"titlelabel"
		"xpos"			"16"
		"ypos"			"16"
		"wide"			"320"
		"tall"			"20"
		"autoResize"	"0"
		"pinCorner"		"0"
		"visible"		"1"
		"enabled"		"1"
		"font"			"HudNumbersSmall"
		"labelText"		""
		"textAlignment"	"west"
		"dulltext"		"0"
		"brighttext"	"0"

		"PaintBackgroundType" "0"
		"bgcolor_override" "0 0 0 0"
		"fgcolor_override" "0 0 0 0"
	}
}
