[2020-05-15T14:11:13.877] [CONSULTA]: 11111111111 acaba de pedir os dados das suas notas fiscais.
[2020-05-15T14:11:22.345] [ EMISSAO]: 11111111111 acaba de pedir a emissao de uma NF no valor de R$ 1000.0!
[2020-05-15T14:11:27.154] [ EMISSAO]: 11111111111 acaba de pedir a emissao de uma NF no valor de R$ 1000.0!
[2020-05-15T14:11:27.555] [ EMISSAO]: 11111111111 acaba de pedir a emissao de uma NF no valor de R$ 1000.0!
[2020-05-15T14:11:29.191] [CONSULTA]: 11111111111 acaba de pedir os dados das suas notas fiscais.
[2020-05-15T14:17:22.677] [CONSULTA]: 11111111111 acaba de pedir os dados das suas notas fiscais.
[2020-05-15T14:22:40.697] [CONSULTA]: 11111111111 acaba de pedir os dados das suas notas fiscais.
[2020-05-15T14:23:54.395] [ EMISSAO]: 11111111111 acaba de pedir a emissao de uma NF no valor de R$ 1000.0!
[2020-05-15T14:25:51.171] [CONSULTA]: 11111111111 acaba de pedir os dados das suas notas fiscais.
[2020-05-15T14:25:57.965] [CONSULTA]: 11111111111 acaba de pedir os dados das suas notas fiscais.
[2020-05-15T14:25:58.620] [CONSULTA]: 11111111111 acaba de pedir os dados das suas notas fiscais.
[2020-05-15T14:25:59.226] [CONSULTA]: 11111111111 acaba de pedir os dados das suas notas fiscais.
[2020-05-15T14:25:59.561] [CONSULTA]: 11111111111 acaba de pedir os dados das suas notas fiscais.
[2020-05-15T14:26:00.034] [CONSULTA]: 11111111111 acaba de pedir os dados das suas notas fiscais.
[2020-05-15T14:26:00.469] [CONSULTA]: 11111111111 acaba de pedir os dados das suas notas fiscais.
[2020-05-15T14:26:00.964] [CONSULTA]: 11111111111 acaba de pedir os dados das suas notas fiscais.
[2020-05-15T14:29:11.391] [ EMISSAO]: 11111111111 acaba de pedir a emissao de uma NF no valor de R$ 1000.0!
[2020-05-15T14:29:12.141] [ EMISSAO]: 11111111111 acaba de pedir a emissao de uma NF no valor de R$ 1000.0!
[2020-05-15T14:29:12.768] [ EMISSAO]: 11111111111 acaba de pedir a emissao de uma NF no valor de R$ 1000.0!
[2020-05-15T14:29:13.361] [ EMISSAO]: 11111111111 acaba de pedir a emissao de uma NF no valor de R$ 1000.0!
[2020-05-15T14:29:13.923] [ EMISSAO]: 11111111111 acaba de pedir a emissao de uma NF no valor de R$ 1000.0!
[2020-05-15T14:29:14.447] [ EMISSAO]: 11111111111 acaba de pedir a emissao de uma NF no valor de R$ 1000.0!
[2020-05-15T14:29:14.892] [ EMISSAO]: 11111111111 acaba de pedir a emissao de uma NF no valor de R$ 1000.0!
[2020-05-15T14:29:15.263] [ EMISSAO]: 11111111111 acaba de pedir a emissao de uma NF no valor de R$ 1000.0!
[2020-05-15T14:29:15.784] [ EMISSAO]: 11111111111 acaba de pedir a emissao de uma NF no valor de R$ 1000.0!
[2020-05-15T14:29:17.433] [ EMISSAO]: 11111111111 acaba de pedir a emissao de uma NF no valor de R$ 1000.0!
[2020-05-15T14:29:17.996] [ EMISSAO]: 11111111111 acaba de pedir a emissao de uma NF no valor de R$ 1000.0!
[2020-05-15T14:29:18.478] [ EMISSAO]: 11111111111 acaba de pedir a emissao de uma NF no valor de R$ 1000.0!
[2020-05-15T14:30:19.249] [CONSULTA]: 11111111111 acaba de pedir os dados das suas notas fiscais.
[2020-05-15T14:30:25.943] [CONSULTA]: 11111111111 acaba de pedir os dados das suas notas fiscais.
[2020-05-15T14:30:26.560] [CONSULTA]: 11111111111 acaba de pedir os dados das suas notas fiscais.
[2020-05-15T14:30:41.167] [ EMISSAO]: 11111111111 acaba de pedir a emissao de uma NF no valor de R$ 1000.0!
[2020-05-15T14:30:58.276] [ EMISSAO]: 11111111111 acaba de pedir a emissao de uma NF no valor de R$ 1000.0!
[2020-05-15T14:31:54.020] [ EMISSAO]: 11111111111 acaba de pedir a emissao de uma NF no valor de R$ 1000.0!
[2020-05-15T14:32:23.577] [ EMISSAO]: 11111111111 acaba de pedir a emissao de uma NF no valor de R$ 1000.0!
[2020-05-15T14:32:35.577] [ EMISSAO]: 11111111111 acaba de pedir a emissao de uma NF no valor de R$ 1000.0!
[2020-05-15T14:32:40.425] [ EMISSAO]: 11111111111 acaba de pedir a emissao de uma NF no valor de R$ 1000.0!
[2020-05-15T14:32:41.035] [ EMISSAO]: 11111111111 acaba de pedir a emissao de uma NF no valor de R$ 1000.0!
[2020-05-15T14:36:31.264] [ EMISSAO]: 11111111111 acaba de pedir a emissao de uma NF no valor de R$ 1000.0!
[2020-05-15T14:36:31.672] [ EMISSAO]: 11111111111 acaba de pedir a emissao de uma NF no valor de R$ 1000.0!
[2020-05-15T14:36:32.287] [ EMISSAO]: 11111111111 acaba de pedir a emissao de uma NF no valor de R$ 1000.0!
[2020-05-15T14:36:32.650] [ EMISSAO]: 11111111111 acaba de pedir a emissao de uma NF no valor de R$ 1000.0!
[2020-05-15T14:36:32.982] [ EMISSAO]: 11111111111 acaba de pedir a emissao de uma NF no valor de R$ 1000.0!
[2020-05-15T14:36:33.662] [ EMISSAO]: 11111111111 acaba de pedir a emissao de uma NF no valor de R$ 1000.0!
[2020-05-15T14:36:34.459] [ EMISSAO]: 11111111111 acaba de pedir a emissao de uma NF no valor de R$ 1000.0!
[2020-05-15T14:36:34.797] [ EMISSAO]: 11111111111 acaba de pedir a emissao de uma NF no valor de R$ 1000.0!
[2020-05-15T14:36:35.268] [ EMISSAO]: 11111111111 acaba de pedir a emissao de uma NF no valor de R$ 1000.0!
[2020-05-15T14:36:35.750] [ EMISSAO]: 11111111111 acaba de pedir a emissao de uma NF no valor de R$ 1000.0!
[2020-05-15T14:36:36.150] [ EMISSAO]: 11111111111 acaba de pedir a emissao de uma NF no valor de R$ 1000.0!
[2020-05-15T14:36:36.652] [ EMISSAO]: 11111111111 acaba de pedir a emissao de uma NF no valor de R$ 1000.0!
[2020-05-15T14:36:37.068] [ EMISSAO]: 11111111111 acaba de pedir a emissao de uma NF no valor de R$ 1000.0!
[2020-05-15T14:36:37.455] [ EMISSAO]: 11111111111 acaba de pedir a emissao de uma NF no valor de R$ 1000.0!
[2020-05-15T14:36:37.954] [ EMISSAO]: 11111111111 acaba de pedir a emissao de uma NF no valor de R$ 1000.0!
[2020-05-15T14:37:01.829] [CONSULTA]: 11111111111 acaba de pedir os dados das suas notas fiscais.
[2020-05-15T14:37:02.192] [CONSULTA]: 11111111111 acaba de pedir os dados das suas notas fiscais.
[2020-05-15T14:37:02.598] [CONSULTA]: 11111111111 acaba de pedir os dados das suas notas fiscais.
[2020-05-15T14:39:09.403] [CONSULTA]: 11111111111 acaba de pedir os dados das suas notas fiscais.
[2020-05-15T14:39:09.961] [CONSULTA]: 11111111111 acaba de pedir os dados das suas notas fiscais.
[2020-05-15T14:39:10.423] [CONSULTA]: 11111111111 acaba de pedir os dados das suas notas fiscais.
[2020-05-15T14:39:10.874] [CONSULTA]: 11111111111 acaba de pedir os dados das suas notas fiscais.
[2020-05-15T14:39:11.176] [CONSULTA]: 11111111111 acaba de pedir os dados das suas notas fiscais.
[2020-05-15T14:39:11.584] [CONSULTA]: 11111111111 acaba de pedir os dados das suas notas fiscais.
[2020-05-15T14:39:13.157] [CONSULTA]: 11111111111 acaba de pedir os dados das suas notas fiscais.
[2020-05-15T14:39:13.776] [CONSULTA]: 11111111111 acaba de pedir os dados das suas notas fiscais.
[2020-05-15T15:46:57.809] [ EMISSAO]: 11111111111 acaba de pedir a emissao de uma NF no valor de R$ 1000.0!
[2020-05-15T15:56:14.275] [ EMISSAO]: 11111111111 acaba de pedir a emissao de uma NF no valor de R$ 1000.0!
[2020-05-15T15:59:23.764] [ EMISSAO]: 11111111111 acaba de pedir a emissao de uma NF no valor de R$ 1000.0!
[2020-05-15T15:59:30.494] [ EMISSAO]: 11111111111 acaba de pedir a emissao de uma NF no valor de R$ 1000.0!
[2020-05-15T15:59:32.805] [ EMISSAO]: 11111111111 acaba de pedir a emissao de uma NF no valor de R$ 1000.0!
[2020-05-15T15:59:33.718] [ EMISSAO]: 11111111111 acaba de pedir a emissao de uma NF no valor de R$ 1000.0!
[2020-05-15T16:00:13.304] [CONSULTA]: 11111111111 acaba de pedir os dados das suas notas fiscais.
[2020-05-15T16:47:54.470] [ EMISSAO]: 11111111111 acaba de pedir a emissao de uma NF no valor de R$ 1000.0!
[2020-05-15T16:47:58.297] [CONSULTA]: 11111111111 acaba de pedir os dados das suas notas fiscais.
[2020-05-15T16:49:11.060] [CONSULTA]: 11111111111 acaba de pedir os dados das suas notas fiscais.
[2020-05-15T16:49:15.398] [ EMISSAO]: 11111111111 acaba de pedir a emissao de uma NF no valor de R$ 1000.0!
[2020-05-15T16:49:22.636] [CONSULTA]: 11111111111 acaba de pedir os dados das suas notas fiscais.
[2020-05-15T16:49:38.736] [CONSULTA]: 11111111111 acaba de pedir os dados das suas notas fiscais.
