(kicad_sch (version 20230121) (generator eeschema)

  (uuid f05e37c1-90da-41b9-a0b9-6e1578a7285b)

  (paper "A4")

  (lib_symbols
    (symbol "Device:C_Small" (pin_numbers hide) (pin_names (offset 0.254) hide) (in_bom yes) (on_board yes)
      (property "Reference" "C" (at 0.254 1.778 0)
        (effects (font (size 1.27 1.27)) (justify left))
      )
      (property "Value" "C_Small" (at 0.254 -2.032 0)
        (effects (font (size 1.27 1.27)) (justify left))
      )
      (property "Footprint" "" (at 0 0 0)
        (effects (font (size 1.27 1.27)) hide)
      )
      (property "Datasheet" "~" (at 0 0 0)
        (effects (font (size 1.27 1.27)) hide)
      )
      (property "ki_keywords" "capacitor cap" (at 0 0 0)
        (effects (font (size 1.27 1.27)) hide)
      )
      (property "ki_description" "Unpolarized capacitor, small symbol" (at 0 0 0)
        (effects (font (size 1.27 1.27)) hide)
      )
      (property "ki_fp_filters" "C_*" (at 0 0 0)
        (effects (font (size 1.27 1.27)) hide)
      )
      (symbol "C_Small_0_1"
        (polyline
          (pts
            (xy -1.524 -0.508)
            (xy 1.524 -0.508)
          )
          (stroke (width 0.3302) (type default))
          (fill (type none))
        )
        (polyline
          (pts
            (xy -1.524 0.508)
            (xy 1.524 0.508)
          )
          (stroke (width 0.3048) (type default))
          (fill (type none))
        )
      )
      (symbol "C_Small_1_1"
        (pin passive line (at 0 2.54 270) (length 2.032)
          (name "~" (effects (font (size 1.27 1.27))))
          (number "1" (effects (font (size 1.27 1.27))))
        )
        (pin passive line (at 0 -2.54 90) (length 2.032)
          (name "~" (effects (font (size 1.27 1.27))))
          (number "2" (effects (font (size 1.27 1.27))))
        )
      )
    )
    (symbol "Interface_Expansion:PCA9548ARGE" (in_bom yes) (on_board yes)
      (property "Reference" "U" (at -7.62 21.59 0)
        (effects (font (size 1.27 1.27)) (justify left))
      )
      (property "Value" "PCA9548ARGE" (at 1.016 21.59 0)
        (effects (font (size 1.27 1.27)) (justify left))
      )
      (property "Footprint" "Package_DFN_QFN:Texas_RGE0024C_VQFN-24-1EP_4x4mm_P0.5mm_EP2.1x2.1mm" (at 0 -25.4 0)
        (effects (font (size 1.27 1.27)) hide)
      )
      (property "Datasheet" "http://www.ti.com/lit/ds/symlink/pca9548a.pdf" (at 1.27 6.35 0)
        (effects (font (size 1.27 1.27)) hide)
      )
      (property "ki_keywords" "Low voltage 8-channel I2C switch with reset" (at 0 0 0)
        (effects (font (size 1.27 1.27)) hide)
      )
      (property "ki_description" "Low voltage 8-channel I2C switch with reset, VQFN-24" (at 0 0 0)
        (effects (font (size 1.27 1.27)) hide)
      )
      (property "ki_fp_filters" "Texas*RGE0024C*" (at 0 0 0)
        (effects (font (size 1.27 1.27)) hide)
      )
      (symbol "PCA9548ARGE_0_1"
        (rectangle (start -7.62 20.32) (end 7.62 -22.86)
          (stroke (width 0.254) (type default))
          (fill (type background))
        )
      )
      (symbol "PCA9548ARGE_1_1"
        (pin bidirectional line (at 10.16 15.24 180) (length 2.54)
          (name "SD0" (effects (font (size 1.27 1.27))))
          (number "1" (effects (font (size 1.27 1.27))))
        )
        (pin bidirectional line (at 10.16 -5.08 180) (length 2.54)
          (name "SD4" (effects (font (size 1.27 1.27))))
          (number "10" (effects (font (size 1.27 1.27))))
        )
        (pin output line (at 10.16 -2.54 180) (length 2.54)
          (name "SC4" (effects (font (size 1.27 1.27))))
          (number "11" (effects (font (size 1.27 1.27))))
        )
        (pin bidirectional line (at 10.16 -10.16 180) (length 2.54)
          (name "SD5" (effects (font (size 1.27 1.27))))
          (number "12" (effects (font (size 1.27 1.27))))
        )
        (pin output line (at 10.16 -7.62 180) (length 2.54)
          (name "SC5" (effects (font (size 1.27 1.27))))
          (number "13" (effects (font (size 1.27 1.27))))
        )
        (pin bidirectional line (at 10.16 -15.24 180) (length 2.54)
          (name "SD6" (effects (font (size 1.27 1.27))))
          (number "14" (effects (font (size 1.27 1.27))))
        )
        (pin output line (at 10.16 -12.7 180) (length 2.54)
          (name "SC6" (effects (font (size 1.27 1.27))))
          (number "15" (effects (font (size 1.27 1.27))))
        )
        (pin bidirectional line (at 10.16 -20.32 180) (length 2.54)
          (name "SD7" (effects (font (size 1.27 1.27))))
          (number "16" (effects (font (size 1.27 1.27))))
        )
        (pin output line (at 10.16 -17.78 180) (length 2.54)
          (name "SC7" (effects (font (size 1.27 1.27))))
          (number "17" (effects (font (size 1.27 1.27))))
        )
        (pin input line (at -10.16 -7.62 0) (length 2.54)
          (name "A2" (effects (font (size 1.27 1.27))))
          (number "18" (effects (font (size 1.27 1.27))))
        )
        (pin input line (at -10.16 17.78 0) (length 2.54)
          (name "SCL" (effects (font (size 1.27 1.27))))
          (number "19" (effects (font (size 1.27 1.27))))
        )
        (pin output line (at 10.16 17.78 180) (length 2.54)
          (name "SC0" (effects (font (size 1.27 1.27))))
          (number "2" (effects (font (size 1.27 1.27))))
        )
        (pin bidirectional line (at -10.16 15.24 0) (length 2.54)
          (name "SDA" (effects (font (size 1.27 1.27))))
          (number "20" (effects (font (size 1.27 1.27))))
        )
        (pin power_in line (at 0 22.86 270) (length 2.54)
          (name "VCC" (effects (font (size 1.27 1.27))))
          (number "21" (effects (font (size 1.27 1.27))))
        )
        (pin input line (at -10.16 -12.7 0) (length 2.54)
          (name "A0" (effects (font (size 1.27 1.27))))
          (number "22" (effects (font (size 1.27 1.27))))
        )
        (pin input line (at -10.16 -10.16 0) (length 2.54)
          (name "A1" (effects (font (size 1.27 1.27))))
          (number "23" (effects (font (size 1.27 1.27))))
        )
        (pin input line (at -10.16 5.08 0) (length 2.54)
          (name "~{RESET}" (effects (font (size 1.27 1.27))))
          (number "24" (effects (font (size 1.27 1.27))))
        )
        (pin no_connect line (at -7.62 -15.24 0) (length 2.54) hide
          (name "1EP" (effects (font (size 1.27 1.27))))
          (number "25" (effects (font (size 1.27 1.27))))
        )
        (pin bidirectional line (at 10.16 10.16 180) (length 2.54)
          (name "SD1" (effects (font (size 1.27 1.27))))
          (number "3" (effects (font (size 1.27 1.27))))
        )
        (pin output line (at 10.16 12.7 180) (length 2.54)
          (name "SC1" (effects (font (size 1.27 1.27))))
          (number "4" (effects (font (size 1.27 1.27))))
        )
        (pin bidirectional line (at 10.16 5.08 180) (length 2.54)
          (name "SD2" (effects (font (size 1.27 1.27))))
          (number "5" (effects (font (size 1.27 1.27))))
        )
        (pin output line (at 10.16 7.62 180) (length 2.54)
          (name "SC2" (effects (font (size 1.27 1.27))))
          (number "6" (effects (font (size 1.27 1.27))))
        )
        (pin bidirectional line (at 10.16 0 180) (length 2.54)
          (name "SD3" (effects (font (size 1.27 1.27))))
          (number "7" (effects (font (size 1.27 1.27))))
        )
        (pin output line (at 10.16 2.54 180) (length 2.54)
          (name "SC3" (effects (font (size 1.27 1.27))))
          (number "8" (effects (font (size 1.27 1.27))))
        )
        (pin power_in line (at 0 -25.4 90) (length 2.54)
          (name "GND" (effects (font (size 1.27 1.27))))
          (number "9" (effects (font (size 1.27 1.27))))
        )
      )
    )
    (symbol "Misc:R_Small_Pack04_Split" (pin_names (offset 0) hide) (in_bom yes) (on_board yes)
      (property "Reference" "RN" (at 0 2.54 90)
        (effects (font (size 1.27 1.27)) (justify left))
      )
      (property "Value" "R_Small_Pack04_Split" (at 0 -2.54 90)
        (effects (font (size 1.27 1.27)) (justify right))
      )
      (property "Footprint" "" (at 1.778 0 90)
        (effects (font (size 1.27 1.27)) hide)
      )
      (property "Datasheet" "~" (at 0 0 0)
        (effects (font (size 1.27 1.27)) hide)
      )
      (property "ki_keywords" "R network parallel topology isolated" (at 0 0 0)
        (effects (font (size 1.27 1.27)) hide)
      )
      (property "ki_description" "4 resistor network, parallel topology, split" (at 0 0 0)
        (effects (font (size 1.27 1.27)) hide)
      )
      (property "ki_fp_filters" "DIP* SOIC* R*Array*Concave* R*Array*Convex*" (at 0 0 0)
        (effects (font (size 1.27 1.27)) hide)
      )
      (symbol "R_Small_Pack04_Split_1_1"
        (rectangle (start -0.762 1.778) (end 0.762 -1.778)
          (stroke (width 0.2032) (type default))
          (fill (type none))
        )
        (pin passive line (at 0 2.54 270) (length 0.762)
          (name "~" (effects (font (size 1.27 1.27))))
          (number "1" (effects (font (size 1.27 1.27))))
        )
        (pin passive line (at 0 -2.54 90) (length 0.762)
          (name "~" (effects (font (size 1.27 1.27))))
          (number "8" (effects (font (size 1.27 1.27))))
        )
      )
      (symbol "R_Small_Pack04_Split_2_1"
        (rectangle (start -0.762 1.778) (end 0.762 -1.778)
          (stroke (width 0.2032) (type default))
          (fill (type none))
        )
        (pin passive line (at 0 2.54 270) (length 0.762)
          (name "~" (effects (font (size 1.27 1.27))))
          (number "2" (effects (font (size 1.27 1.27))))
        )
        (pin passive line (at 0 -2.54 90) (length 0.762)
          (name "~" (effects (font (size 1.27 1.27))))
          (number "7" (effects (font (size 1.27 1.27))))
        )
      )
      (symbol "R_Small_Pack04_Split_3_1"
        (rectangle (start -0.762 1.778) (end 0.762 -1.778)
          (stroke (width 0.2032) (type default))
          (fill (type none))
        )
        (pin passive line (at 0 2.54 270) (length 0.762)
          (name "~" (effects (font (size 1.27 1.27))))
          (number "3" (effects (font (size 1.27 1.27))))
        )
        (pin passive line (at 0 -2.54 90) (length 0.762)
          (name "~" (effects (font (size 1.27 1.27))))
          (number "6" (effects (font (size 1.27 1.27))))
        )
      )
      (symbol "R_Small_Pack04_Split_4_1"
        (rectangle (start -0.762 1.778) (end 0.762 -1.778)
          (stroke (width 0.2032) (type default))
          (fill (type none))
        )
        (pin passive line (at 0 2.54 270) (length 0.762)
          (name "~" (effects (font (size 1.27 1.27))))
          (number "4" (effects (font (size 1.27 1.27))))
        )
        (pin passive line (at 0 -2.54 90) (length 0.762)
          (name "~" (effects (font (size 1.27 1.27))))
          (number "5" (effects (font (size 1.27 1.27))))
        )
      )
    )
    (symbol "Misc_pwr_device:R_Small_PWR" (pin_numbers hide) (pin_names (offset 0.254) hide) (in_bom yes) (on_board yes)
      (property "Reference" "R" (at 0.762 0.508 0)
        (effects (font (size 1.27 1.27)) (justify left))
      )
      (property "Value" "R_Small" (at 0.762 -1.016 0)
        (effects (font (size 1.27 1.27)) (justify left))
      )
      (property "Footprint" "" (at 0 0 0)
        (effects (font (size 1.27 1.27)) hide)
      )
      (property "Datasheet" "~" (at 0 0 0)
        (effects (font (size 1.27 1.27)) hide)
      )
      (property "ki_keywords" "R resistor" (at 0 0 0)
        (effects (font (size 1.27 1.27)) hide)
      )
      (property "ki_description" "Resistor, small symbol" (at 0 0 0)
        (effects (font (size 1.27 1.27)) hide)
      )
      (property "ki_fp_filters" "R_*" (at 0 0 0)
        (effects (font (size 1.27 1.27)) hide)
      )
      (symbol "R_Small_PWR_0_1"
        (rectangle (start -0.762 1.778) (end 0.762 -1.778)
          (stroke (width 0.2032) (type default))
          (fill (type none))
        )
        (polyline
          (pts
            (xy 0 -2.54)
            (xy 0.127 -2.159)
            (xy -0.127 -2.159)
            (xy 0 -2.54)
          )
          (stroke (width 0) (type default))
          (fill (type none))
        )
      )
      (symbol "R_Small_PWR_1_1"
        (pin power_in line (at 0 2.54 270) (length 0.762)
          (name "~" (effects (font (size 1.27 1.27))))
          (number "1" (effects (font (size 1.27 1.27))))
        )
        (pin power_out line (at 0 -2.54 90) (length 0.762)
          (name "~" (effects (font (size 1.27 1.27))))
          (number "2" (effects (font (size 1.27 1.27))))
        )
      )
    )
    (symbol "power:+3V3" (power) (pin_names (offset 0)) (in_bom yes) (on_board yes)
      (property "Reference" "#PWR" (at 0 -3.81 0)
        (effects (font (size 1.27 1.27)) hide)
      )
      (property "Value" "+3V3" (at 0 3.556 0)
        (effects (font (size 1.27 1.27)))
      )
      (property "Footprint" "" (at 0 0 0)
        (effects (font (size 1.27 1.27)) hide)
      )
      (property "Datasheet" "" (at 0 0 0)
        (effects (font (size 1.27 1.27)) hide)
      )
      (property "ki_keywords" "global power" (at 0 0 0)
        (effects (font (size 1.27 1.27)) hide)
      )
      (property "ki_description" "Power symbol creates a global label with name \"+3V3\"" (at 0 0 0)
        (effects (font (size 1.27 1.27)) hide)
      )
      (symbol "+3V3_0_1"
        (polyline
          (pts
            (xy -0.762 1.27)
            (xy 0 2.54)
          )
          (stroke (width 0) (type default))
          (fill (type none))
        )
        (polyline
          (pts
            (xy 0 0)
            (xy 0 2.54)
          )
          (stroke (width 0) (type default))
          (fill (type none))
        )
        (polyline
          (pts
            (xy 0 2.54)
            (xy 0.762 1.27)
          )
          (stroke (width 0) (type default))
          (fill (type none))
        )
      )
      (symbol "+3V3_1_1"
        (pin power_in line (at 0 0 90) (length 0) hide
          (name "+3V3" (effects (font (size 1.27 1.27))))
          (number "1" (effects (font (size 1.27 1.27))))
        )
      )
    )
    (symbol "power:GND" (power) (pin_names (offset 0)) (in_bom yes) (on_board yes)
      (property "Reference" "#PWR" (at 0 -6.35 0)
        (effects (font (size 1.27 1.27)) hide)
      )
      (property "Value" "GND" (at 0 -3.81 0)
        (effects (font (size 1.27 1.27)))
      )
      (property "Footprint" "" (at 0 0 0)
        (effects (font (size 1.27 1.27)) hide)
      )
      (property "Datasheet" "" (at 0 0 0)
        (effects (font (size 1.27 1.27)) hide)
      )
      (property "ki_keywords" "global power" (at 0 0 0)
        (effects (font (size 1.27 1.27)) hide)
      )
      (property "ki_description" "Power symbol creates a global label with name \"GND\" , ground" (at 0 0 0)
        (effects (font (size 1.27 1.27)) hide)
      )
      (symbol "GND_0_1"
        (polyline
          (pts
            (xy 0 0)
            (xy 0 -1.27)
            (xy 1.27 -1.27)
            (xy 0 -2.54)
            (xy -1.27 -1.27)
            (xy 0 -1.27)
          )
          (stroke (width 0) (type default))
          (fill (type none))
        )
      )
      (symbol "GND_1_1"
        (pin power_in line (at 0 0 270) (length 0) hide
          (name "GND" (effects (font (size 1.27 1.27))))
          (number "1" (effects (font (size 1.27 1.27))))
        )
      )
    )
  )

  (junction (at 124.46 142.24) (diameter 0) (color 0 0 0 0)
    (uuid 18f253a6-98fb-4685-ba8e-1ad4c88d7fbb)
  )
  (junction (at 101.6 73.66) (diameter 0) (color 0 0 0 0)
    (uuid 3ec6bf63-8a96-49d3-9416-40e999ff2cb7)
  )
  (junction (at 101.6 71.12) (diameter 0) (color 0 0 0 0)
    (uuid 45804702-8fb4-4e2d-971a-0c815d349704)
  )
  (junction (at 142.24 142.24) (diameter 0) (color 0 0 0 0)
    (uuid 459f67c6-dfea-4620-a759-40e6aa461ed1)
  )
  (junction (at 53.34 142.24) (diameter 0) (color 0 0 0 0)
    (uuid 46e0766b-92b8-4391-a7e8-a78f824d3e5b)
  )
  (junction (at 88.9 142.24) (diameter 0) (color 0 0 0 0)
    (uuid 47b8e95c-8212-467c-9ead-2759acc7f8a5)
  )
  (junction (at 127 142.24) (diameter 0) (color 0 0 0 0)
    (uuid 480c94b4-c5e4-42d7-b8cf-5dde1940895a)
  )
  (junction (at 71.12 142.24) (diameter 0) (color 0 0 0 0)
    (uuid 48a4cd7b-684c-47dc-beb5-f68ce56ecedb)
  )
  (junction (at 35.56 142.24) (diameter 0) (color 0 0 0 0)
    (uuid 625cdebe-2cee-479d-9afa-35bd56b87a9c)
  )
  (junction (at 106.68 142.24) (diameter 0) (color 0 0 0 0)
    (uuid 68ca0265-18f9-457f-9687-b114b861e02f)
  )
  (junction (at 160.02 142.24) (diameter 0) (color 0 0 0 0)
    (uuid 97472cc1-36d9-492e-8771-d78f2bfc2ae1)
  )
  (junction (at 101.6 127) (diameter 0) (color 0 0 0 0)
    (uuid b2beecbd-da04-4fb3-89dd-da994fc729c3)
  )
  (junction (at 109.22 142.24) (diameter 0) (color 0 0 0 0)
    (uuid b646a2a7-0478-48b5-bedc-571b4abc11c4)
  )
  (junction (at 91.44 142.24) (diameter 0) (color 0 0 0 0)
    (uuid cb86096b-738f-4068-b612-970d1fb9ff73)
  )
  (junction (at 38.1 142.24) (diameter 0) (color 0 0 0 0)
    (uuid d0cbfd72-d8f4-40b3-851d-03809a62cb45)
  )
  (junction (at 73.66 142.24) (diameter 0) (color 0 0 0 0)
    (uuid e51c3e5c-7d83-4c09-a227-e46d3d16a8f0)
  )
  (junction (at 144.78 142.24) (diameter 0) (color 0 0 0 0)
    (uuid f247e372-c1cd-411e-b765-1c97ff486eee)
  )
  (junction (at 83.82 111.76) (diameter 0) (color 0 0 0 0)
    (uuid f306bcad-b12c-4a37-b035-852258098a8b)
  )
  (junction (at 55.88 142.24) (diameter 0) (color 0 0 0 0)
    (uuid f79d8d0e-dfbc-42e2-abec-594b0f57003c)
  )

  (bus_entry (at 124.46 96.52) (size -2.54 2.54)
    (stroke (width 0) (type default))
    (uuid 24a19b75-705e-4c5e-838a-4a2babe6c346)
  )
  (bus_entry (at 124.46 104.14) (size -2.54 2.54)
    (stroke (width 0) (type default))
    (uuid 2a86e862-b209-45dd-9ded-1bbe6a2deceb)
  )
  (bus_entry (at 124.46 83.82) (size -2.54 2.54)
    (stroke (width 0) (type default))
    (uuid 5c36bfd5-55aa-4661-8cb6-3fe29f9b7e2a)
  )
  (bus_entry (at 124.46 99.06) (size -2.54 2.54)
    (stroke (width 0) (type default))
    (uuid 62c59afc-1058-461e-84df-be61b828d53a)
  )
  (bus_entry (at 124.46 93.98) (size -2.54 2.54)
    (stroke (width 0) (type default))
    (uuid 7bc53897-685a-4044-b0a0-f47d157a0961)
  )
  (bus_entry (at 78.74 83.82) (size 2.54 2.54)
    (stroke (width 0) (type default))
    (uuid 7cfcefcb-c99d-4322-b144-8bd8973d066d)
  )
  (bus_entry (at 124.46 119.38) (size -2.54 2.54)
    (stroke (width 0) (type default))
    (uuid 884f3cb5-79d9-4683-aa5a-46c0f0735e41)
  )
  (bus_entry (at 78.74 81.28) (size 2.54 2.54)
    (stroke (width 0) (type default))
    (uuid 90e48d5d-f6b3-4ab8-bb3e-c9222125dec6)
  )
  (bus_entry (at 124.46 111.76) (size -2.54 2.54)
    (stroke (width 0) (type default))
    (uuid 96c96ffb-f2e7-46df-8ff4-e6dc385d056b)
  )
  (bus_entry (at 124.46 101.6) (size -2.54 2.54)
    (stroke (width 0) (type default))
    (uuid 9d8b5011-67b7-4cee-b57b-312eaf54f322)
  )
  (bus_entry (at 124.46 91.44) (size -2.54 2.54)
    (stroke (width 0) (type default))
    (uuid a15195ef-f459-42fc-a7e4-de0bdc8de258)
  )
  (bus_entry (at 124.46 106.68) (size -2.54 2.54)
    (stroke (width 0) (type default))
    (uuid a46da833-8f85-4c81-9e9b-a60e6a02d3f2)
  )
  (bus_entry (at 124.46 88.9) (size -2.54 2.54)
    (stroke (width 0) (type default))
    (uuid ab6c1111-02aa-45d9-b092-bf996b48d84e)
  )
  (bus_entry (at 124.46 114.3) (size -2.54 2.54)
    (stroke (width 0) (type default))
    (uuid c2ae4526-61ff-4873-82d7-e023cedaed8e)
  )
  (bus_entry (at 124.46 81.28) (size -2.54 2.54)
    (stroke (width 0) (type default))
    (uuid d013e985-6681-4888-9633-f9024e487850)
  )
  (bus_entry (at 124.46 86.36) (size -2.54 2.54)
    (stroke (width 0) (type default))
    (uuid ea14fb53-21e9-4aef-ab84-cab874c330e3)
  )
  (bus_entry (at 124.46 116.84) (size -2.54 2.54)
    (stroke (width 0) (type default))
    (uuid eb7ad76f-48e7-4f9d-99f8-49508580461d)
  )
  (bus_entry (at 124.46 109.22) (size -2.54 2.54)
    (stroke (width 0) (type default))
    (uuid f48e45a8-55fb-41dd-af2f-20e821526b78)
  )

  (wire (pts (xy 55.88 144.78) (xy 55.88 142.24))
    (stroke (width 0) (type default))
    (uuid 0279dea5-5495-4882-82b3-15e6c405d1ea)
  )
  (wire (pts (xy 121.92 91.44) (xy 111.76 91.44))
    (stroke (width 0) (type default))
    (uuid 0394becf-9146-4c9f-b7b5-d607186b10ae)
  )
  (bus (pts (xy 124.46 91.44) (xy 124.46 93.98))
    (stroke (width 0) (type default))
    (uuid 096057d1-c20c-41e4-b293-c8a9b18e1daa)
  )

  (wire (pts (xy 91.44 160.02) (xy 91.44 149.86))
    (stroke (width 0) (type default))
    (uuid 0f7acfcd-9268-4a52-a9b5-9b7df53f8f57)
  )
  (wire (pts (xy 35.56 142.24) (xy 35.56 144.78))
    (stroke (width 0) (type default))
    (uuid 1816e93e-07f2-4679-bf1d-01fa4d91396a)
  )
  (wire (pts (xy 91.44 144.78) (xy 91.44 142.24))
    (stroke (width 0) (type default))
    (uuid 187c3475-8e48-4ad5-be1f-45f1a8aea332)
  )
  (bus (pts (xy 134.62 111.76) (xy 124.46 111.76))
    (stroke (width 0) (type default))
    (uuid 196fe658-23c8-44c9-b6e9-9e6debf3675d)
  )

  (wire (pts (xy 73.66 160.02) (xy 73.66 149.86))
    (stroke (width 0) (type default))
    (uuid 1b3c231c-c076-40a6-8555-179eed321366)
  )
  (wire (pts (xy 127 160.02) (xy 127 149.86))
    (stroke (width 0) (type default))
    (uuid 2721a631-0b16-4e80-9bf0-8318c104f152)
  )
  (wire (pts (xy 83.82 109.22) (xy 91.44 109.22))
    (stroke (width 0) (type default))
    (uuid 2a0f638a-2b0b-44e3-afd4-5a7d7f522bc8)
  )
  (wire (pts (xy 53.34 142.24) (xy 55.88 142.24))
    (stroke (width 0) (type default))
    (uuid 2c0e9643-bfb8-4836-bd8a-f353a7172d62)
  )
  (bus (pts (xy 68.58 81.28) (xy 78.74 81.28))
    (stroke (width 0) (type default))
    (uuid 2d159fa3-5ec4-43db-9359-13eaffcf3c3e)
  )

  (wire (pts (xy 121.92 83.82) (xy 111.76 83.82))
    (stroke (width 0) (type default))
    (uuid 2da9b3a9-a721-4495-bbe1-9bb04b0885aa)
  )
  (bus (pts (xy 124.46 111.76) (xy 124.46 114.3))
    (stroke (width 0) (type default))
    (uuid 2feff531-c889-435f-bd54-3ce9eb70e0ea)
  )

  (wire (pts (xy 124.46 144.78) (xy 124.46 142.24))
    (stroke (width 0) (type default))
    (uuid 333042e3-8aca-4576-bef7-c9487d969e6a)
  )
  (bus (pts (xy 134.62 91.44) (xy 124.46 91.44))
    (stroke (width 0) (type default))
    (uuid 3720041b-0fff-4a5f-9940-e68eb15cab8b)
  )

  (wire (pts (xy 83.82 109.22) (xy 83.82 111.76))
    (stroke (width 0) (type default))
    (uuid 37c0b0da-ad4f-4e7e-b0b0-91c1015c149e)
  )
  (wire (pts (xy 124.46 160.02) (xy 124.46 149.86))
    (stroke (width 0) (type default))
    (uuid 38338d8c-3943-49aa-bc28-016c1bc94458)
  )
  (bus (pts (xy 134.62 116.84) (xy 124.46 116.84))
    (stroke (width 0) (type default))
    (uuid 3a7f49c2-c1d5-4a43-bee8-464375a53b2a)
  )

  (wire (pts (xy 55.88 160.02) (xy 55.88 149.86))
    (stroke (width 0) (type default))
    (uuid 3b718a5a-7c66-4313-836c-60e2cc573840)
  )
  (wire (pts (xy 142.24 142.24) (xy 144.78 142.24))
    (stroke (width 0) (type default))
    (uuid 3cdcfd5a-599b-498b-9078-5055ddabe897)
  )
  (wire (pts (xy 121.92 121.92) (xy 111.76 121.92))
    (stroke (width 0) (type default))
    (uuid 3e6c5a89-3a72-4efa-b147-a88208c2f483)
  )
  (wire (pts (xy 101.6 71.12) (xy 101.6 73.66))
    (stroke (width 0) (type default))
    (uuid 40e3c231-ca56-4690-872b-e6676e522afc)
  )
  (wire (pts (xy 109.22 160.02) (xy 109.22 149.86))
    (stroke (width 0) (type default))
    (uuid 427b9d47-c70b-4e5c-84cb-6a65b80130e9)
  )
  (bus (pts (xy 134.62 81.28) (xy 124.46 81.28))
    (stroke (width 0) (type default))
    (uuid 42c90ef5-0706-406e-ac18-56919fb9bc14)
  )

  (wire (pts (xy 124.46 142.24) (xy 127 142.24))
    (stroke (width 0) (type default))
    (uuid 44199ab3-2862-45a1-a292-2d3d9d21303e)
  )
  (wire (pts (xy 88.9 160.02) (xy 88.9 149.86))
    (stroke (width 0) (type default))
    (uuid 48582572-e402-4300-b7e7-c97e6a1506bd)
  )
  (wire (pts (xy 144.78 142.24) (xy 160.02 142.24))
    (stroke (width 0) (type default))
    (uuid 48b07196-3b5e-4250-a040-e567a576b073)
  )
  (wire (pts (xy 35.56 160.02) (xy 35.56 149.86))
    (stroke (width 0) (type default))
    (uuid 4e8ada7f-ec98-4759-9d27-f9211ce14961)
  )
  (wire (pts (xy 91.44 142.24) (xy 88.9 142.24))
    (stroke (width 0) (type default))
    (uuid 506ebfa8-e841-4df8-bdad-cf32412664c3)
  )
  (wire (pts (xy 83.82 127) (xy 101.6 127))
    (stroke (width 0) (type default))
    (uuid 50d8ee8d-4a75-4b1a-a005-c0530943437c)
  )
  (wire (pts (xy 162.56 160.02) (xy 162.56 149.86))
    (stroke (width 0) (type default))
    (uuid 5165a33a-32eb-44b4-9392-c84861145e72)
  )
  (bus (pts (xy 78.74 81.28) (xy 78.74 83.82))
    (stroke (width 0) (type default))
    (uuid 5786a166-9e6a-4676-a504-11ea04e82133)
  )

  (wire (pts (xy 35.56 142.24) (xy 38.1 142.24))
    (stroke (width 0) (type default))
    (uuid 58dd598b-53a3-414a-831c-6177b894cc58)
  )
  (wire (pts (xy 121.92 111.76) (xy 111.76 111.76))
    (stroke (width 0) (type default))
    (uuid 5b141827-eb13-4c46-aa11-a438204b24f2)
  )
  (wire (pts (xy 121.92 106.68) (xy 111.76 106.68))
    (stroke (width 0) (type default))
    (uuid 5ec22a74-d211-4057-a6c0-a8364b78d72c)
  )
  (wire (pts (xy 127 142.24) (xy 142.24 142.24))
    (stroke (width 0) (type default))
    (uuid 6040ce8b-960e-4057-b1fc-08ce31247c12)
  )
  (wire (pts (xy 106.68 142.24) (xy 106.68 144.78))
    (stroke (width 0) (type default))
    (uuid 60902b0a-f946-406b-8e1b-e3e24dd32fc2)
  )
  (wire (pts (xy 81.28 83.82) (xy 91.44 83.82))
    (stroke (width 0) (type default))
    (uuid 62cf930b-56e1-4b8f-ba47-836f1b0048d1)
  )
  (wire (pts (xy 73.66 144.78) (xy 73.66 142.24))
    (stroke (width 0) (type default))
    (uuid 6685e8c8-7086-4cf5-acf9-e86aa8b041ef)
  )
  (wire (pts (xy 71.12 160.02) (xy 71.12 149.86))
    (stroke (width 0) (type default))
    (uuid 69e72b77-5c6c-4bf4-8015-060088a9de58)
  )
  (wire (pts (xy 106.68 142.24) (xy 109.22 142.24))
    (stroke (width 0) (type default))
    (uuid 6aeb52c7-9306-48f6-a22a-6f95b0977a43)
  )
  (bus (pts (xy 134.62 96.52) (xy 124.46 96.52))
    (stroke (width 0) (type default))
    (uuid 6cc47f1a-79a3-4f94-9a76-a6449c14a0d6)
  )

  (wire (pts (xy 162.56 144.78) (xy 162.56 142.24))
    (stroke (width 0) (type default))
    (uuid 71734750-b873-4180-866b-abc4bbdda91d)
  )
  (wire (pts (xy 101.6 73.66) (xy 104.14 73.66))
    (stroke (width 0) (type default))
    (uuid 75917772-c73f-4395-a214-fbdf12c38509)
  )
  (bus (pts (xy 124.46 96.52) (xy 124.46 99.06))
    (stroke (width 0) (type default))
    (uuid 791fc2b2-0000-4489-a472-367e6178c3b1)
  )
  (bus (pts (xy 124.46 81.28) (xy 124.46 83.82))
    (stroke (width 0) (type default))
    (uuid 7af9e96e-381e-48db-a0c6-a3a76b6be202)
  )

  (wire (pts (xy 91.44 142.24) (xy 106.68 142.24))
    (stroke (width 0) (type default))
    (uuid 7f0f3f7c-0aef-434d-88c2-c71789406396)
  )
  (wire (pts (xy 53.34 160.02) (xy 53.34 149.86))
    (stroke (width 0) (type default))
    (uuid 81459f35-e6e0-4bc3-b6d8-c926c1bc1561)
  )
  (wire (pts (xy 83.82 111.76) (xy 91.44 111.76))
    (stroke (width 0) (type default))
    (uuid 82cb5878-d017-4fcc-b61a-b6fb87692189)
  )
  (wire (pts (xy 109.22 142.24) (xy 124.46 142.24))
    (stroke (width 0) (type default))
    (uuid 85a4d031-7d83-4034-86a2-9013e1f8a49f)
  )
  (wire (pts (xy 38.1 160.02) (xy 38.1 149.86))
    (stroke (width 0) (type default))
    (uuid 8870eea4-bb33-468e-bde1-41380ba1788e)
  )
  (wire (pts (xy 88.9 144.78) (xy 88.9 142.24))
    (stroke (width 0) (type default))
    (uuid 89f3c256-a964-49ae-ba1a-9aaeddfccbef)
  )
  (wire (pts (xy 121.92 104.14) (xy 111.76 104.14))
    (stroke (width 0) (type default))
    (uuid 8d322143-2c17-4a6a-a7ba-b27b21464c65)
  )
  (wire (pts (xy 73.66 142.24) (xy 88.9 142.24))
    (stroke (width 0) (type default))
    (uuid 915019c2-f590-4b89-85fb-16b6525a2a06)
  )
  (bus (pts (xy 134.62 86.36) (xy 124.46 86.36))
    (stroke (width 0) (type default))
    (uuid 9271c269-b2ee-42b5-b2a9-85d6527ccda8)
  )

  (wire (pts (xy 121.92 109.22) (xy 111.76 109.22))
    (stroke (width 0) (type default))
    (uuid 931c2361-7081-4360-b14a-03407899d7f4)
  )
  (bus (pts (xy 124.46 106.68) (xy 124.46 109.22))
    (stroke (width 0) (type default))
    (uuid 9cbd90aa-e270-4371-ba56-e62b5b07bf69)
  )

  (wire (pts (xy 144.78 160.02) (xy 144.78 149.86))
    (stroke (width 0) (type default))
    (uuid 9e1052c6-10d8-447d-848b-1dbdfc462a16)
  )
  (wire (pts (xy 162.56 142.24) (xy 160.02 142.24))
    (stroke (width 0) (type default))
    (uuid 9fcf4af1-dd10-4ac0-aa9c-3cc66bfd8500)
  )
  (wire (pts (xy 121.92 86.36) (xy 111.76 86.36))
    (stroke (width 0) (type default))
    (uuid a334cc89-9e33-4bc9-b2ac-343542aef7f8)
  )
  (bus (pts (xy 124.46 116.84) (xy 124.46 119.38))
    (stroke (width 0) (type default))
    (uuid a86c6d70-cbd8-4a32-afd6-2da87106cf1d)
  )

  (wire (pts (xy 121.92 114.3) (xy 111.76 114.3))
    (stroke (width 0) (type default))
    (uuid a9f7d4e5-5ba8-4242-99c8-b0ffb4ba5b0b)
  )
  (wire (pts (xy 81.28 86.36) (xy 91.44 86.36))
    (stroke (width 0) (type default))
    (uuid b16b607c-92be-4099-8440-5bef7c40e8c5)
  )
  (wire (pts (xy 71.12 142.24) (xy 73.66 142.24))
    (stroke (width 0) (type default))
    (uuid b1897b12-0055-47b9-ad78-9d6ab5987b35)
  )
  (wire (pts (xy 38.1 142.24) (xy 53.34 142.24))
    (stroke (width 0) (type default))
    (uuid b5d5188a-c959-450a-b9fd-64e1462946d8)
  )
  (wire (pts (xy 121.92 99.06) (xy 111.76 99.06))
    (stroke (width 0) (type default))
    (uuid b621b808-4489-4633-979c-f26f5c44598e)
  )
  (bus (pts (xy 124.46 86.36) (xy 124.46 88.9))
    (stroke (width 0) (type default))
    (uuid ba701103-5519-4010-895e-b9d0f0b87ee6)
  )

  (wire (pts (xy 144.78 144.78) (xy 144.78 142.24))
    (stroke (width 0) (type default))
    (uuid c153ef6c-6333-4b3f-ace0-2d873b544104)
  )
  (wire (pts (xy 91.44 71.12) (xy 101.6 71.12))
    (stroke (width 0) (type default))
    (uuid c15ce2da-d5a2-4daa-b44e-abd772f97c9d)
  )
  (wire (pts (xy 142.24 160.02) (xy 142.24 149.86))
    (stroke (width 0) (type default))
    (uuid c38fe912-401b-4077-9cbd-5a965d8fea36)
  )
  (wire (pts (xy 83.82 96.52) (xy 91.44 96.52))
    (stroke (width 0) (type default))
    (uuid c3dd1748-b635-4473-9c4f-cd9bd2fa1d10)
  )
  (bus (pts (xy 124.46 101.6) (xy 124.46 104.14))
    (stroke (width 0) (type default))
    (uuid c464b122-fb34-405f-ac4f-241b1f8e07bc)
  )

  (wire (pts (xy 121.92 116.84) (xy 111.76 116.84))
    (stroke (width 0) (type default))
    (uuid c9557785-9676-4e5a-81f1-54e13ea42158)
  )
  (wire (pts (xy 121.92 119.38) (xy 111.76 119.38))
    (stroke (width 0) (type default))
    (uuid ca173320-ceb9-41e0-bb29-546a329003bf)
  )
  (wire (pts (xy 160.02 160.02) (xy 160.02 149.86))
    (stroke (width 0) (type default))
    (uuid ca7b30ba-23b0-4063-8c22-e2c795cf81e5)
  )
  (wire (pts (xy 53.34 144.78) (xy 53.34 142.24))
    (stroke (width 0) (type default))
    (uuid d16d2bfc-8dde-4bd3-8730-d8e0fa84d584)
  )
  (wire (pts (xy 121.92 93.98) (xy 111.76 93.98))
    (stroke (width 0) (type default))
    (uuid d3b2912e-8d6a-4af3-b4db-199e98fd2b39)
  )
  (wire (pts (xy 38.1 144.78) (xy 38.1 142.24))
    (stroke (width 0) (type default))
    (uuid d4a793f5-1731-4f09-99bd-2861c85bce43)
  )
  (bus (pts (xy 134.62 101.6) (xy 124.46 101.6))
    (stroke (width 0) (type default))
    (uuid db27c7f0-e8c6-498a-a6d3-2b2e056057c2)
  )

  (wire (pts (xy 71.12 144.78) (xy 71.12 142.24))
    (stroke (width 0) (type default))
    (uuid db62aa95-67ad-4142-b5d6-5db48f62b0d6)
  )
  (bus (pts (xy 134.62 106.68) (xy 124.46 106.68))
    (stroke (width 0) (type default))
    (uuid df5f503f-14be-4b28-b876-d1d0d418130b)
  )

  (wire (pts (xy 142.24 144.78) (xy 142.24 142.24))
    (stroke (width 0) (type default))
    (uuid e70c4c64-ecfe-4a93-b483-307c88cb83dd)
  )
  (wire (pts (xy 109.22 144.78) (xy 109.22 142.24))
    (stroke (width 0) (type default))
    (uuid e7dcc479-32dd-40e5-af0a-52ae8544aabd)
  )
  (wire (pts (xy 121.92 88.9) (xy 111.76 88.9))
    (stroke (width 0) (type default))
    (uuid e815e554-0601-442b-8b6c-608c56aa10b0)
  )
  (wire (pts (xy 35.56 139.7) (xy 35.56 142.24))
    (stroke (width 0) (type default))
    (uuid e9420bd1-dd21-4af0-83b0-8db7df626c32)
  )
  (wire (pts (xy 101.6 73.66) (xy 101.6 78.74))
    (stroke (width 0) (type default))
    (uuid edb0eb46-c39b-484e-9d7b-a5e9a925432f)
  )
  (wire (pts (xy 121.92 96.52) (xy 111.76 96.52))
    (stroke (width 0) (type default))
    (uuid eef2bae4-a55d-4d37-b241-31f509f12fcc)
  )
  (wire (pts (xy 55.88 142.24) (xy 71.12 142.24))
    (stroke (width 0) (type default))
    (uuid f2685b7a-c0a3-4306-98a9-a10473a98bd2)
  )
  (wire (pts (xy 160.02 144.78) (xy 160.02 142.24))
    (stroke (width 0) (type default))
    (uuid f76d1773-e766-4298-afff-8a7f88a42756)
  )
  (wire (pts (xy 127 144.78) (xy 127 142.24))
    (stroke (width 0) (type default))
    (uuid f7751d9d-0f55-4a75-b41e-1080c40eccbf)
  )
  (wire (pts (xy 83.82 111.76) (xy 83.82 127))
    (stroke (width 0) (type default))
    (uuid f946d239-cda8-4dc3-a1fe-dd7a0a551759)
  )
  (wire (pts (xy 121.92 101.6) (xy 111.76 101.6))
    (stroke (width 0) (type default))
    (uuid fd9f2500-a07d-4cf1-82b0-b6081ff1c2d7)
  )
  (wire (pts (xy 106.68 160.02) (xy 106.68 149.86))
    (stroke (width 0) (type default))
    (uuid fec1d53a-a80a-429b-8f3e-9daf23d08174)
  )

  (text "<100µA" (at 109.22 76.2 0)
    (effects (font (size 1.27 1.27)) (justify left bottom))
    (uuid a183d237-da8f-40d4-ae0d-e594f988063d)
  )

  (label "I2C_2.SCL" (at 71.12 160.02 90) (fields_autoplaced)
    (effects (font (size 1.27 1.27)) (justify left bottom))
    (uuid 133f0c31-4274-4172-8901-c35195f3e56b)
  )
  (label "I2C_5.SDA" (at 127 160.02 90) (fields_autoplaced)
    (effects (font (size 1.27 1.27)) (justify left bottom))
    (uuid 1b28919c-0358-4d53-9435-63a25ba31cc4)
  )
  (label "I2C_5.SDA" (at 121.92 111.76 180) (fields_autoplaced)
    (effects (font (size 1.27 1.27)) (justify right bottom))
    (uuid 361b4697-e9cc-4291-a92b-96b07a7be765)
  )
  (label "I2C_4.SCL" (at 121.92 104.14 180) (fields_autoplaced)
    (effects (font (size 1.27 1.27)) (justify right bottom))
    (uuid 38484e96-54bc-4e97-9efa-6d7a964a1804)
  )
  (label "I2C_3.SCL" (at 88.9 160.02 90) (fields_autoplaced)
    (effects (font (size 1.27 1.27)) (justify left bottom))
    (uuid 38e3f9e5-6f64-480b-bde7-792e14c2cdb6)
  )
  (label "I2C.SDA" (at 81.28 86.36 0) (fields_autoplaced)
    (effects (font (size 1.27 1.27)) (justify left bottom))
    (uuid 3e5dc99f-9a23-43c1-95c6-447ef2ddce3b)
  )
  (label "I2C_2.SDA" (at 121.92 96.52 180) (fields_autoplaced)
    (effects (font (size 1.27 1.27)) (justify right bottom))
    (uuid 4c8d96a6-b5ab-4a20-ab3e-a9d14b47f5f9)
  )
  (label "I2C.SCL" (at 81.28 83.82 0) (fields_autoplaced)
    (effects (font (size 1.27 1.27)) (justify left bottom))
    (uuid 4cdf107f-d63e-4943-bdf2-589f78891485)
  )
  (label "I2C_0.SCL" (at 35.56 160.02 90) (fields_autoplaced)
    (effects (font (size 1.27 1.27)) (justify left bottom))
    (uuid 603998ae-1f89-4e0d-b738-ffe85fc2aac7)
  )
  (label "I2C_1.SCL" (at 121.92 88.9 180) (fields_autoplaced)
    (effects (font (size 1.27 1.27)) (justify right bottom))
    (uuid 605dd61b-b681-44ef-b7bb-32ca5bb6e33e)
  )
  (label "I2C_6.SDA" (at 144.78 160.02 90) (fields_autoplaced)
    (effects (font (size 1.27 1.27)) (justify left bottom))
    (uuid 615c5de4-7b68-440a-adb5-5cf513205021)
  )
  (label "I2C_7.SDA" (at 121.92 121.92 180) (fields_autoplaced)
    (effects (font (size 1.27 1.27)) (justify right bottom))
    (uuid 64386559-6c55-492f-8882-a0badeca448a)
  )
  (label "I2C_1.SDA" (at 55.88 160.02 90) (fields_autoplaced)
    (effects (font (size 1.27 1.27)) (justify left bottom))
    (uuid 6b0fd8fc-70ea-4c86-a00a-91bc8592f187)
  )
  (label "I2C_4.SCL" (at 106.68 160.02 90) (fields_autoplaced)
    (effects (font (size 1.27 1.27)) (justify left bottom))
    (uuid 6d7f5bfd-f5d6-4f1a-959a-129a04a4adc8)
  )
  (label "I2C_2.SDA" (at 73.66 160.02 90) (fields_autoplaced)
    (effects (font (size 1.27 1.27)) (justify left bottom))
    (uuid 753aa178-6054-4102-b1a3-f1404f1be786)
  )
  (label "I2C_3.SDA" (at 91.44 160.02 90) (fields_autoplaced)
    (effects (font (size 1.27 1.27)) (justify left bottom))
    (uuid 801ed606-630f-460a-b161-b8089ad382fe)
  )
  (label "I2C_0.SCL" (at 121.92 83.82 180) (fields_autoplaced)
    (effects (font (size 1.27 1.27)) (justify right bottom))
    (uuid 809ae310-5f28-448c-bcf4-e08a6418c642)
  )
  (label "I2C_6.SCL" (at 142.24 160.02 90) (fields_autoplaced)
    (effects (font (size 1.27 1.27)) (justify left bottom))
    (uuid 89053553-e9a3-477d-9052-b45ef78193da)
  )
  (label "I2C_4.SDA" (at 121.92 106.68 180) (fields_autoplaced)
    (effects (font (size 1.27 1.27)) (justify right bottom))
    (uuid 908ff85b-80f9-4136-93b3-15e149a3d56e)
  )
  (label "I2C_3.SCL" (at 121.92 99.06 180) (fields_autoplaced)
    (effects (font (size 1.27 1.27)) (justify right bottom))
    (uuid 93e22054-30a1-4535-9114-ba9f84b432d8)
  )
  (label "I2C_6.SCL" (at 121.92 114.3 180) (fields_autoplaced)
    (effects (font (size 1.27 1.27)) (justify right bottom))
    (uuid 95e5103e-b9a7-4bd3-89e7-c940b5e8e024)
  )
  (label "I2C_0.SDA" (at 121.92 86.36 180) (fields_autoplaced)
    (effects (font (size 1.27 1.27)) (justify right bottom))
    (uuid 97b8c3ec-1423-4a8c-b487-cd3ed3f1237a)
  )
  (label "I2C_2.SCL" (at 121.92 93.98 180) (fields_autoplaced)
    (effects (font (size 1.27 1.27)) (justify right bottom))
    (uuid 9a952802-07bb-4ee6-8564-c750aa7bb0af)
  )
  (label "I2C_5.SCL" (at 121.92 109.22 180) (fields_autoplaced)
    (effects (font (size 1.27 1.27)) (justify right bottom))
    (uuid a3824700-f82d-46ec-898f-254af6c69f26)
  )
  (label "I2C_7.SCL" (at 121.92 119.38 180) (fields_autoplaced)
    (effects (font (size 1.27 1.27)) (justify right bottom))
    (uuid a4e1d88c-d3de-4f6c-81de-50cf43a0b819)
  )
  (label "I2C_0.SDA" (at 38.1 160.02 90) (fields_autoplaced)
    (effects (font (size 1.27 1.27)) (justify left bottom))
    (uuid aa632772-fb8e-42dc-94ee-2df54b4b30a1)
  )
  (label "I2C_3.SDA" (at 121.92 101.6 180) (fields_autoplaced)
    (effects (font (size 1.27 1.27)) (justify right bottom))
    (uuid bdf24116-4077-4ec1-99e5-98629ed8bcd2)
  )
  (label "I2C_6.SDA" (at 121.92 116.84 180) (fields_autoplaced)
    (effects (font (size 1.27 1.27)) (justify right bottom))
    (uuid c201c60e-e582-47fa-94c9-3c2e78dfda2e)
  )
  (label "I2C_1.SCL" (at 53.34 160.02 90) (fields_autoplaced)
    (effects (font (size 1.27 1.27)) (justify left bottom))
    (uuid d49a36c9-5cf6-4718-a683-37b82a39db70)
  )
  (label "I2C_4.SDA" (at 109.22 160.02 90) (fields_autoplaced)
    (effects (font (size 1.27 1.27)) (justify left bottom))
    (uuid d5a27ce0-b329-4a1e-894b-26ac2d4aecb6)
  )
  (label "I2C_5.SCL" (at 124.46 160.02 90) (fields_autoplaced)
    (effects (font (size 1.27 1.27)) (justify left bottom))
    (uuid e4314a3e-7e0d-4225-8a88-30c513ac34f0)
  )
  (label "I2C_7.SCL" (at 160.02 160.02 90) (fields_autoplaced)
    (effects (font (size 1.27 1.27)) (justify left bottom))
    (uuid f4703631-b43a-4071-a90a-b93f34a15703)
  )
  (label "I2C_1.SDA" (at 121.92 91.44 180) (fields_autoplaced)
    (effects (font (size 1.27 1.27)) (justify right bottom))
    (uuid f8e8b9c3-874d-45d4-ac78-8ba32a070b7c)
  )
  (label "I2C_7.SDA" (at 162.56 160.02 90) (fields_autoplaced)
    (effects (font (size 1.27 1.27)) (justify left bottom))
    (uuid fc95ca1f-6aa7-493a-a92a-7b104c0382a1)
  )

  (global_label "I2C_~{RST}" (shape input) (at 83.82 96.52 180) (fields_autoplaced)
    (effects (font (size 1.27 1.27)) (justify right))
    (uuid 723cefa3-f07e-4b4c-9c40-ecd8f18afedd)
    (property "Intersheetrefs" "${INTERSHEET_REFS}" (at 73.3358 96.52 0)
      (effects (font (size 1.27 1.27)) (justify right) hide)
    )
  )

  (hierarchical_label "I2C_2{I2C}" (shape output) (at 134.62 91.44 0) (fields_autoplaced)
    (effects (font (size 1.27 1.27)) (justify left))
    (uuid 2589de01-47c3-4e9c-a01c-22efd6ad70ba)
  )
  (hierarchical_label "I2C{I2C}" (shape input) (at 68.58 81.28 180) (fields_autoplaced)
    (effects (font (size 1.27 1.27)) (justify right))
    (uuid 621eb9f0-2a49-4e5f-b0f4-8b0cc0ccd935)
  )
  (hierarchical_label "I2C_0{I2C}" (shape output) (at 134.62 81.28 0) (fields_autoplaced)
    (effects (font (size 1.27 1.27)) (justify left))
    (uuid 6b4a07ee-88c1-4f79-8545-e72dabc257c9)
  )
  (hierarchical_label "Hi" (shape output) (at 104.14 73.66 0) (fields_autoplaced)
    (effects (font (size 1.27 1.27)) (justify left))
    (uuid 6be0e206-b411-47f4-8248-341af059fa2a)
  )
  (hierarchical_label "I2C_1{I2C}" (shape output) (at 134.62 86.36 0) (fields_autoplaced)
    (effects (font (size 1.27 1.27)) (justify left))
    (uuid 6f0e5674-2a8d-481b-873c-89d47c63f59f)
  )
  (hierarchical_label "I2C_6{I2C}" (shape output) (at 134.62 111.76 0) (fields_autoplaced)
    (effects (font (size 1.27 1.27)) (justify left))
    (uuid 80132815-0ccf-43ef-97ca-171bca19a5cd)
  )
  (hierarchical_label "I2C_5{I2C}" (shape output) (at 134.62 106.68 0) (fields_autoplaced)
    (effects (font (size 1.27 1.27)) (justify left))
    (uuid 8b8f38bf-6e3e-4e88-9c80-5faa46156a25)
  )
  (hierarchical_label "I2C_3{I2C}" (shape output) (at 134.62 96.52 0) (fields_autoplaced)
    (effects (font (size 1.27 1.27)) (justify left))
    (uuid 965fa4b0-7390-4344-a02a-c39f801beb72)
  )
  (hierarchical_label "I2C_4{I2C}" (shape output) (at 134.62 101.6 0) (fields_autoplaced)
    (effects (font (size 1.27 1.27)) (justify left))
    (uuid 982c8b98-33b2-4b4a-be07-d093cf38e2c9)
  )
  (hierarchical_label "A0" (shape input) (at 91.44 114.3 180) (fields_autoplaced)
    (effects (font (size 1.27 1.27)) (justify right))
    (uuid cbd0886d-19ba-47d8-af37-caf7f3743702)
  )
  (hierarchical_label "I2C_7{I2C}" (shape output) (at 134.62 116.84 0) (fields_autoplaced)
    (effects (font (size 1.27 1.27)) (justify left))
    (uuid db24afdb-c084-45fa-95c5-20d878c1bea5)
  )

  (symbol (lib_id "Misc:R_Small_Pack04_Split") (at 73.66 147.32 0) (unit 3)
    (in_bom yes) (on_board yes) (dnp no) (fields_autoplaced)
    (uuid 08157f23-afa2-474d-bd5e-1d98f4c60ed0)
    (property "Reference" "RN2" (at 75.1586 146.1079 0)
      (effects (font (size 1.27 1.27)) (justify left))
    )
    (property "Value" "10k" (at 75.1586 148.5321 0)
      (effects (font (size 1.27 1.27)) (justify left))
    )
    (property "Footprint" "Resistor_SMD:R_Array_Concave_4x0402" (at 75.438 147.32 90)
      (effects (font (size 1.27 1.27)) hide)
    )
    (property "Datasheet" "https://api.pim.na.industrial.panasonic.com/file_stream/main/fileversion/1255" (at 73.66 147.32 0)
      (effects (font (size 1.27 1.27)) hide)
    )
    (property "Manufacturer" "Panasonic" (at 73.66 147.32 0)
      (effects (font (size 1.27 1.27)) hide)
    )
    (property "Partnumber" "EXB-28V103JX" (at 73.66 147.32 0)
      (effects (font (size 1.27 1.27)) hide)
    )
    (property "Spec" "" (at 73.66 147.32 0)
      (effects (font (size 1.27 1.27)) hide)
    )
    (property "Update" "paul3" (at 73.66 147.32 0)
      (effects (font (size 1.27 1.27)) hide)
    )
    (property "description" "10k Ohm ±5% 62.5mW Power Per Element Isolated 4 Resistor Network/Array ±200ppm/°C 0804, Convex, Long Side Terminals" (at 73.66 147.32 0)
      (effects (font (size 1.27 1.27)) hide)
    )
    (property "note" "" (at 73.66 147.32 0)
      (effects (font (size 1.27 1.27)) hide)
    )
    (property "Digikey" "Y7103CT-ND" (at 73.66 147.32 0)
      (effects (font (size 1.27 1.27)) hide)
    )
    (property "tape" "8,2,NE" (at 73.66 147.32 0)
      (effects (font (size 1.27 1.27)) hide)
    )
    (property "Attrition" "10" (at 73.66 147.32 0)
      (effects (font (size 1.27 1.27)) hide)
    )
    (pin "1" (uuid ece4ffeb-3563-49e1-9908-4a36f1847d92))
    (pin "8" (uuid 6554fe01-de88-4a4e-8c23-f9e07030a85f))
    (pin "2" (uuid efe3cdf2-29f6-4c01-9d5a-ffd854ba9119))
    (pin "7" (uuid b2679832-59c3-4205-a7ff-ceda7b96fbbc))
    (pin "3" (uuid c84ab1dd-9324-4bd7-aab5-0eb5c71d4d20))
    (pin "6" (uuid 9e8c14b8-1316-4f6a-9a7f-25e7fa4e7340))
    (pin "4" (uuid f51e9130-dda9-433e-b6b3-909729a4c630))
    (pin "5" (uuid 319a20a6-be25-4458-91d9-b7e41f62dc6c))
    (instances
      (project "curium2_main"
        (path "/e8b3d2d8-64ad-4d45-b56e-55015b7769e2/2500bd58-e91a-4288-8dba-7cd1e1582535"
          (reference "RN2") (unit 3)
        )
        (path "/e8b3d2d8-64ad-4d45-b56e-55015b7769e2/d7074b79-008b-4fef-b87f-e14f3ee45d50"
          (reference "RN6") (unit 3)
        )
      )
    )
  )

  (symbol (lib_id "Misc:R_Small_Pack04_Split") (at 53.34 147.32 0) (unit 2)
    (in_bom yes) (on_board yes) (dnp no) (fields_autoplaced)
    (uuid 0f253df0-bf3b-40f4-ab4c-efa439c154fc)
    (property "Reference" "RN1" (at 51.8414 146.1079 0)
      (effects (font (size 1.27 1.27)) (justify right))
    )
    (property "Value" "10k" (at 51.8414 148.5321 0)
      (effects (font (size 1.27 1.27)) (justify right))
    )
    (property "Footprint" "Resistor_SMD:R_Array_Concave_4x0402" (at 55.118 147.32 90)
      (effects (font (size 1.27 1.27)) hide)
    )
    (property "Datasheet" "https://api.pim.na.industrial.panasonic.com/file_stream/main/fileversion/1255" (at 53.34 147.32 0)
      (effects (font (size 1.27 1.27)) hide)
    )
    (property "Manufacturer" "Panasonic" (at 53.34 147.32 0)
      (effects (font (size 1.27 1.27)) hide)
    )
    (property "Partnumber" "EXB-28V103JX" (at 53.34 147.32 0)
      (effects (font (size 1.27 1.27)) hide)
    )
    (property "Spec" "" (at 53.34 147.32 0)
      (effects (font (size 1.27 1.27)) hide)
    )
    (property "Update" "paul3" (at 53.34 147.32 0)
      (effects (font (size 1.27 1.27)) hide)
    )
    (property "description" "10k Ohm ±5% 62.5mW Power Per Element Isolated 4 Resistor Network/Array ±200ppm/°C 0804, Convex, Long Side Terminals" (at 53.34 147.32 0)
      (effects (font (size 1.27 1.27)) hide)
    )
    (property "note" "" (at 53.34 147.32 0)
      (effects (font (size 1.27 1.27)) hide)
    )
    (property "Digikey" "Y7103CT-ND" (at 53.34 147.32 0)
      (effects (font (size 1.27 1.27)) hide)
    )
    (property "tape" "8,2,NE" (at 53.34 147.32 0)
      (effects (font (size 1.27 1.27)) hide)
    )
    (property "Attrition" "10" (at 53.34 147.32 0)
      (effects (font (size 1.27 1.27)) hide)
    )
    (pin "1" (uuid f7f55521-d31f-4314-a0fa-77ffd6a05131))
    (pin "8" (uuid 70c10da2-0c90-48fa-90a4-bd55a0182d17))
    (pin "2" (uuid 5eb2369d-4af4-4ac2-8406-f979d3d4dd56))
    (pin "7" (uuid 46a30329-7733-42fc-bdf7-2c8fb09a44b8))
    (pin "3" (uuid 469ab0c1-5644-43ce-9a41-a83e6b16a658))
    (pin "6" (uuid 778c3a0d-0a0c-4110-a983-c5c77271c159))
    (pin "4" (uuid 7dbf2136-2f4a-4e6a-9344-6a91542a1c28))
    (pin "5" (uuid 7ae5620c-f19d-4461-9a9c-879c93a41612))
    (instances
      (project "curium2_main"
        (path "/e8b3d2d8-64ad-4d45-b56e-55015b7769e2/2500bd58-e91a-4288-8dba-7cd1e1582535"
          (reference "RN1") (unit 2)
        )
        (path "/e8b3d2d8-64ad-4d45-b56e-55015b7769e2/d7074b79-008b-4fef-b87f-e14f3ee45d50"
          (reference "RN5") (unit 2)
        )
      )
    )
  )

  (symbol (lib_id "Misc:R_Small_Pack04_Split") (at 162.56 147.32 0) (unit 1)
    (in_bom yes) (on_board yes) (dnp no) (fields_autoplaced)
    (uuid 1f74269c-a270-4f68-828f-41726f9254ba)
    (property "Reference" "RN4" (at 164.0586 146.1079 0)
      (effects (font (size 1.27 1.27)) (justify left))
    )
    (property "Value" "10k" (at 164.0586 148.5321 0)
      (effects (font (size 1.27 1.27)) (justify left))
    )
    (property "Footprint" "Resistor_SMD:R_Array_Concave_4x0402" (at 164.338 147.32 90)
      (effects (font (size 1.27 1.27)) hide)
    )
    (property "Datasheet" "https://api.pim.na.industrial.panasonic.com/file_stream/main/fileversion/1255" (at 162.56 147.32 0)
      (effects (font (size 1.27 1.27)) hide)
    )
    (property "Manufacturer" "Panasonic" (at 162.56 147.32 0)
      (effects (font (size 1.27 1.27)) hide)
    )
    (property "Partnumber" "EXB-28V103JX" (at 162.56 147.32 0)
      (effects (font (size 1.27 1.27)) hide)
    )
    (property "Spec" "" (at 162.56 147.32 0)
      (effects (font (size 1.27 1.27)) hide)
    )
    (property "Update" "paul3" (at 162.56 147.32 0)
      (effects (font (size 1.27 1.27)) hide)
    )
    (property "description" "10k Ohm ±5% 62.5mW Power Per Element Isolated 4 Resistor Network/Array ±200ppm/°C 0804, Convex, Long Side Terminals" (at 162.56 147.32 0)
      (effects (font (size 1.27 1.27)) hide)
    )
    (property "note" "" (at 162.56 147.32 0)
      (effects (font (size 1.27 1.27)) hide)
    )
    (property "Digikey" "Y7103CT-ND" (at 162.56 147.32 0)
      (effects (font (size 1.27 1.27)) hide)
    )
    (property "tape" "8,2,NE" (at 162.56 147.32 0)
      (effects (font (size 1.27 1.27)) hide)
    )
    (property "Attrition" "10" (at 162.56 147.32 0)
      (effects (font (size 1.27 1.27)) hide)
    )
    (pin "1" (uuid d416e4b2-4f66-4e00-95dd-6a82de49cfe2))
    (pin "8" (uuid 1d07b634-d139-4f01-85eb-e738843c3500))
    (pin "2" (uuid acc28d0c-a7b6-4326-9a54-feb1a776e14c))
    (pin "7" (uuid 3c75975d-c946-43df-aa2e-bb1c854a8dc4))
    (pin "3" (uuid ee259c73-035f-49f0-86a4-e8a876334a01))
    (pin "6" (uuid 55d106d5-5cbe-4d0c-9c29-e36c29caf6c2))
    (pin "4" (uuid fd0719e1-edd7-407e-b4b3-4202e7fbeb3c))
    (pin "5" (uuid ad310b68-5170-410b-94d4-5e60d451857e))
    (instances
      (project "curium2_main"
        (path "/e8b3d2d8-64ad-4d45-b56e-55015b7769e2/2500bd58-e91a-4288-8dba-7cd1e1582535"
          (reference "RN4") (unit 1)
        )
        (path "/e8b3d2d8-64ad-4d45-b56e-55015b7769e2/d7074b79-008b-4fef-b87f-e14f3ee45d50"
          (reference "RN8") (unit 1)
        )
      )
    )
  )

  (symbol (lib_id "Misc:R_Small_Pack04_Split") (at 71.12 147.32 0) (unit 4)
    (in_bom yes) (on_board yes) (dnp no) (fields_autoplaced)
    (uuid 3868b60a-45af-4534-8fe9-8420331bb4e6)
    (property "Reference" "RN2" (at 69.6214 146.1079 0)
      (effects (font (size 1.27 1.27)) (justify right))
    )
    (property "Value" "10k" (at 69.6214 148.5321 0)
      (effects (font (size 1.27 1.27)) (justify right))
    )
    (property "Footprint" "Resistor_SMD:R_Array_Concave_4x0402" (at 72.898 147.32 90)
      (effects (font (size 1.27 1.27)) hide)
    )
    (property "Datasheet" "https://api.pim.na.industrial.panasonic.com/file_stream/main/fileversion/1255" (at 71.12 147.32 0)
      (effects (font (size 1.27 1.27)) hide)
    )
    (property "Manufacturer" "Panasonic" (at 71.12 147.32 0)
      (effects (font (size 1.27 1.27)) hide)
    )
    (property "Partnumber" "EXB-28V103JX" (at 71.12 147.32 0)
      (effects (font (size 1.27 1.27)) hide)
    )
    (property "Spec" "" (at 71.12 147.32 0)
      (effects (font (size 1.27 1.27)) hide)
    )
    (property "Update" "paul3" (at 71.12 147.32 0)
      (effects (font (size 1.27 1.27)) hide)
    )
    (property "description" "10k Ohm ±5% 62.5mW Power Per Element Isolated 4 Resistor Network/Array ±200ppm/°C 0804, Convex, Long Side Terminals" (at 71.12 147.32 0)
      (effects (font (size 1.27 1.27)) hide)
    )
    (property "note" "" (at 71.12 147.32 0)
      (effects (font (size 1.27 1.27)) hide)
    )
    (property "Digikey" "Y7103CT-ND" (at 71.12 147.32 0)
      (effects (font (size 1.27 1.27)) hide)
    )
    (property "tape" "8,2,NE" (at 71.12 147.32 0)
      (effects (font (size 1.27 1.27)) hide)
    )
    (property "Attrition" "10" (at 71.12 147.32 0)
      (effects (font (size 1.27 1.27)) hide)
    )
    (pin "1" (uuid 458c3e21-6a5c-494d-95f9-f8a041238beb))
    (pin "8" (uuid 25b3d953-3bbc-4bdf-ae7b-d6d11135fddc))
    (pin "2" (uuid 8b3d17ec-0199-4508-88e3-d63de734c582))
    (pin "7" (uuid a793a2c4-c7fe-419e-a163-a404196701bc))
    (pin "3" (uuid f09aa51c-f881-47e7-884d-0c6f552e8950))
    (pin "6" (uuid be585c40-01e9-4305-ac44-c9e642438cd4))
    (pin "4" (uuid a1dce824-03ac-4267-aabb-7d8be6d3fbd2))
    (pin "5" (uuid 120bf919-6e43-48e4-9f8c-ef8dad1c7358))
    (instances
      (project "curium2_main"
        (path "/e8b3d2d8-64ad-4d45-b56e-55015b7769e2/2500bd58-e91a-4288-8dba-7cd1e1582535"
          (reference "RN2") (unit 4)
        )
        (path "/e8b3d2d8-64ad-4d45-b56e-55015b7769e2/d7074b79-008b-4fef-b87f-e14f3ee45d50"
          (reference "RN6") (unit 4)
        )
      )
    )
  )

  (symbol (lib_id "Misc:R_Small_Pack04_Split") (at 160.02 147.32 0) (unit 2)
    (in_bom yes) (on_board yes) (dnp no) (fields_autoplaced)
    (uuid 4caec4b7-d6a0-453f-891d-8c96163743fc)
    (property "Reference" "RN4" (at 158.5214 146.1079 0)
      (effects (font (size 1.27 1.27)) (justify right))
    )
    (property "Value" "10k" (at 158.5214 148.5321 0)
      (effects (font (size 1.27 1.27)) (justify right))
    )
    (property "Footprint" "Resistor_SMD:R_Array_Concave_4x0402" (at 161.798 147.32 90)
      (effects (font (size 1.27 1.27)) hide)
    )
    (property "Datasheet" "https://api.pim.na.industrial.panasonic.com/file_stream/main/fileversion/1255" (at 160.02 147.32 0)
      (effects (font (size 1.27 1.27)) hide)
    )
    (property "Manufacturer" "Panasonic" (at 160.02 147.32 0)
      (effects (font (size 1.27 1.27)) hide)
    )
    (property "Partnumber" "EXB-28V103JX" (at 160.02 147.32 0)
      (effects (font (size 1.27 1.27)) hide)
    )
    (property "Spec" "" (at 160.02 147.32 0)
      (effects (font (size 1.27 1.27)) hide)
    )
    (property "Update" "paul3" (at 160.02 147.32 0)
      (effects (font (size 1.27 1.27)) hide)
    )
    (property "description" "10k Ohm ±5% 62.5mW Power Per Element Isolated 4 Resistor Network/Array ±200ppm/°C 0804, Convex, Long Side Terminals" (at 160.02 147.32 0)
      (effects (font (size 1.27 1.27)) hide)
    )
    (property "note" "" (at 160.02 147.32 0)
      (effects (font (size 1.27 1.27)) hide)
    )
    (property "Digikey" "Y7103CT-ND" (at 160.02 147.32 0)
      (effects (font (size 1.27 1.27)) hide)
    )
    (property "tape" "8,2,NE" (at 160.02 147.32 0)
      (effects (font (size 1.27 1.27)) hide)
    )
    (property "Attrition" "10" (at 160.02 147.32 0)
      (effects (font (size 1.27 1.27)) hide)
    )
    (pin "1" (uuid c0dba98d-c1c8-4df5-9d90-0d6c60a57cc9))
    (pin "8" (uuid 3e1c8c2e-8e1b-4a09-988a-c9560cb33e84))
    (pin "2" (uuid 9d7ffccf-be6f-47e9-ab7c-01b388fc455d))
    (pin "7" (uuid 2f912e68-cecc-402c-bd08-fd798ab0c217))
    (pin "3" (uuid 220fbbe4-7989-4529-8430-2557792ef1e9))
    (pin "6" (uuid 18531b10-4af4-4c03-b36a-1f7c4c82b43f))
    (pin "4" (uuid ee4194fe-8ff6-4cd7-a79e-81e9a301f2ad))
    (pin "5" (uuid d793fcfd-de1a-40a4-be9f-c2405ea9d4f4))
    (instances
      (project "curium2_main"
        (path "/e8b3d2d8-64ad-4d45-b56e-55015b7769e2/2500bd58-e91a-4288-8dba-7cd1e1582535"
          (reference "RN4") (unit 2)
        )
        (path "/e8b3d2d8-64ad-4d45-b56e-55015b7769e2/d7074b79-008b-4fef-b87f-e14f3ee45d50"
          (reference "RN8") (unit 2)
        )
      )
    )
  )

  (symbol (lib_id "power:+3V3") (at 35.56 139.7 0) (unit 1)
    (in_bom yes) (on_board yes) (dnp no) (fields_autoplaced)
    (uuid 4e99ac0b-d5d1-491f-bda9-fe4925b569eb)
    (property "Reference" "#PWR059" (at 35.56 143.51 0)
      (effects (font (size 1.27 1.27)) hide)
    )
    (property "Value" "+3V3" (at 35.56 135.5669 0)
      (effects (font (size 1.27 1.27)))
    )
    (property "Footprint" "" (at 35.56 139.7 0)
      (effects (font (size 1.27 1.27)) hide)
    )
    (property "Datasheet" "" (at 35.56 139.7 0)
      (effects (font (size 1.27 1.27)) hide)
    )
    (pin "1" (uuid 478d77c7-7d94-48c2-baeb-888a8a032965))
    (instances
      (project "curium2_main"
        (path "/e8b3d2d8-64ad-4d45-b56e-55015b7769e2/2500bd58-e91a-4288-8dba-7cd1e1582535"
          (reference "#PWR059") (unit 1)
        )
        (path "/e8b3d2d8-64ad-4d45-b56e-55015b7769e2/d7074b79-008b-4fef-b87f-e14f3ee45d50"
          (reference "#PWR063") (unit 1)
        )
      )
    )
  )

  (symbol (lib_id "Interface_Expansion:PCA9548ARGE") (at 101.6 101.6 0) (unit 1)
    (in_bom yes) (on_board yes) (dnp no) (fields_autoplaced)
    (uuid 6cd84625-3276-43e3-b5b4-3128d1244239)
    (property "Reference" "U9" (at 103.7941 77.1357 0)
      (effects (font (size 1.27 1.27)) (justify left))
    )
    (property "Value" "PCA9548ARGER" (at 103.7941 79.5599 0)
      (effects (font (size 1.27 1.27)) (justify left))
    )
    (property "Footprint" "Package_DFN_QFN:Texas_RGE0024C_VQFN-24-1EP_4x4mm_P0.5mm_EP2.1x2.1mm" (at 101.6 127 0)
      (effects (font (size 1.27 1.27)) hide)
    )
    (property "Datasheet" "http://www.ti.com/lit/ds/symlink/pca9548a.pdf" (at 102.87 95.25 0)
      (effects (font (size 1.27 1.27)) hide)
    )
    (property "Spec" "" (at 101.6 101.6 0)
      (effects (font (size 1.27 1.27)) hide)
    )
    (property "Update" "paul3" (at 101.6 101.6 0)
      (effects (font (size 1.27 1.27)) hide)
    )
    (property "description" "Translating Switch Interface 24-VQFN (4x4)" (at 101.6 101.6 0)
      (effects (font (size 1.27 1.27)) hide)
    )
    (property "note" "" (at 101.6 101.6 0)
      (effects (font (size 1.27 1.27)) hide)
    )
    (property "Digikey" "296-21776-1-ND" (at 101.6 101.6 0)
      (effects (font (size 1.27 1.27)) hide)
    )
    (property "Manufacturer" "TI" (at 101.6 101.6 0)
      (effects (font (size 1.27 1.27)) hide)
    )
    (property "Partnumber" "PCA9548ARGER" (at 101.6 101.6 0)
      (effects (font (size 1.27 1.27)) hide)
    )
    (property "tape" "" (at 101.6 101.6 0)
      (effects (font (size 1.27 1.27)) hide)
    )
    (property "Attrition" "10" (at 101.6 101.6 0)
      (effects (font (size 1.27 1.27)) hide)
    )
    (pin "1" (uuid 6539a98d-334f-493a-ac34-2bd72e7b1a98))
    (pin "10" (uuid 89e8b729-2b20-4d4e-bfe7-4e5976ca8b0f))
    (pin "11" (uuid a079b42c-dc9b-4051-b35d-14bb7f969d2b))
    (pin "12" (uuid 448263d9-8313-487d-a0c1-cb5950d32fc1))
    (pin "13" (uuid 38a89d51-6fc1-4f86-b837-26072ea4117c))
    (pin "14" (uuid 411a8873-d014-4f6c-a6e6-094cfc334d78))
    (pin "15" (uuid c4f5225f-f3e9-4ab5-98a6-97bebead3aa0))
    (pin "16" (uuid 27607650-02d5-4c16-aee9-436299f756aa))
    (pin "17" (uuid 4872f4cb-7beb-40c2-b3e7-2a80785dae10))
    (pin "18" (uuid c7436cf5-9427-45f8-9aa0-c29dafcc4cb5))
    (pin "19" (uuid 10076a86-787e-46fc-a8bf-39710b8cd1d5))
    (pin "2" (uuid c690dca1-3000-465e-9f6d-14123c3e854f))
    (pin "20" (uuid 304c02e1-ba45-4d45-be8b-85e75db7a688))
    (pin "21" (uuid 44e6ec8b-466b-4e2b-8282-c01e70787bd3))
    (pin "22" (uuid 01f7f185-e838-477e-a245-5a71cb97567f))
    (pin "23" (uuid fc683474-9492-43ae-af99-fc36e9b2b52c))
    (pin "24" (uuid f49295bf-d26e-48d4-ac28-ac13ce37e559))
    (pin "25" (uuid fa5bd15c-96eb-43c7-9fe1-ccc173982505))
    (pin "3" (uuid 49d5954c-14b4-4421-98dd-417e5259e1b0))
    (pin "4" (uuid c5e4d1a5-7237-44ed-9469-c02404d29259))
    (pin "5" (uuid 2ebf32ec-0b92-45b7-ad0d-e54236d91d85))
    (pin "6" (uuid 7f50f639-a2ad-4f17-847e-de3ef20bd94a))
    (pin "7" (uuid bda52c0f-294a-4a3c-9d44-3ee57e23fa88))
    (pin "8" (uuid b5a8f36e-6820-4d5e-ae26-c14b784c9bc0))
    (pin "9" (uuid f8af3fe2-2eec-41a7-8581-f31c247c46bc))
    (instances
      (project "curium2_main"
        (path "/e8b3d2d8-64ad-4d45-b56e-55015b7769e2/2500bd58-e91a-4288-8dba-7cd1e1582535"
          (reference "U9") (unit 1)
        )
        (path "/e8b3d2d8-64ad-4d45-b56e-55015b7769e2/d7074b79-008b-4fef-b87f-e14f3ee45d50"
          (reference "U10") (unit 1)
        )
      )
    )
  )

  (symbol (lib_id "Misc:R_Small_Pack04_Split") (at 144.78 147.32 0) (unit 3)
    (in_bom yes) (on_board yes) (dnp no) (fields_autoplaced)
    (uuid 6cf24b1d-f464-426f-add8-d8436a241ce2)
    (property "Reference" "RN4" (at 146.2786 146.1079 0)
      (effects (font (size 1.27 1.27)) (justify left))
    )
    (property "Value" "10k" (at 146.2786 148.5321 0)
      (effects (font (size 1.27 1.27)) (justify left))
    )
    (property "Footprint" "Resistor_SMD:R_Array_Concave_4x0402" (at 146.558 147.32 90)
      (effects (font (size 1.27 1.27)) hide)
    )
    (property "Datasheet" "https://api.pim.na.industrial.panasonic.com/file_stream/main/fileversion/1255" (at 144.78 147.32 0)
      (effects (font (size 1.27 1.27)) hide)
    )
    (property "Manufacturer" "Panasonic" (at 144.78 147.32 0)
      (effects (font (size 1.27 1.27)) hide)
    )
    (property "Partnumber" "EXB-28V103JX" (at 144.78 147.32 0)
      (effects (font (size 1.27 1.27)) hide)
    )
    (property "Spec" "" (at 144.78 147.32 0)
      (effects (font (size 1.27 1.27)) hide)
    )
    (property "Update" "paul3" (at 144.78 147.32 0)
      (effects (font (size 1.27 1.27)) hide)
    )
    (property "description" "10k Ohm ±5% 62.5mW Power Per Element Isolated 4 Resistor Network/Array ±200ppm/°C 0804, Convex, Long Side Terminals" (at 144.78 147.32 0)
      (effects (font (size 1.27 1.27)) hide)
    )
    (property "note" "" (at 144.78 147.32 0)
      (effects (font (size 1.27 1.27)) hide)
    )
    (property "Digikey" "Y7103CT-ND" (at 144.78 147.32 0)
      (effects (font (size 1.27 1.27)) hide)
    )
    (property "tape" "8,2,NE" (at 144.78 147.32 0)
      (effects (font (size 1.27 1.27)) hide)
    )
    (property "Attrition" "10" (at 144.78 147.32 0)
      (effects (font (size 1.27 1.27)) hide)
    )
    (pin "1" (uuid cacbbcf2-3a54-4fb8-9219-dc7634874dd2))
    (pin "8" (uuid a5da8c24-7441-4cc7-ad56-40a66f30ca2b))
    (pin "2" (uuid 3c2a1964-b61e-47ea-9292-08a00a0d3063))
    (pin "7" (uuid 98d4fb02-a657-4d54-b569-056a628da88e))
    (pin "3" (uuid 59c9435e-ea96-4de2-ae5f-599685164f25))
    (pin "6" (uuid 38662a89-0f8f-4ea8-97cf-82b5612e3f70))
    (pin "4" (uuid 4a2f1e2d-e69a-4a9d-8da1-5e11190078b5))
    (pin "5" (uuid 9318eb83-b6bd-4164-a9b4-854bfb11a209))
    (instances
      (project "curium2_main"
        (path "/e8b3d2d8-64ad-4d45-b56e-55015b7769e2/2500bd58-e91a-4288-8dba-7cd1e1582535"
          (reference "RN4") (unit 3)
        )
        (path "/e8b3d2d8-64ad-4d45-b56e-55015b7769e2/d7074b79-008b-4fef-b87f-e14f3ee45d50"
          (reference "RN8") (unit 3)
        )
      )
    )
  )

  (symbol (lib_id "Misc:R_Small_Pack04_Split") (at 142.24 147.32 0) (unit 4)
    (in_bom yes) (on_board yes) (dnp no) (fields_autoplaced)
    (uuid 74fbb29b-8176-4352-8e26-c2d15e7aac8b)
    (property "Reference" "RN4" (at 140.7414 146.1079 0)
      (effects (font (size 1.27 1.27)) (justify right))
    )
    (property "Value" "10k" (at 140.7414 148.5321 0)
      (effects (font (size 1.27 1.27)) (justify right))
    )
    (property "Footprint" "Resistor_SMD:R_Array_Concave_4x0402" (at 144.018 147.32 90)
      (effects (font (size 1.27 1.27)) hide)
    )
    (property "Datasheet" "https://api.pim.na.industrial.panasonic.com/file_stream/main/fileversion/1255" (at 142.24 147.32 0)
      (effects (font (size 1.27 1.27)) hide)
    )
    (property "Manufacturer" "Panasonic" (at 142.24 147.32 0)
      (effects (font (size 1.27 1.27)) hide)
    )
    (property "Partnumber" "EXB-28V103JX" (at 142.24 147.32 0)
      (effects (font (size 1.27 1.27)) hide)
    )
    (property "Spec" "" (at 142.24 147.32 0)
      (effects (font (size 1.27 1.27)) hide)
    )
    (property "Update" "paul3" (at 142.24 147.32 0)
      (effects (font (size 1.27 1.27)) hide)
    )
    (property "description" "10k Ohm ±5% 62.5mW Power Per Element Isolated 4 Resistor Network/Array ±200ppm/°C 0804, Convex, Long Side Terminals" (at 142.24 147.32 0)
      (effects (font (size 1.27 1.27)) hide)
    )
    (property "note" "" (at 142.24 147.32 0)
      (effects (font (size 1.27 1.27)) hide)
    )
    (property "Digikey" "Y7103CT-ND" (at 142.24 147.32 0)
      (effects (font (size 1.27 1.27)) hide)
    )
    (property "tape" "8,2,NE" (at 142.24 147.32 0)
      (effects (font (size 1.27 1.27)) hide)
    )
    (property "Attrition" "10" (at 142.24 147.32 0)
      (effects (font (size 1.27 1.27)) hide)
    )
    (pin "1" (uuid e31ef72e-2020-4493-865f-8801affa77ad))
    (pin "8" (uuid bc666f40-2bf0-4912-99d5-aae65b56d2fb))
    (pin "2" (uuid e8196ea8-5cd6-4142-a773-e79c077c7e00))
    (pin "7" (uuid 61b647ed-448b-4b22-9f4d-20b56ef09e41))
    (pin "3" (uuid 51252cca-07e4-4ccc-b2ed-19e88421df07))
    (pin "6" (uuid e72a8f9e-3cbb-4089-8dbd-63abda32b547))
    (pin "4" (uuid 582f15b4-6e34-47f9-bd0f-09bd730624dd))
    (pin "5" (uuid c3ca2eea-77f0-402b-96a1-85029f7d122c))
    (instances
      (project "curium2_main"
        (path "/e8b3d2d8-64ad-4d45-b56e-55015b7769e2/2500bd58-e91a-4288-8dba-7cd1e1582535"
          (reference "RN4") (unit 4)
        )
        (path "/e8b3d2d8-64ad-4d45-b56e-55015b7769e2/d7074b79-008b-4fef-b87f-e14f3ee45d50"
          (reference "RN8") (unit 4)
        )
      )
    )
  )

  (symbol (lib_id "Misc:R_Small_Pack04_Split") (at 38.1 147.32 0) (unit 3)
    (in_bom yes) (on_board yes) (dnp no) (fields_autoplaced)
    (uuid 7c964dcd-e142-4afa-85d6-7333cda5e959)
    (property "Reference" "RN1" (at 39.5986 146.1079 0)
      (effects (font (size 1.27 1.27)) (justify left))
    )
    (property "Value" "10k" (at 39.5986 148.5321 0)
      (effects (font (size 1.27 1.27)) (justify left))
    )
    (property "Footprint" "Resistor_SMD:R_Array_Concave_4x0402" (at 39.878 147.32 90)
      (effects (font (size 1.27 1.27)) hide)
    )
    (property "Datasheet" "https://api.pim.na.industrial.panasonic.com/file_stream/main/fileversion/1255" (at 38.1 147.32 0)
      (effects (font (size 1.27 1.27)) hide)
    )
    (property "Manufacturer" "Panasonic" (at 38.1 147.32 0)
      (effects (font (size 1.27 1.27)) hide)
    )
    (property "Partnumber" "EXB-28V103JX" (at 38.1 147.32 0)
      (effects (font (size 1.27 1.27)) hide)
    )
    (property "Spec" "" (at 38.1 147.32 0)
      (effects (font (size 1.27 1.27)) hide)
    )
    (property "Update" "paul3" (at 38.1 147.32 0)
      (effects (font (size 1.27 1.27)) hide)
    )
    (property "description" "10k Ohm ±5% 62.5mW Power Per Element Isolated 4 Resistor Network/Array ±200ppm/°C 0804, Convex, Long Side Terminals" (at 38.1 147.32 0)
      (effects (font (size 1.27 1.27)) hide)
    )
    (property "note" "" (at 38.1 147.32 0)
      (effects (font (size 1.27 1.27)) hide)
    )
    (property "Digikey" "Y7103CT-ND" (at 38.1 147.32 0)
      (effects (font (size 1.27 1.27)) hide)
    )
    (property "tape" "8,2,NE" (at 38.1 147.32 0)
      (effects (font (size 1.27 1.27)) hide)
    )
    (property "Attrition" "10" (at 38.1 147.32 0)
      (effects (font (size 1.27 1.27)) hide)
    )
    (pin "1" (uuid bb631bfe-1b0c-48b0-b5da-54f10351a25b))
    (pin "8" (uuid 241502b9-47fb-40c8-972e-5965d65e20a3))
    (pin "2" (uuid 93b749a5-1579-492b-8b4e-bb431a5c54df))
    (pin "7" (uuid 2776f4c7-4c75-441f-b82c-fa7ff39cfc8e))
    (pin "3" (uuid c77b3545-cf4d-49e4-ab29-5114d018357c))
    (pin "6" (uuid 4ac8dfce-c003-45ec-8488-d1964289dc13))
    (pin "4" (uuid c81e15cd-a58a-4958-9585-461f7b9e90e3))
    (pin "5" (uuid 9bd79d1f-09fb-42a0-af1d-0c2d98cea506))
    (instances
      (project "curium2_main"
        (path "/e8b3d2d8-64ad-4d45-b56e-55015b7769e2/2500bd58-e91a-4288-8dba-7cd1e1582535"
          (reference "RN1") (unit 3)
        )
        (path "/e8b3d2d8-64ad-4d45-b56e-55015b7769e2/d7074b79-008b-4fef-b87f-e14f3ee45d50"
          (reference "RN5") (unit 3)
        )
      )
    )
  )

  (symbol (lib_id "Misc:R_Small_Pack04_Split") (at 127 147.32 0) (unit 1)
    (in_bom yes) (on_board yes) (dnp no) (fields_autoplaced)
    (uuid 843dab42-bb54-4502-bec1-bd66ce728824)
    (property "Reference" "RN3" (at 128.4986 146.1079 0)
      (effects (font (size 1.27 1.27)) (justify left))
    )
    (property "Value" "10k" (at 128.4986 148.5321 0)
      (effects (font (size 1.27 1.27)) (justify left))
    )
    (property "Footprint" "Resistor_SMD:R_Array_Concave_4x0402" (at 128.778 147.32 90)
      (effects (font (size 1.27 1.27)) hide)
    )
    (property "Datasheet" "https://api.pim.na.industrial.panasonic.com/file_stream/main/fileversion/1255" (at 127 147.32 0)
      (effects (font (size 1.27 1.27)) hide)
    )
    (property "Manufacturer" "Panasonic" (at 127 147.32 0)
      (effects (font (size 1.27 1.27)) hide)
    )
    (property "Partnumber" "EXB-28V103JX" (at 127 147.32 0)
      (effects (font (size 1.27 1.27)) hide)
    )
    (property "Spec" "" (at 127 147.32 0)
      (effects (font (size 1.27 1.27)) hide)
    )
    (property "Update" "paul3" (at 127 147.32 0)
      (effects (font (size 1.27 1.27)) hide)
    )
    (property "description" "10k Ohm ±5% 62.5mW Power Per Element Isolated 4 Resistor Network/Array ±200ppm/°C 0804, Convex, Long Side Terminals" (at 127 147.32 0)
      (effects (font (size 1.27 1.27)) hide)
    )
    (property "note" "" (at 127 147.32 0)
      (effects (font (size 1.27 1.27)) hide)
    )
    (property "Digikey" "Y7103CT-ND" (at 127 147.32 0)
      (effects (font (size 1.27 1.27)) hide)
    )
    (property "tape" "8,2,NE" (at 127 147.32 0)
      (effects (font (size 1.27 1.27)) hide)
    )
    (property "Attrition" "10" (at 127 147.32 0)
      (effects (font (size 1.27 1.27)) hide)
    )
    (pin "1" (uuid 39de5728-795e-4e4a-9a5a-c1426775ad42))
    (pin "8" (uuid 451d1390-ce37-4767-9550-834647b85b3c))
    (pin "2" (uuid 5d5c910f-c070-4e50-a840-fb3ff3918aba))
    (pin "7" (uuid e885ac9b-bdb9-414c-a534-25504a0c0f0a))
    (pin "3" (uuid faf634d4-d838-40e9-8f96-312f3ad2d267))
    (pin "6" (uuid 14881fe2-34fe-40a1-815e-3c2d198044c8))
    (pin "4" (uuid 4ca83ed1-b5a8-4883-aefb-cc29b2422d94))
    (pin "5" (uuid cd2afc54-8237-4363-bba0-1056b48ba736))
    (instances
      (project "curium2_main"
        (path "/e8b3d2d8-64ad-4d45-b56e-55015b7769e2/2500bd58-e91a-4288-8dba-7cd1e1582535"
          (reference "RN3") (unit 1)
        )
        (path "/e8b3d2d8-64ad-4d45-b56e-55015b7769e2/d7074b79-008b-4fef-b87f-e14f3ee45d50"
          (reference "RN7") (unit 1)
        )
      )
    )
  )

  (symbol (lib_id "Misc:R_Small_Pack04_Split") (at 35.56 147.32 0) (unit 4)
    (in_bom yes) (on_board yes) (dnp no) (fields_autoplaced)
    (uuid 8d19adc4-b5a2-4c07-b9b4-76fdf3552a40)
    (property "Reference" "RN1" (at 34.0615 146.1079 0)
      (effects (font (size 1.27 1.27)) (justify right))
    )
    (property "Value" "10k" (at 34.0615 148.5321 0)
      (effects (font (size 1.27 1.27)) (justify right))
    )
    (property "Footprint" "Resistor_SMD:R_Array_Concave_4x0402" (at 37.338 147.32 90)
      (effects (font (size 1.27 1.27)) hide)
    )
    (property "Datasheet" "https://api.pim.na.industrial.panasonic.com/file_stream/main/fileversion/1255" (at 35.56 147.32 0)
      (effects (font (size 1.27 1.27)) hide)
    )
    (property "Manufacturer" "Panasonic" (at 35.56 147.32 0)
      (effects (font (size 1.27 1.27)) hide)
    )
    (property "Partnumber" "EXB-28V103JX" (at 35.56 147.32 0)
      (effects (font (size 1.27 1.27)) hide)
    )
    (property "Spec" "" (at 35.56 147.32 0)
      (effects (font (size 1.27 1.27)) hide)
    )
    (property "Update" "paul3" (at 35.56 147.32 0)
      (effects (font (size 1.27 1.27)) hide)
    )
    (property "description" "10k Ohm ±5% 62.5mW Power Per Element Isolated 4 Resistor Network/Array ±200ppm/°C 0804, Convex, Long Side Terminals" (at 35.56 147.32 0)
      (effects (font (size 1.27 1.27)) hide)
    )
    (property "note" "" (at 35.56 147.32 0)
      (effects (font (size 1.27 1.27)) hide)
    )
    (property "Digikey" "Y7103CT-ND" (at 35.56 147.32 0)
      (effects (font (size 1.27 1.27)) hide)
    )
    (property "tape" "8,2,NE" (at 35.56 147.32 0)
      (effects (font (size 1.27 1.27)) hide)
    )
    (property "Attrition" "10" (at 35.56 147.32 0)
      (effects (font (size 1.27 1.27)) hide)
    )
    (pin "1" (uuid b4742d53-3cf7-4db0-8255-933238b8cfb2))
    (pin "8" (uuid 17dc490e-9b00-4f15-981d-5d2fe59ce0ad))
    (pin "2" (uuid 39c20a97-1dd3-4e39-b056-7ee70cca5fba))
    (pin "7" (uuid 5d7133c2-cf9d-4b5a-9a79-c060dec556c7))
    (pin "3" (uuid 55830905-9b18-4fe4-90a4-36be2917e99b))
    (pin "6" (uuid e3e38ad9-a163-4222-b1a3-4db845ebe46a))
    (pin "4" (uuid 52e87ffa-afc7-48a4-8d0d-fe925e45f29c))
    (pin "5" (uuid 5046bd20-dab8-4b06-bed7-1c03f419f828))
    (instances
      (project "curium2_main"
        (path "/e8b3d2d8-64ad-4d45-b56e-55015b7769e2/2500bd58-e91a-4288-8dba-7cd1e1582535"
          (reference "RN1") (unit 4)
        )
        (path "/e8b3d2d8-64ad-4d45-b56e-55015b7769e2/d7074b79-008b-4fef-b87f-e14f3ee45d50"
          (reference "RN5") (unit 4)
        )
      )
    )
  )

  (symbol (lib_id "Misc:R_Small_Pack04_Split") (at 106.68 147.32 0) (unit 4)
    (in_bom yes) (on_board yes) (dnp no) (fields_autoplaced)
    (uuid 8f0a075c-acb8-4cce-89a4-7645a1dd2fce)
    (property "Reference" "RN3" (at 105.1815 146.1079 0)
      (effects (font (size 1.27 1.27)) (justify right))
    )
    (property "Value" "10k" (at 105.1815 148.5321 0)
      (effects (font (size 1.27 1.27)) (justify right))
    )
    (property "Footprint" "Resistor_SMD:R_Array_Concave_4x0402" (at 108.458 147.32 90)
      (effects (font (size 1.27 1.27)) hide)
    )
    (property "Datasheet" "https://api.pim.na.industrial.panasonic.com/file_stream/main/fileversion/1255" (at 106.68 147.32 0)
      (effects (font (size 1.27 1.27)) hide)
    )
    (property "Manufacturer" "Panasonic" (at 106.68 147.32 0)
      (effects (font (size 1.27 1.27)) hide)
    )
    (property "Partnumber" "EXB-28V103JX" (at 106.68 147.32 0)
      (effects (font (size 1.27 1.27)) hide)
    )
    (property "Spec" "" (at 106.68 147.32 0)
      (effects (font (size 1.27 1.27)) hide)
    )
    (property "Update" "paul3" (at 106.68 147.32 0)
      (effects (font (size 1.27 1.27)) hide)
    )
    (property "description" "10k Ohm ±5% 62.5mW Power Per Element Isolated 4 Resistor Network/Array ±200ppm/°C 0804, Convex, Long Side Terminals" (at 106.68 147.32 0)
      (effects (font (size 1.27 1.27)) hide)
    )
    (property "note" "" (at 106.68 147.32 0)
      (effects (font (size 1.27 1.27)) hide)
    )
    (property "Digikey" "Y7103CT-ND" (at 106.68 147.32 0)
      (effects (font (size 1.27 1.27)) hide)
    )
    (property "tape" "8,2,NE" (at 106.68 147.32 0)
      (effects (font (size 1.27 1.27)) hide)
    )
    (property "Attrition" "10" (at 106.68 147.32 0)
      (effects (font (size 1.27 1.27)) hide)
    )
    (pin "1" (uuid 6cf6f253-da98-488b-8dc1-1172d8d573cf))
    (pin "8" (uuid cb474ab4-4589-4850-93f7-ababc26f9670))
    (pin "2" (uuid a2d5ea6d-83bf-4002-92e1-632e8a426186))
    (pin "7" (uuid 99511dcd-5c9f-4e00-b46b-bbe54ba533ff))
    (pin "3" (uuid cda9f204-cc3e-4b7e-9aaf-0ac1fe2fed8e))
    (pin "6" (uuid 553c68e6-3546-4514-9bee-2f18904b02b7))
    (pin "4" (uuid 2f37a381-64d5-45af-8f57-b201b7a5ee81))
    (pin "5" (uuid 292ac048-78eb-4ea6-8660-fe99ac23aa65))
    (instances
      (project "curium2_main"
        (path "/e8b3d2d8-64ad-4d45-b56e-55015b7769e2/2500bd58-e91a-4288-8dba-7cd1e1582535"
          (reference "RN3") (unit 4)
        )
        (path "/e8b3d2d8-64ad-4d45-b56e-55015b7769e2/d7074b79-008b-4fef-b87f-e14f3ee45d50"
          (reference "RN7") (unit 4)
        )
      )
    )
  )

  (symbol (lib_id "power:GND") (at 91.44 76.2 0) (unit 1)
    (in_bom yes) (on_board yes) (dnp no) (fields_autoplaced)
    (uuid a05940af-2a12-425d-b915-89594d77a41d)
    (property "Reference" "#PWR060" (at 91.44 82.55 0)
      (effects (font (size 1.27 1.27)) hide)
    )
    (property "Value" "GND" (at 91.44 80.3331 0)
      (effects (font (size 1.27 1.27)))
    )
    (property "Footprint" "" (at 91.44 76.2 0)
      (effects (font (size 1.27 1.27)) hide)
    )
    (property "Datasheet" "" (at 91.44 76.2 0)
      (effects (font (size 1.27 1.27)) hide)
    )
    (pin "1" (uuid e567ecfb-ae44-462b-8450-11b857af3f53))
    (instances
      (project "curium2_main"
        (path "/e8b3d2d8-64ad-4d45-b56e-55015b7769e2/2500bd58-e91a-4288-8dba-7cd1e1582535"
          (reference "#PWR060") (unit 1)
        )
        (path "/e8b3d2d8-64ad-4d45-b56e-55015b7769e2/d7074b79-008b-4fef-b87f-e14f3ee45d50"
          (reference "#PWR064") (unit 1)
        )
      )
    )
  )

  (symbol (lib_id "Misc:R_Small_Pack04_Split") (at 109.22 147.32 0) (unit 3)
    (in_bom yes) (on_board yes) (dnp no) (fields_autoplaced)
    (uuid a4b503cf-e71c-432f-8250-dd1921fde75e)
    (property "Reference" "RN3" (at 110.7186 146.1079 0)
      (effects (font (size 1.27 1.27)) (justify left))
    )
    (property "Value" "10k" (at 110.7186 148.5321 0)
      (effects (font (size 1.27 1.27)) (justify left))
    )
    (property "Footprint" "Resistor_SMD:R_Array_Concave_4x0402" (at 110.998 147.32 90)
      (effects (font (size 1.27 1.27)) hide)
    )
    (property "Datasheet" "https://api.pim.na.industrial.panasonic.com/file_stream/main/fileversion/1255" (at 109.22 147.32 0)
      (effects (font (size 1.27 1.27)) hide)
    )
    (property "Manufacturer" "Panasonic" (at 109.22 147.32 0)
      (effects (font (size 1.27 1.27)) hide)
    )
    (property "Partnumber" "EXB-28V103JX" (at 109.22 147.32 0)
      (effects (font (size 1.27 1.27)) hide)
    )
    (property "Spec" "" (at 109.22 147.32 0)
      (effects (font (size 1.27 1.27)) hide)
    )
    (property "Update" "paul3" (at 109.22 147.32 0)
      (effects (font (size 1.27 1.27)) hide)
    )
    (property "description" "10k Ohm ±5% 62.5mW Power Per Element Isolated 4 Resistor Network/Array ±200ppm/°C 0804, Convex, Long Side Terminals" (at 109.22 147.32 0)
      (effects (font (size 1.27 1.27)) hide)
    )
    (property "note" "" (at 109.22 147.32 0)
      (effects (font (size 1.27 1.27)) hide)
    )
    (property "Digikey" "Y7103CT-ND" (at 109.22 147.32 0)
      (effects (font (size 1.27 1.27)) hide)
    )
    (property "tape" "8,2,NE" (at 109.22 147.32 0)
      (effects (font (size 1.27 1.27)) hide)
    )
    (property "Attrition" "10" (at 109.22 147.32 0)
      (effects (font (size 1.27 1.27)) hide)
    )
    (pin "1" (uuid 0cbfcce7-6447-4619-8763-bd30e5b7143e))
    (pin "8" (uuid 9ab1a32f-4421-4c78-95d4-9928f1f29fba))
    (pin "2" (uuid c6349cf3-9e29-4ceb-9a7a-3f770c91285e))
    (pin "7" (uuid 82b60760-b97d-46e6-8227-bfa2c3c0a425))
    (pin "3" (uuid 41073b0f-7dc5-4752-a9a3-02e5fc8f05d2))
    (pin "6" (uuid b991dd08-39e5-4b18-af7e-66ea7337832b))
    (pin "4" (uuid c3c7c062-f9ab-4cdd-b410-28935ebba184))
    (pin "5" (uuid d02d4507-9f1c-490e-bcf6-bf9a8fee9b53))
    (instances
      (project "curium2_main"
        (path "/e8b3d2d8-64ad-4d45-b56e-55015b7769e2/2500bd58-e91a-4288-8dba-7cd1e1582535"
          (reference "RN3") (unit 3)
        )
        (path "/e8b3d2d8-64ad-4d45-b56e-55015b7769e2/d7074b79-008b-4fef-b87f-e14f3ee45d50"
          (reference "RN7") (unit 3)
        )
      )
    )
  )

  (symbol (lib_id "Misc_pwr_device:R_Small_PWR") (at 101.6 68.58 0) (unit 1)
    (in_bom yes) (on_board yes) (dnp no) (fields_autoplaced)
    (uuid b0105afd-dd67-41d7-aba5-c60759d8e078)
    (property "Reference" "R40" (at 103.0986 67.6981 0)
      (effects (font (size 1.27 1.27)) (justify left))
    )
    (property "Value" "50R" (at 103.0986 70.1223 0)
      (effects (font (size 1.27 1.27)) (justify left))
    )
    (property "Footprint" "IPC7351C:R_0603_1608Metric" (at 101.6 68.58 0)
      (effects (font (size 1.27 1.27)) hide)
    )
    (property "Datasheet" "~" (at 101.6 68.58 0)
      (effects (font (size 1.27 1.27)) hide)
    )
    (property "Spec" "" (at 101.6 68.58 0)
      (effects (font (size 1.27 1.27)) hide)
    )
    (property "Update" "paul3" (at 101.6 68.58 0)
      (effects (font (size 1.27 1.27)) hide)
    )
    (property "description" "49.9 Ohms ±1% 0.1W, 1/10W Chip Resistor 0603 (1608 Metric) Automotive AEC-Q200 Thick Film" (at 101.6 68.58 0)
      (effects (font (size 1.27 1.27)) hide)
    )
    (property "note" "" (at 101.6 68.58 0)
      (effects (font (size 1.27 1.27)) hide)
    )
    (property "Digikey" "P49.9HCT-ND" (at 101.6 68.58 0)
      (effects (font (size 1.27 1.27)) hide)
    )
    (property "Manufacturer" "Panasonic" (at 101.6 68.58 0)
      (effects (font (size 1.27 1.27)) hide)
    )
    (property "Partnumber" "ERJ-3EKF49R9V" (at 101.6 68.58 0)
      (effects (font (size 1.27 1.27)) hide)
    )
    (property "tape" "8,4,W" (at 101.6 68.58 0)
      (effects (font (size 1.27 1.27)) hide)
    )
    (property "Attrition" "10" (at 101.6 68.58 0)
      (effects (font (size 1.27 1.27)) hide)
    )
    (pin "1" (uuid daf75f85-a58b-4c59-b530-0807ded99f75))
    (pin "2" (uuid bbf649a6-2ee1-415a-910b-838bbae46684))
    (instances
      (project "curium2_main"
        (path "/e8b3d2d8-64ad-4d45-b56e-55015b7769e2/2500bd58-e91a-4288-8dba-7cd1e1582535"
          (reference "R40") (unit 1)
        )
        (path "/e8b3d2d8-64ad-4d45-b56e-55015b7769e2/d7074b79-008b-4fef-b87f-e14f3ee45d50"
          (reference "R41") (unit 1)
        )
      )
    )
  )

  (symbol (lib_id "Misc:R_Small_Pack04_Split") (at 91.44 147.32 0) (unit 1)
    (in_bom yes) (on_board yes) (dnp no) (fields_autoplaced)
    (uuid bb406584-6a9a-4054-9c42-7ab6c02bc464)
    (property "Reference" "RN2" (at 92.9386 146.1079 0)
      (effects (font (size 1.27 1.27)) (justify left))
    )
    (property "Value" "10k" (at 92.9386 148.5321 0)
      (effects (font (size 1.27 1.27)) (justify left))
    )
    (property "Footprint" "Resistor_SMD:R_Array_Concave_4x0402" (at 93.218 147.32 90)
      (effects (font (size 1.27 1.27)) hide)
    )
    (property "Datasheet" "https://api.pim.na.industrial.panasonic.com/file_stream/main/fileversion/1255" (at 91.44 147.32 0)
      (effects (font (size 1.27 1.27)) hide)
    )
    (property "Manufacturer" "Panasonic" (at 91.44 147.32 0)
      (effects (font (size 1.27 1.27)) hide)
    )
    (property "Partnumber" "EXB-28V103JX" (at 91.44 147.32 0)
      (effects (font (size 1.27 1.27)) hide)
    )
    (property "Spec" "" (at 91.44 147.32 0)
      (effects (font (size 1.27 1.27)) hide)
    )
    (property "Update" "paul3" (at 91.44 147.32 0)
      (effects (font (size 1.27 1.27)) hide)
    )
    (property "description" "10k Ohm ±5% 62.5mW Power Per Element Isolated 4 Resistor Network/Array ±200ppm/°C 0804, Convex, Long Side Terminals" (at 91.44 147.32 0)
      (effects (font (size 1.27 1.27)) hide)
    )
    (property "note" "" (at 91.44 147.32 0)
      (effects (font (size 1.27 1.27)) hide)
    )
    (property "Digikey" "Y7103CT-ND" (at 91.44 147.32 0)
      (effects (font (size 1.27 1.27)) hide)
    )
    (property "tape" "8,2,NE" (at 91.44 147.32 0)
      (effects (font (size 1.27 1.27)) hide)
    )
    (property "Attrition" "10" (at 91.44 147.32 0)
      (effects (font (size 1.27 1.27)) hide)
    )
    (pin "1" (uuid 7f7d72e5-d289-468a-92cc-dd7225885586))
    (pin "8" (uuid f78cb3c3-6104-41a4-b4fc-553d82bb1d70))
    (pin "2" (uuid 17b653e1-a90f-42c1-9178-835e66efbf17))
    (pin "7" (uuid 1181ad3a-6a0e-4093-9df9-b44cf97555db))
    (pin "3" (uuid b76d350b-622f-4338-a3c5-9622f0006893))
    (pin "6" (uuid d1877765-b568-46c0-8e06-f602055af56d))
    (pin "4" (uuid 9147b9f9-ef7b-41da-8655-09e4cae118cb))
    (pin "5" (uuid 77305e46-306d-4490-be41-0da780dd1549))
    (instances
      (project "curium2_main"
        (path "/e8b3d2d8-64ad-4d45-b56e-55015b7769e2/2500bd58-e91a-4288-8dba-7cd1e1582535"
          (reference "RN2") (unit 1)
        )
        (path "/e8b3d2d8-64ad-4d45-b56e-55015b7769e2/d7074b79-008b-4fef-b87f-e14f3ee45d50"
          (reference "RN6") (unit 1)
        )
      )
    )
  )

  (symbol (lib_id "power:+3V3") (at 101.6 66.04 0) (unit 1)
    (in_bom yes) (on_board yes) (dnp no) (fields_autoplaced)
    (uuid bed86e06-569e-41b6-b4c2-2a3e617b6001)
    (property "Reference" "#PWR061" (at 101.6 69.85 0)
      (effects (font (size 1.27 1.27)) hide)
    )
    (property "Value" "+3V3" (at 101.6 62.5381 0)
      (effects (font (size 1.27 1.27)))
    )
    (property "Footprint" "" (at 101.6 66.04 0)
      (effects (font (size 1.27 1.27)) hide)
    )
    (property "Datasheet" "" (at 101.6 66.04 0)
      (effects (font (size 1.27 1.27)) hide)
    )
    (pin "1" (uuid 3d2d84e1-91a3-4f16-8192-949e02fa076d))
    (instances
      (project "curium2_main"
        (path "/e8b3d2d8-64ad-4d45-b56e-55015b7769e2/2500bd58-e91a-4288-8dba-7cd1e1582535"
          (reference "#PWR061") (unit 1)
        )
        (path "/e8b3d2d8-64ad-4d45-b56e-55015b7769e2/d7074b79-008b-4fef-b87f-e14f3ee45d50"
          (reference "#PWR065") (unit 1)
        )
      )
    )
  )

  (symbol (lib_id "Device:C_Small") (at 91.44 73.66 180) (unit 1)
    (in_bom yes) (on_board yes) (dnp no) (fields_autoplaced)
    (uuid caa0d9c1-fbae-4f09-af0e-df8b0463f383)
    (property "Reference" "C176" (at 93.7641 72.7451 0)
      (effects (font (size 1.27 1.27)) (justify right))
    )
    (property "Value" "100n" (at 93.7641 75.5202 0)
      (effects (font (size 1.27 1.27)) (justify right))
    )
    (property "Footprint" "IPC7351C:C_0603_1608Metric" (at 91.44 73.66 0)
      (effects (font (size 1.27 1.27)) hide)
    )
    (property "Datasheet" "~" (at 91.44 73.66 0)
      (effects (font (size 1.27 1.27)) hide)
    )
    (property "Partnumber" "CGA3E2X7R1H104K080AE" (at 91.44 73.66 0)
      (effects (font (size 1.27 1.27)) hide)
    )
    (property "Digikey" "445-15957-1-ND" (at 91.44 73.66 0)
      (effects (font (size 1.27 1.27)) hide)
    )
    (property "Manufacturer" "TDK" (at 91.44 73.66 0)
      (effects (font (size 1.27 1.27)) hide)
    )
    (property "Spec" "50V" (at 91.44 73.66 0)
      (effects (font (size 1.27 1.27)) hide)
    )
    (property "Update" "paul3" (at 91.44 73.66 0)
      (effects (font (size 1.27 1.27)) hide)
    )
    (property "description" "0.1 µF ±10% 50V Ceramic Capacitor X7R 0603 (1608 Metric)" (at 91.44 73.66 0)
      (effects (font (size 1.27 1.27)) hide)
    )
    (property "note" "" (at 91.44 73.66 0)
      (effects (font (size 1.27 1.27)) hide)
    )
    (property "tape" "8,4,W" (at 91.44 73.66 0)
      (effects (font (size 1.27 1.27)) hide)
    )
    (property "Attrition" "10" (at 91.44 73.66 0)
      (effects (font (size 1.27 1.27)) hide)
    )
    (pin "1" (uuid 28063a33-f40f-4b24-aa96-8fb4571d1c1c))
    (pin "2" (uuid 91531691-2cc3-42e4-b81e-f6bdd4e04ad8))
    (instances
      (project "astris-obc"
        (path "/6053651b-b14e-4233-91b3-f1454c87b8d8/65b5b4bf-bcd8-4959-b920-5e5106d8a3fd/cc7e5fff-12ec-4b47-9f70-d2cc48d55ed4"
          (reference "C176") (unit 1)
        )
        (path "/6053651b-b14e-4233-91b3-f1454c87b8d8/65b5b4bf-bcd8-4959-b920-5e5106d8a3fd/d076accf-8f5e-4c0c-8773-285a62264bc9"
          (reference "C71") (unit 1)
        )
        (path "/6053651b-b14e-4233-91b3-f1454c87b8d8/65b5b4bf-bcd8-4959-b920-5e5106d8a3fd/8cdd31df-32fc-446f-83f0-456d6bfb4cee"
          (reference "C117") (unit 1)
        )
        (path "/6053651b-b14e-4233-91b3-f1454c87b8d8/65b5b4bf-bcd8-4959-b920-5e5106d8a3fd/3c02a110-4c20-4fc4-b8b5-913610108c37"
          (reference "C86") (unit 1)
        )
        (path "/6053651b-b14e-4233-91b3-f1454c87b8d8/65b5b4bf-bcd8-4959-b920-5e5106d8a3fd/502e4725-8d28-4576-863e-def881379509"
          (reference "C76") (unit 1)
        )
        (path "/6053651b-b14e-4233-91b3-f1454c87b8d8/65b5b4bf-bcd8-4959-b920-5e5106d8a3fd/c7ff3cef-937f-4b24-a6d2-815f30f5bdee"
          (reference "C81") (unit 1)
        )
        (path "/6053651b-b14e-4233-91b3-f1454c87b8d8/113afebc-e3cd-40c6-9dab-26b1df432f34/c8d939db-2036-456d-b82b-dc03f89f03b1/7c31070f-1d6d-44f6-8d9d-d28e20cbff62"
          (reference "C4") (unit 1)
        )
        (path "/6053651b-b14e-4233-91b3-f1454c87b8d8/113afebc-e3cd-40c6-9dab-26b1df432f34/1db978e6-8072-446c-82f7-5a867a5996de/7c31070f-1d6d-44f6-8d9d-d28e20cbff62"
          (reference "C13") (unit 1)
        )
      )
      (project "clam-mk3"
        (path "/7e681763-0065-4052-927c-8c0f96ca7d12/6f001f7e-070a-4d3e-bc21-c93da08a044d"
          (reference "C90") (unit 1)
        )
      )
      (project "CLAM_MOTHERBOARD"
        (path "/a72840bf-0fd6-4a98-a25d-6c445e65357f/71ec98f2-0ce2-49ef-a172-66b005781ffe"
          (reference "C177") (unit 1)
        )
      )
      (project "curium2_main"
        (path "/e8b3d2d8-64ad-4d45-b56e-55015b7769e2/2500bd58-e91a-4288-8dba-7cd1e1582535"
          (reference "C51") (unit 1)
        )
        (path "/e8b3d2d8-64ad-4d45-b56e-55015b7769e2/d7074b79-008b-4fef-b87f-e14f3ee45d50"
          (reference "C52") (unit 1)
        )
      )
    )
  )

  (symbol (lib_id "Misc:R_Small_Pack04_Split") (at 55.88 147.32 0) (unit 1)
    (in_bom yes) (on_board yes) (dnp no) (fields_autoplaced)
    (uuid d2b56dac-40c4-4d20-a089-9e9a240f0837)
    (property "Reference" "RN1" (at 57.3786 146.1079 0)
      (effects (font (size 1.27 1.27)) (justify left))
    )
    (property "Value" "10k" (at 57.3786 148.5321 0)
      (effects (font (size 1.27 1.27)) (justify left))
    )
    (property "Footprint" "Resistor_SMD:R_Array_Concave_4x0402" (at 57.658 147.32 90)
      (effects (font (size 1.27 1.27)) hide)
    )
    (property "Datasheet" "https://api.pim.na.industrial.panasonic.com/file_stream/main/fileversion/1255" (at 55.88 147.32 0)
      (effects (font (size 1.27 1.27)) hide)
    )
    (property "Manufacturer" "Panasonic" (at 55.88 147.32 0)
      (effects (font (size 1.27 1.27)) hide)
    )
    (property "Partnumber" "EXB-28V103JX" (at 55.88 147.32 0)
      (effects (font (size 1.27 1.27)) hide)
    )
    (property "Spec" "" (at 55.88 147.32 0)
      (effects (font (size 1.27 1.27)) hide)
    )
    (property "Update" "paul3" (at 55.88 147.32 0)
      (effects (font (size 1.27 1.27)) hide)
    )
    (property "description" "10k Ohm ±5% 62.5mW Power Per Element Isolated 4 Resistor Network/Array ±200ppm/°C 0804, Convex, Long Side Terminals" (at 55.88 147.32 0)
      (effects (font (size 1.27 1.27)) hide)
    )
    (property "note" "" (at 55.88 147.32 0)
      (effects (font (size 1.27 1.27)) hide)
    )
    (property "Digikey" "Y7103CT-ND" (at 55.88 147.32 0)
      (effects (font (size 1.27 1.27)) hide)
    )
    (property "tape" "8,2,NE" (at 55.88 147.32 0)
      (effects (font (size 1.27 1.27)) hide)
    )
    (property "Attrition" "10" (at 55.88 147.32 0)
      (effects (font (size 1.27 1.27)) hide)
    )
    (pin "1" (uuid 6e4ba5d5-92a8-4547-a296-cfd9a5333ee8))
    (pin "8" (uuid 0079a265-3bb5-42fa-af6e-dcef42645755))
    (pin "2" (uuid 521b9eab-7fd4-4977-a168-a2bc4240322a))
    (pin "7" (uuid b2a60dfe-7782-4e0d-b510-0dc8dbed47b0))
    (pin "3" (uuid 147f49f1-1998-410b-9aff-aee43b4e8e75))
    (pin "6" (uuid 36940ad1-0582-4929-9842-034205d4a271))
    (pin "4" (uuid 552b892a-ff5b-4adf-9e7c-1e423413ddbe))
    (pin "5" (uuid 24cb610e-311c-4cee-b3a8-2e5080347c61))
    (instances
      (project "curium2_main"
        (path "/e8b3d2d8-64ad-4d45-b56e-55015b7769e2/2500bd58-e91a-4288-8dba-7cd1e1582535"
          (reference "RN1") (unit 1)
        )
        (path "/e8b3d2d8-64ad-4d45-b56e-55015b7769e2/d7074b79-008b-4fef-b87f-e14f3ee45d50"
          (reference "RN5") (unit 1)
        )
      )
    )
  )

  (symbol (lib_id "Misc:R_Small_Pack04_Split") (at 124.46 147.32 0) (unit 2)
    (in_bom yes) (on_board yes) (dnp no) (fields_autoplaced)
    (uuid d56c297e-bd67-412e-8817-c1a2522e7cde)
    (property "Reference" "RN3" (at 122.9614 146.1079 0)
      (effects (font (size 1.27 1.27)) (justify right))
    )
    (property "Value" "10k" (at 122.9614 148.5321 0)
      (effects (font (size 1.27 1.27)) (justify right))
    )
    (property "Footprint" "Resistor_SMD:R_Array_Concave_4x0402" (at 126.238 147.32 90)
      (effects (font (size 1.27 1.27)) hide)
    )
    (property "Datasheet" "https://api.pim.na.industrial.panasonic.com/file_stream/main/fileversion/1255" (at 124.46 147.32 0)
      (effects (font (size 1.27 1.27)) hide)
    )
    (property "Manufacturer" "Panasonic" (at 124.46 147.32 0)
      (effects (font (size 1.27 1.27)) hide)
    )
    (property "Partnumber" "EXB-28V103JX" (at 124.46 147.32 0)
      (effects (font (size 1.27 1.27)) hide)
    )
    (property "Spec" "" (at 124.46 147.32 0)
      (effects (font (size 1.27 1.27)) hide)
    )
    (property "Update" "paul3" (at 124.46 147.32 0)
      (effects (font (size 1.27 1.27)) hide)
    )
    (property "description" "10k Ohm ±5% 62.5mW Power Per Element Isolated 4 Resistor Network/Array ±200ppm/°C 0804, Convex, Long Side Terminals" (at 124.46 147.32 0)
      (effects (font (size 1.27 1.27)) hide)
    )
    (property "note" "" (at 124.46 147.32 0)
      (effects (font (size 1.27 1.27)) hide)
    )
    (property "Digikey" "Y7103CT-ND" (at 124.46 147.32 0)
      (effects (font (size 1.27 1.27)) hide)
    )
    (property "tape" "8,2,NE" (at 124.46 147.32 0)
      (effects (font (size 1.27 1.27)) hide)
    )
    (property "Attrition" "10" (at 124.46 147.32 0)
      (effects (font (size 1.27 1.27)) hide)
    )
    (pin "1" (uuid e701da03-0d5c-440d-9675-37d0d8bcf28b))
    (pin "8" (uuid 6734a484-3e1e-469a-a778-37e933c1258d))
    (pin "2" (uuid 8c520fba-d637-4422-b800-70cc34a5722f))
    (pin "7" (uuid ce7b6ba6-b81d-46fc-9530-4173452f3532))
    (pin "3" (uuid 9cbf7731-38ac-4c16-8e18-785e5c3e49dd))
    (pin "6" (uuid dce11157-ff99-47c6-9c94-ce9561940f80))
    (pin "4" (uuid d915baf6-3fe8-441f-8b05-15fc487dd856))
    (pin "5" (uuid a6222875-6d12-42a9-8e45-753e32f12a6c))
    (instances
      (project "curium2_main"
        (path "/e8b3d2d8-64ad-4d45-b56e-55015b7769e2/2500bd58-e91a-4288-8dba-7cd1e1582535"
          (reference "RN3") (unit 2)
        )
        (path "/e8b3d2d8-64ad-4d45-b56e-55015b7769e2/d7074b79-008b-4fef-b87f-e14f3ee45d50"
          (reference "RN7") (unit 2)
        )
      )
    )
  )

  (symbol (lib_id "power:GND") (at 101.6 127 0) (unit 1)
    (in_bom yes) (on_board yes) (dnp no)
    (uuid dcfe1707-6da8-42c8-aea2-e4898c8cf48a)
    (property "Reference" "#PWR062" (at 101.6 133.35 0)
      (effects (font (size 1.27 1.27)) hide)
    )
    (property "Value" "GND" (at 102.87 132.4031 0)
      (effects (font (size 1.27 1.27)))
    )
    (property "Footprint" "" (at 101.6 127 0)
      (effects (font (size 1.27 1.27)) hide)
    )
    (property "Datasheet" "" (at 101.6 127 0)
      (effects (font (size 1.27 1.27)) hide)
    )
    (pin "1" (uuid 820da17c-95ca-487f-bd3b-977d660721f3))
    (instances
      (project "curium2_main"
        (path "/e8b3d2d8-64ad-4d45-b56e-55015b7769e2/2500bd58-e91a-4288-8dba-7cd1e1582535"
          (reference "#PWR062") (unit 1)
        )
        (path "/e8b3d2d8-64ad-4d45-b56e-55015b7769e2/d7074b79-008b-4fef-b87f-e14f3ee45d50"
          (reference "#PWR066") (unit 1)
        )
      )
    )
  )

  (symbol (lib_id "Misc:R_Small_Pack04_Split") (at 88.9 147.32 0) (unit 2)
    (in_bom yes) (on_board yes) (dnp no) (fields_autoplaced)
    (uuid e5e165ff-7e24-4fe8-9efa-0034b18ca8da)
    (property "Reference" "RN2" (at 87.4014 146.1079 0)
      (effects (font (size 1.27 1.27)) (justify right))
    )
    (property "Value" "10k" (at 87.4014 148.5321 0)
      (effects (font (size 1.27 1.27)) (justify right))
    )
    (property "Footprint" "Resistor_SMD:R_Array_Concave_4x0402" (at 90.678 147.32 90)
      (effects (font (size 1.27 1.27)) hide)
    )
    (property "Datasheet" "https://api.pim.na.industrial.panasonic.com/file_stream/main/fileversion/1255" (at 88.9 147.32 0)
      (effects (font (size 1.27 1.27)) hide)
    )
    (property "Manufacturer" "Panasonic" (at 88.9 147.32 0)
      (effects (font (size 1.27 1.27)) hide)
    )
    (property "Partnumber" "EXB-28V103JX" (at 88.9 147.32 0)
      (effects (font (size 1.27 1.27)) hide)
    )
    (property "Spec" "" (at 88.9 147.32 0)
      (effects (font (size 1.27 1.27)) hide)
    )
    (property "Update" "paul3" (at 88.9 147.32 0)
      (effects (font (size 1.27 1.27)) hide)
    )
    (property "description" "10k Ohm ±5% 62.5mW Power Per Element Isolated 4 Resistor Network/Array ±200ppm/°C 0804, Convex, Long Side Terminals" (at 88.9 147.32 0)
      (effects (font (size 1.27 1.27)) hide)
    )
    (property "note" "" (at 88.9 147.32 0)
      (effects (font (size 1.27 1.27)) hide)
    )
    (property "Digikey" "Y7103CT-ND" (at 88.9 147.32 0)
      (effects (font (size 1.27 1.27)) hide)
    )
    (property "tape" "8,2,NE" (at 88.9 147.32 0)
      (effects (font (size 1.27 1.27)) hide)
    )
    (property "Attrition" "10" (at 88.9 147.32 0)
      (effects (font (size 1.27 1.27)) hide)
    )
    (pin "1" (uuid 903c1432-ce44-4c3a-a96f-d53bb9ff7d06))
    (pin "8" (uuid c57f60b4-6318-437e-a31c-cbb36e58627f))
    (pin "2" (uuid d3a4ee32-6aa7-4f9f-bc7d-a51cad4d5594))
    (pin "7" (uuid ba2938dd-7c65-4d08-9dc4-de3b2570fbb7))
    (pin "3" (uuid 9c635f16-245b-4db7-a15d-cccc154eb02e))
    (pin "6" (uuid 47792f88-1ef2-4f79-85a1-a9b3c9211673))
    (pin "4" (uuid 1924c8ad-d512-4e42-bc18-f823a0068faa))
    (pin "5" (uuid 5eafee9b-c8df-490d-accf-644a32f8b0a6))
    (instances
      (project "curium2_main"
        (path "/e8b3d2d8-64ad-4d45-b56e-55015b7769e2/2500bd58-e91a-4288-8dba-7cd1e1582535"
          (reference "RN2") (unit 2)
        )
        (path "/e8b3d2d8-64ad-4d45-b56e-55015b7769e2/d7074b79-008b-4fef-b87f-e14f3ee45d50"
          (reference "RN6") (unit 2)
        )
      )
    )
  )
)
