<svg width="20" height="19" viewBox="0 0 20 19" fill="none" xmlns="http://www.w3.org/2000/svg">
<path d="M4.52176 11.3333L12.8696 2" stroke="#414141" stroke-width="4" stroke-linecap="round"/>
<path d="M1.39136 17.1667H18.087" stroke="#414141" stroke-width="2" stroke-linecap="round"/>
</svg>
