<svg width="15" height="14" viewBox="0 0 15 14" fill="none" xmlns="http://www.w3.org/2000/svg">
<path d="M9.45 5.30002C10.1956 5.30002 10.8 5.90443 10.8 6.65002C10.8 7.3956 10.1956 8.00002 9.45 8.00002L1.35 8.00002C0.60442 8.00002 1.81575e-06 7.3956 1.84834e-06 6.65002C1.88093e-06 5.90443 0.604418 5.30002 1.35 5.30002L9.45 5.30002Z" fill="#414141"/>
<path d="M12.05 -5.90104e-08C12.7956 -2.64199e-08 13.4 0.604416 13.4 1.35C13.4 2.09558 12.7956 2.7 12.05 2.7L3.95002 2.7C3.20444 2.7 2.60002 2.09558 2.60002 1.35C2.60002 0.604415 3.20444 -4.45663e-07 3.95002 -4.13072e-07L12.05 -5.90104e-08Z" fill="#414141"/>
<path d="M13.45 10.4C14.1956 10.4 14.8 11.0044 14.8 11.75C14.8 12.4956 14.1956 13.1 13.45 13.1L5.35002 13.1C4.60443 13.1 4.00002 12.4956 4.00002 11.75C4.00002 11.0044 4.60443 10.4 5.35001 10.4L13.45 10.4Z" fill="#414141"/>
</svg>
