<svg width="28" height="16" viewBox="0 0 28 16" fill="none" xmlns="http://www.w3.org/2000/svg">
<rect x="-4.57764e-05" y="-4.57764e-05" width="6" height="6" rx="1" fill="white"/>
<rect x="-4.57764e-05" y="9.99995" width="18" height="6" rx="1" fill="white"/>
<rect x="9.99995" y="-4.57764e-05" width="18" height="6" rx="1" fill="white"/>
</svg>
