{
    "DEVICE_METADATA": {
        "localhost": {
            "bgp_asn": "65103",
            "default_bgp_status": "up",
            "default_pfcwd_status": "disable",
            "hostname": "leaf03",
            "hwsku": "Mellanox-SN2700",
            "mac": "52:54:00:12:34:56",
            "platform": "x86_64-kvm_x86_64-r0",
            "type": "LeafRouter",
            "docker_routing_config_mode": "split-unified"
        }
    },
    "INTERFACE": {
        "Ethernet0": {},
        "Ethernet4": {},
        "Ethernet8": {},
        "Ethernet12": {},
        "Ethernet8|172.16.1.5/31": {},
        "Ethernet12|172.16.2.5/31": {}
    },
    "LOOPBACK_INTERFACE": {
        "Loopback0": {},
        "Loopback0|10.0.0.3/32": {}
    },
    "PORT": {
        "Ethernet0": {
            "admin_status": "up",
            "alias": "Ethernet0",
            "index": "0",
            "lanes": "1,2,3,4",
            "mtu": "9216",
            "speed": "40000"
        },
        "Ethernet4": {
            "admin_status": "up",
            "alias": "Ethernet4",
            "index": "1",
            "lanes": "5,6,7,8",
            "mtu": "9216",
            "speed": "40000"
        },
        "Ethernet8": {
            "admin_status": "up",
            "alias": "Ethernet8",
            "index": "2",
            "lanes": "9,10,11,12",
            "mtu": "9216",
            "speed": "40000"
        },
        "Ethernet12": {
            "admin_status": "up",
            "alias": "Ethernet12",
            "index": "3",
            "lanes": "13,14,15,16",
            "mtu": "9216",
            "speed": "40000"
        },
        "Ethernet16": {
            "admin_status": "up",
            "alias": "Ethernet16",
            "index": "4",
            "lanes": "17,18,19,20",
            "mtu": "9216",
            "speed": "40000"
        },
        "Ethernet20": {
            "admin_status": "up",
            "alias": "Ethernet20",
            "index": "5",
            "lanes": "21,22,23,24",
            "mtu": "9216",
            "speed": "40000"
        },
        "Ethernet24": {
            "admin_status": "up",
            "alias": "Ethernet24",
            "index": "6",
            "lanes": "25,26,27,28",
            "mtu": "9216",
            "speed": "40000"
        },
        "Ethernet28": {
            "admin_status": "up",
            "alias": "Ethernet28",
            "index": "7",
            "lanes": "29,30,31,32",
            "mtu": "9216",
            "speed": "40000"
        },
        "Ethernet32": {
            "admin_status": "up",
            "alias": "Ethernet32",
            "index": "8",
            "lanes": "33,34,35,36",
            "mtu": "9216",
            "speed": "40000"
        },
        "Ethernet36": {
            "admin_status": "up",
            "alias": "Ethernet36",
            "index": "9",
            "lanes": "37,38,39,40",
            "mtu": "9216",
            "speed": "40000"
        }
    },
    "TELEMETRY": {
        "gnmi": {
            "port": "8080"
        }
    },
    "VLAN": {
        "Vlan10": {
            "members": [
                "Ethernet0"
            ],
            "vlanid": "10"
        },
        "Vlan20": {
            "members": [
                "Ethernet4"
            ],
            "vlanid": "20"
        }
    },
    "VLAN_INTERFACE": {
        "Vlan10": {},
        "Vlan20": {}
    },
    "VLAN_MEMBER": {
        "Vlan10|Ethernet0": {
            "tagging_mode": "untagged"
        },
        "Vlan20|Ethernet4": {
            "tagging_mode": "untagged"
        }
    },
    "VXLAN_EVPN_NVO": {
        "nvo": {
            "source_vtep": "vtep"
        }
    },
    "VXLAN_TUNNEL": {
        "vtep": {
            "src_ip": "10.0.0.3"
        }
    },
    "VXLAN_TUNNEL_MAP": {
        "vtep|map_10_Vlan10": {
            "vlan": "Vlan10",
            "vni": "10"
        },
        "vtep|map_20_Vlan20": {
            "vlan": "Vlan20",
            "vni": "20"
        }
    }
}