{
    "BGP_NEIGHBOR": {
        "172.0.1.10": {
            "asn": "65199",
            "holdtime": "9",
            "keepalive": "3",
            "local_addr": "172.0.1.11",
            "name": "spine01",
            "nhopself": "0",
            "rrclient": "0"
        },
        "172.0.2.10": {
            "asn": "65199",
            "holdtime": "9",
            "keepalive": "3",
            "local_addr": "172.0.2.11",
            "name": "spine02",
            "nhopself": "0",
            "rrclient": "0"
        },
        "172.0.3.10": {
            "asn": "65199",
            "holdtime": "9",
            "keepalive": "3",
            "local_addr": "172.0.3.11",
            "name": "spine03",
            "nhopself": "0",
            "rrclient": "0"
        },
        "172.0.4.10": {
            "asn": "65199",
            "holdtime": "9",
            "keepalive": "3",
            "local_addr": "172.0.4.11",
            "name": "spine04",
            "nhopself": "0",
            "rrclient": "0"
        }
    },
    "BGP_PEER_RANGE": {
        "SERVER": {
            "name": "SERVER",
            "ip_range": [
                "10.0.112.0/24"
            ],
            "peer_asn": "65201"
        }
    },
    "CONTAINER_FEATURE": {
        "bgp": {
            "auto_restart": "disabled",
            "high_mem_alert": "disabled"
        },
        "database": {
            "auto_restart": "disabled",
            "high_mem_alert": "disabled"
        },
        "dhcp_relay": {
            "auto_restart": "disabled",
            "high_mem_alert": "disabled"
        },
        "lldp": {
            "auto_restart": "disabled",
            "high_mem_alert": "disabled"
        },
        "nat": {
            "auto_restart": "disabled",
            "high_mem_alert": "disabled"
        },
        "pmon": {
            "auto_restart": "disabled",
            "high_mem_alert": "disabled"
        },
        "radv": {
            "auto_restart": "disabled",
            "high_mem_alert": "disabled"
        },
        "restapi": {
            "auto_restart": "disabled",
            "high_mem_alert": "disabled"
        },
        "sflow": {
            "auto_restart": "disabled",
            "high_mem_alert": "disabled"
        },
        "snmp": {
            "auto_restart": "disabled",
            "high_mem_alert": "disabled"
        },
        "swss": {
            "auto_restart": "disabled",
            "high_mem_alert": "disabled"
        },
        "syncd": {
            "auto_restart": "disabled",
            "high_mem_alert": "disabled"
        },
        "teamd": {
            "auto_restart": "disabled",
            "high_mem_alert": "disabled"
        },
        "telemetry": {
            "auto_restart": "disabled",
            "high_mem_alert": "disabled"
        }
    },
    "CRM": {
        "Config": {
            "acl_counter_high_threshold": "85",
            "acl_counter_low_threshold": "70",
            "acl_counter_threshold_type": "percentage",
            "acl_entry_high_threshold": "85",
            "acl_entry_low_threshold": "70",
            "acl_entry_threshold_type": "percentage",
            "acl_group_high_threshold": "85",
            "acl_group_low_threshold": "70",
            "acl_group_threshold_type": "percentage",
            "acl_table_high_threshold": "85",
            "acl_table_low_threshold": "70",
            "acl_table_threshold_type": "percentage",
            "fdb_entry_high_threshold": "85",
            "fdb_entry_low_threshold": "70",
            "fdb_entry_threshold_type": "percentage",
            "ipv4_neighbor_high_threshold": "85",
            "ipv4_neighbor_low_threshold": "70",
            "ipv4_neighbor_threshold_type": "percentage",
            "ipv4_nexthop_high_threshold": "85",
            "ipv4_nexthop_low_threshold": "70",
            "ipv4_nexthop_threshold_type": "percentage",
            "ipv4_route_high_threshold": "85",
            "ipv4_route_low_threshold": "70",
            "ipv4_route_threshold_type": "percentage",
            "ipv6_neighbor_high_threshold": "85",
            "ipv6_neighbor_low_threshold": "70",
            "ipv6_neighbor_threshold_type": "percentage",
            "ipv6_nexthop_high_threshold": "85",
            "ipv6_nexthop_low_threshold": "70",
            "ipv6_nexthop_threshold_type": "percentage",
            "ipv6_route_high_threshold": "85",
            "ipv6_route_low_threshold": "70",
            "ipv6_route_threshold_type": "percentage",
            "nexthop_group_high_threshold": "85",
            "nexthop_group_low_threshold": "70",
            "nexthop_group_member_high_threshold": "85",
            "nexthop_group_member_low_threshold": "70",
            "nexthop_group_member_threshold_type": "percentage",
            "nexthop_group_threshold_type": "percentage",
            "polling_interval": "300"
        }
    },
    "DEVICE_METADATA": {
        "localhost": {
            "bgp_asn": "65103",
            "default_bgp_status": "up",
            "default_pfcwd_status": "disable",
            "hostname": "border02",
            "hwsku": "Mellanox-SN2700",
            "mac": "52:54:00:12:34:56",
            "platform": "x86_64-kvm_x86_64-r0",
            "type": "SpineRouter"
        }
    },
    "FEATURE": {
        "bgp": {
            "auto_restart": "enabled",
            "has_global_scope": "False",
            "has_per_asic_scope": "True",
            "has_timer": "False",
            "high_mem_alert": "disabled",
            "state": "enabled"
        },
        "database": {
            "auto_restart": "disabled",
            "has_global_scope": "True",
            "has_per_asic_scope": "True",
            "has_timer": "False",
            "high_mem_alert": "disabled",
            "state": "enabled"
        },
        "dhcp_relay": {
            "auto_restart": "enabled",
            "has_global_scope": "True",
            "has_per_asic_scope": "False",
            "has_timer": "False",
            "high_mem_alert": "disabled",
            "state": "enabled"
        },
        "lldp": {
            "auto_restart": "enabled",
            "has_global_scope": "True",
            "has_per_asic_scope": "True",
            "has_timer": "False",
            "high_mem_alert": "disabled",
            "state": "enabled"
        },
        "mgmt-framework": {
            "auto_restart": "enabled",
            "has_global_scope": "True",
            "has_per_asic_scope": "False",
            "has_timer": "True",
            "high_mem_alert": "disabled",
            "state": "enabled"
        },
        "nat": {
            "auto_restart": "enabled",
            "has_global_scope": "True",
            "has_per_asic_scope": "False",
            "has_timer": "False",
            "high_mem_alert": "disabled",
            "state": "disabled"
        },
        "pmon": {
            "auto_restart": "enabled",
            "has_global_scope": "True",
            "has_per_asic_scope": "False",
            "has_timer": "False",
            "high_mem_alert": "disabled",
            "state": "enabled"
        },
        "radv": {
            "auto_restart": "enabled",
            "has_global_scope": "True",
            "has_per_asic_scope": "False",
            "has_timer": "False",
            "high_mem_alert": "disabled",
            "state": "enabled"
        },
        "sflow": {
            "auto_restart": "enabled",
            "has_global_scope": "True",
            "has_per_asic_scope": "False",
            "has_timer": "False",
            "high_mem_alert": "disabled",
            "state": "disabled",
            "status": "disabled"
        },
        "snmp": {
            "auto_restart": "enabled",
            "has_global_scope": "True",
            "has_per_asic_scope": "False",
            "has_timer": "True",
            "high_mem_alert": "disabled",
            "state": "enabled"
        },
        "swss": {
            "auto_restart": "enabled",
            "has_global_scope": "False",
            "has_per_asic_scope": "True",
            "has_timer": "False",
            "high_mem_alert": "disabled",
            "state": "enabled"
        },
        "syncd": {
            "auto_restart": "enabled",
            "has_global_scope": "False",
            "has_per_asic_scope": "True",
            "has_timer": "False",
            "high_mem_alert": "disabled",
            "state": "enabled"
        },
        "teamd": {
            "auto_restart": "enabled",
            "has_global_scope": "False",
            "has_per_asic_scope": "True",
            "has_timer": "False",
            "high_mem_alert": "disabled",
            "state": "enabled"
        },
        "telemetry": {
            "auto_restart": "enabled",
            "has_global_scope": "True",
            "has_per_asic_scope": "False",
            "has_timer": "True",
            "high_mem_alert": "disabled",
            "state": "enabled",
            "status": "disabled"
        }
    },
    "FLEX_COUNTER_TABLE": {
        "BUFFER_POOL_WATERMARK": {
            "FLEX_COUNTER_STATUS": "enable"
        },
        "PFCWD": {
            "FLEX_COUNTER_STATUS": "enable"
        },
        "PG_WATERMARK": {
            "FLEX_COUNTER_STATUS": "enable"
        },
        "PORT": {
            "FLEX_COUNTER_STATUS": "enable"
        },
        "PORT_BUFFER_DROP": {
            "FLEX_COUNTER_STATUS": "enable"
        },
        "QUEUE": {
            "FLEX_COUNTER_STATUS": "enable"
        },
        "QUEUE_WATERMARK": {
            "FLEX_COUNTER_STATUS": "enable"
        }
    },
    "INTERFACE": {
        "Ethernet0": {},
        "Ethernet4": {},
        "Ethernet8": {},
        "Ethernet12": {},
        "Ethernet16": {},
        "Ethernet20": {},
        "Ethernet24": {},
        "Ethernet28": {},
        "Ethernet32": {},
        "Ethernet20|172.0.1.11/31": {},
        "Ethernet24|172.0.2.11/31": {},
        "Ethernet28|172.0.3.11/31": {},
        "Ethernet32|172.0.4.11/31": {}
    },
    "LOOPBACK_INTERFACE": {
        "Loopback0": {},
        "Loopback0|10.255.255.6/32": {}
    },
    "PORT": {
        "Ethernet0": {
            "admin_status": "up",
            "alias": "fortyGigE0/0",
            "index": "0",
            "lanes": "25,26,27,28",
            "mtu": "9216",
            "speed": "40000"
        },
        "Ethernet4": {
            "admin_status": "up",
            "alias": "fortyGigE0/4",
            "index": "1",
            "lanes": "29,30,31,32",
            "mtu": "9216",
            "speed": "40000"
        },
        "Ethernet8": {
            "admin_status": "up",
            "alias": "fortyGigE0/8",
            "index": "2",
            "lanes": "33,34,35,36",
            "mtu": "9216",
            "speed": "40000"
        },
        "Ethernet12": {
            "admin_status": "up",
            "alias": "fortyGigE0/12",
            "index": "3",
            "lanes": "37,38,39,40",
            "mtu": "9216",
            "speed": "40000"
        },
        "Ethernet16": {
            "admin_status": "up",
            "alias": "fortyGigE0/16",
            "index": "4",
            "lanes": "45,46,47,48",
            "mtu": "9216",
            "speed": "40000"
        },
        "Ethernet20": {
            "admin_status": "up",
            "alias": "fortyGigE0/20",
            "index": "5",
            "lanes": "41,42,43,44",
            "mtu": "9216",
            "speed": "40000"
        },
        "Ethernet24": {
            "admin_status": "up",
            "alias": "fortyGigE0/24",
            "index": "6",
            "lanes": "1,2,3,4",
            "mtu": "9216",
            "speed": "40000"
        },
        "Ethernet28": {
            "admin_status": "up",
            "alias": "fortyGigE0/28",
            "index": "7",
            "lanes": "5,6,7,8",
            "mtu": "9216",
            "speed": "40000"
        },
        "Ethernet32": {
            "admin_status": "up",
            "alias": "fortyGigE0/32",
            "index": "8",
            "lanes": "13,14,15,16",
            "mtu": "9216",
            "speed": "40000"
        },
        "Ethernet36": {
            "admin_status": "up",
            "alias": "fortyGigE0/36",
            "index": "9",
            "lanes": "9,10,11,12",
            "mtu": "9216",
            "speed": "40000"
        },
        "Ethernet40": {
            "admin_status": "up",
            "alias": "fortyGigE0/40",
            "index": "10",
            "lanes": "17,18,19,20",
            "mtu": "9216",
            "speed": "40000"
        },
        "Ethernet44": {
            "admin_status": "up",
            "alias": "fortyGigE0/44",
            "index": "11",
            "lanes": "21,22,23,24",
            "mtu": "9216",
            "speed": "40000"
        },
        "Ethernet48": {
            "admin_status": "up",
            "alias": "fortyGigE0/48",
            "index": "12",
            "lanes": "53,54,55,56",
            "mtu": "9216",
            "speed": "40000"
        },
        "Ethernet52": {
            "admin_status": "up",
            "alias": "fortyGigE0/52",
            "index": "13",
            "lanes": "49,50,51,52",
            "mtu": "9216",
            "speed": "40000"
        },
        "Ethernet56": {
            "admin_status": "up",
            "alias": "fortyGigE0/56",
            "index": "14",
            "lanes": "57,58,59,60",
            "mtu": "9216",
            "speed": "40000"
        },
        "Ethernet60": {
            "admin_status": "up",
            "alias": "fortyGigE0/60",
            "index": "15",
            "lanes": "61,62,63,64",
            "mtu": "9216",
            "speed": "40000"
        },
        "Ethernet64": {
            "admin_status": "up",
            "alias": "fortyGigE0/64",
            "index": "16",
            "lanes": "69,70,71,72",
            "mtu": "9216",
            "speed": "40000"
        },
        "Ethernet68": {
            "admin_status": "up",
            "alias": "fortyGigE0/68",
            "index": "17",
            "lanes": "65,66,67,68",
            "mtu": "9216",
            "speed": "40000"
        },
        "Ethernet72": {
            "admin_status": "up",
            "alias": "fortyGigE0/72",
            "index": "18",
            "lanes": "73,74,75,76",
            "mtu": "9216",
            "speed": "40000"
        },
        "Ethernet76": {
            "admin_status": "up",
            "alias": "fortyGigE0/76",
            "index": "19",
            "lanes": "77,78,79,80",
            "mtu": "9216",
            "speed": "40000"
        },
        "Ethernet80": {
            "admin_status": "up",
            "alias": "fortyGigE0/80",
            "index": "20",
            "lanes": "109,110,111,112",
            "mtu": "9216",
            "speed": "40000"
        },
        "Ethernet84": {
            "admin_status": "up",
            "alias": "fortyGigE0/84",
            "index": "21",
            "lanes": "105,106,107,108",
            "mtu": "9216",
            "speed": "40000"
        },
        "Ethernet88": {
            "admin_status": "up",
            "alias": "fortyGigE0/88",
            "index": "22",
            "lanes": "113,114,115,116",
            "mtu": "9216",
            "speed": "40000"
        },
        "Ethernet92": {
            "admin_status": "up",
            "alias": "fortyGigE0/92",
            "index": "23",
            "lanes": "117,118,119,120",
            "mtu": "9216",
            "speed": "40000"
        },
        "Ethernet96": {
            "admin_status": "up",
            "alias": "fortyGigE0/96",
            "index": "24",
            "lanes": "125,126,127,128",
            "mtu": "9216",
            "speed": "40000"
        },
        "Ethernet100": {
            "admin_status": "up",
            "alias": "fortyGigE0/100",
            "index": "25",
            "lanes": "121,122,123,124",
            "mtu": "9216",
            "speed": "40000"
        },
        "Ethernet104": {
            "admin_status": "up",
            "alias": "fortyGigE0/104",
            "index": "26",
            "lanes": "81,82,83,84",
            "mtu": "9216",
            "speed": "40000"
        },
        "Ethernet108": {
            "admin_status": "up",
            "alias": "fortyGigE0/108",
            "index": "27",
            "lanes": "85,86,87,88",
            "mtu": "9216",
            "speed": "40000"
        },
        "Ethernet112": {
            "admin_status": "up",
            "alias": "fortyGigE0/112",
            "index": "28",
            "lanes": "93,94,95,96",
            "mtu": "9216",
            "speed": "40000"
        },
        "Ethernet116": {
            "admin_status": "up",
            "alias": "fortyGigE0/116",
            "index": "29",
            "lanes": "89,90,91,92",
            "mtu": "9216",
            "speed": "40000"
        },
        "Ethernet120": {
            "admin_status": "up",
            "alias": "fortyGigE0/120",
            "index": "30",
            "lanes": "101,102,103,104",
            "mtu": "9216",
            "speed": "40000"
        },
        "Ethernet124": {
            "admin_status": "up",
            "alias": "fortyGigE0/124",
            "index": "31",
            "lanes": "97,98,99,100",
            "mtu": "9216",
            "speed": "40000"
        }
    },
    "TELEMETRY": {
        "gnmi": {
            "port": "8080"
        }
    },
    "VERSIONS": {
        "DATABASE": {
            "VERSION": "version_1_0_3"
        }
    },
    "VLAN": {
        "Vlan112": {
            "members": [
                "Ethernet0",
                "Ethernet4",
                "Ethernet8"
            ],
            "vlanid": "112"
        }
    },
    "VLAN_INTERFACE": {
        "Vlan112": {},
        "Vlan112|10.0.112.1/24": {}
    },
    "VLAN_MEMBER": {
        "Vlan112|Ethernet0": {
            "tagging_mode": "untagged"
        },
        "Vlan112|Ethernet4": {
            "tagging_mode": "untagged"
        },
        "Vlan112|Ethernet8": {
            "tagging_mode": "untagged"
        }
    }
}

