{
  "project_info": {
    "project_number": "134225400537",
    "firebase_url": "https://fatoum-7d89c.firebaseio.com",
    "project_id": "fatoum-7d89c",
    "storage_bucket": "fatoum-7d89c.appspot.com"
  },
  "client": [
    {
      "client_info": {
        "mobilesdk_app_id": "1:134225400537:android:54a5757f29b200ff",
        "android_client_info": {
          "package_name": "com.ctrlplus.fatoum"
        }
      },
      "oauth_client": [
        {
          "client_id": "134225400537-ktk59bsjv1p2rggmh5doip5kg7asns53.apps.googleusercontent.com",
          "client_type": 3
        },
        {
          "client_id": "134225400537-ktk59bsjv1p2rggmh5doip5kg7asns53.apps.googleusercontent.com",
          "client_type": 3
        }
      ],
      "api_key": [
        {
          "current_key": "AIzaSyDBZcYyJ3OBTr8jamf6K3lu5vOPvuPEJWk"
        }
      ],
      "services": {
        "analytics_service": {
          "status": 1
        },
        "appinvite_service": {
          "status": 1,
          "other_platform_oauth_client": []
        },
        "ads_service": {
          "status": 2
        }
      }
    }
  ],
  "configuration_version": "1"
}