__        __              _      ____                             _        
\ \      / /  ___   _ __ | | __ |  _ \   ___  _ __    ___   _ __ | |_  ___ 
 \ \ /\ / /  / _ \ | '__|| |/ / | |_) | / _ \| '_ \  / _ \ | '__|| __|/ __|
  \ V  V /  | (_) || |   |   <  |  _ < |  __/| |_) || (_) || |   | |_ \__ \
   \_/\_/    \___/ |_|   |_|\_\ |_| \_\ \___|| .__/  \___/ |_|    \__||___/
                                             |_|                           
