^C:\DLIB-19.21\SOURCE\DLIB\CMAKE_UTILS\TEST_FOR_CUDA\CUDA_TEST.CU
setlocal
cd C:\dlib-19.21\build\dlib\cuda_test_build\CMakeFiles\cuda_test.dir
if %errorlevel% neq 0 goto :cmEnd
C:
if %errorlevel% neq 0 goto :cmEnd
"C:\Program Files\CMake\bin\cmake.exe" -E make_directory C:/dlib-19.21/build/dlib/cuda_test_build/CMakeFiles/cuda_test.dir//Debug
if %errorlevel% neq 0 goto :cmEnd
"C:\Program Files\CMake\bin\cmake.exe" -D verbose:BOOL=OFF -D "CCBIN:PATH=C:\Program Files (x86)\Microsoft Visual Studio\2019\Enterprise\VC\Tools/MSVC/14.27.29110/bin/Hostx64/x64" -D build_configuration:STRING=Debug -D generated_file:STRING=C:/dlib-19.21/build/dlib/cuda_test_build/CMakeFiles/cuda_test.dir//Debug/cuda_test_generated_cuda_test.cu.obj -D generated_cubin_file:STRING=C:/dlib-19.21/build/dlib/cuda_test_build/CMakeFiles/cuda_test.dir//Debug/cuda_test_generated_cuda_test.cu.obj.cubin.txt -P C:/dlib-19.21/build/dlib/cuda_test_build/CMakeFiles/cuda_test.dir//cuda_test_generated_cuda_test.cu.obj.Debug.cmake
if %errorlevel% neq 0 goto :cmEnd
:cmEnd
endlocal & call :cmErrorLevel %errorlevel% & goto :cmDone
:cmErrorLevel
exit /b %1
:cmDone
if %errorlevel% neq 0 goto :VCEnd
^C:\DLIB-19.21\SOURCE\DLIB\CMAKE_UTILS\TEST_FOR_CUDA\CMAKELISTS.TXT
setlocal
"C:\Program Files\CMake\bin\cmake.exe" -SC:/dlib-19.21/source/dlib/cmake_utils/test_for_cuda -BC:/dlib-19.21/build/dlib/cuda_test_build --check-stamp-file C:/dlib-19.21/build/dlib/cuda_test_build/CMakeFiles/generate.stamp
if %errorlevel% neq 0 goto :cmEnd
:cmEnd
endlocal & call :cmErrorLevel %errorlevel% & goto :cmDone
:cmErrorLevel
exit /b %1
:cmDone
if %errorlevel% neq 0 goto :VCEnd
