^C:\DLIB-19.21\BUILD\NEON_TEST_BUILD\CMAKEFILES\A0C734E34C5115DBA3F712480CBC3E85\GENERATE.STAMP.RULE
setlocal
"C:\Program Files\CMake\bin\cmake.exe" -SC:/dlib-19.21/source/dlib/cmake_utils/test_for_neon -BC:/dlib-19.21/build/neon_test_build --check-stamp-list CMakeFiles/generate.stamp.list --vs-solution-file C:/dlib-19.21/build/neon_test_build/neon_test.sln
if %errorlevel% neq 0 goto :cmEnd
:cmEnd
endlocal & call :cmErrorLevel %errorlevel% & goto :cmDone
:cmErrorLevel
exit /b %1
:cmDone
if %errorlevel% neq 0 goto :VCEnd
