^C:\DLIB-19.21\SOURCE\DLIB\BASE64\BASE64_KERNEL_1.CPP
/c /I"C:\DLIB-19.21\SOURCE\DLIB\EXTERNAL\LIBPNG" /I"C:\DLIB-19.21\SOURCE\DLIB\EXTERNAL\ZLIB" /Zi /nologo /W3 /WX- /diagnostics:column /Od /Ob0 /D WIN32 /D _WINDOWS /D DLIB_HAVE_SSE2 /D DLIB_DISABLE_ASSERTS /D DLIB_JPEG_SUPPORT /D DLIB_PNG_SUPPORT /D DLIB__CMAKE_GENERATED_A_CONFIG_H_FILE /D DLIB_CHECK_FOR_VERSION_MISMATCH=DLIB_VERSION_MISMATCH_CHECK__EXPECTED_VERSION_19_21_0 /D DLIB_JPEG_STATIC /D "CMAKE_INTDIR=\"Debug\"" /D _MBCS /Gm- /EHsc /RTC1 /MDd /GS /fp:precise /Zc:wchar_t /Zc:forScope /Zc:inline /GR /Fo"DLIB.DIR\DEBUG\\" /Fd"DLIB.DIR\DEBUG\DLIB.PDB" /Gd /TP  /bigobj C:\DLIB-19.21\SOURCE\DLIB\BASE64\BASE64_KERNEL_1.CPP
^C:\DLIB-19.21\SOURCE\DLIB\BIGINT\BIGINT_KERNEL_1.CPP
/c /I"C:\DLIB-19.21\SOURCE\DLIB\EXTERNAL\LIBPNG" /I"C:\DLIB-19.21\SOURCE\DLIB\EXTERNAL\ZLIB" /Zi /nologo /W3 /WX- /diagnostics:column /Od /Ob0 /D WIN32 /D _WINDOWS /D DLIB_HAVE_SSE2 /D DLIB_DISABLE_ASSERTS /D DLIB_JPEG_SUPPORT /D DLIB_PNG_SUPPORT /D DLIB__CMAKE_GENERATED_A_CONFIG_H_FILE /D DLIB_CHECK_FOR_VERSION_MISMATCH=DLIB_VERSION_MISMATCH_CHECK__EXPECTED_VERSION_19_21_0 /D DLIB_JPEG_STATIC /D "CMAKE_INTDIR=\"Debug\"" /D _MBCS /Gm- /EHsc /RTC1 /MDd /GS /fp:precise /Zc:wchar_t /Zc:forScope /Zc:inline /GR /Fo"DLIB.DIR\DEBUG\\" /Fd"DLIB.DIR\DEBUG\DLIB.PDB" /Gd /TP  /bigobj C:\DLIB-19.21\SOURCE\DLIB\BIGINT\BIGINT_KERNEL_1.CPP
^C:\DLIB-19.21\SOURCE\DLIB\BIGINT\BIGINT_KERNEL_2.CPP
/c /I"C:\DLIB-19.21\SOURCE\DLIB\EXTERNAL\LIBPNG" /I"C:\DLIB-19.21\SOURCE\DLIB\EXTERNAL\ZLIB" /Zi /nologo /W3 /WX- /diagnostics:column /Od /Ob0 /D WIN32 /D _WINDOWS /D DLIB_HAVE_SSE2 /D DLIB_DISABLE_ASSERTS /D DLIB_JPEG_SUPPORT /D DLIB_PNG_SUPPORT /D DLIB__CMAKE_GENERATED_A_CONFIG_H_FILE /D DLIB_CHECK_FOR_VERSION_MISMATCH=DLIB_VERSION_MISMATCH_CHECK__EXPECTED_VERSION_19_21_0 /D DLIB_JPEG_STATIC /D "CMAKE_INTDIR=\"Debug\"" /D _MBCS /Gm- /EHsc /RTC1 /MDd /GS /fp:precise /Zc:wchar_t /Zc:forScope /Zc:inline /GR /Fo"DLIB.DIR\DEBUG\\" /Fd"DLIB.DIR\DEBUG\DLIB.PDB" /Gd /TP  /bigobj C:\DLIB-19.21\SOURCE\DLIB\BIGINT\BIGINT_KERNEL_2.CPP
^C:\DLIB-19.21\SOURCE\DLIB\BIT_STREAM\BIT_STREAM_KERNEL_1.CPP
/c /I"C:\DLIB-19.21\SOURCE\DLIB\EXTERNAL\LIBPNG" /I"C:\DLIB-19.21\SOURCE\DLIB\EXTERNAL\ZLIB" /Zi /nologo /W3 /WX- /diagnostics:column /Od /Ob0 /D WIN32 /D _WINDOWS /D DLIB_HAVE_SSE2 /D DLIB_DISABLE_ASSERTS /D DLIB_JPEG_SUPPORT /D DLIB_PNG_SUPPORT /D DLIB__CMAKE_GENERATED_A_CONFIG_H_FILE /D DLIB_CHECK_FOR_VERSION_MISMATCH=DLIB_VERSION_MISMATCH_CHECK__EXPECTED_VERSION_19_21_0 /D DLIB_JPEG_STATIC /D "CMAKE_INTDIR=\"Debug\"" /D _MBCS /Gm- /EHsc /RTC1 /MDd /GS /fp:precise /Zc:wchar_t /Zc:forScope /Zc:inline /GR /Fo"DLIB.DIR\DEBUG\\" /Fd"DLIB.DIR\DEBUG\DLIB.PDB" /Gd /TP  /bigobj C:\DLIB-19.21\SOURCE\DLIB\BIT_STREAM\BIT_STREAM_KERNEL_1.CPP
^C:\DLIB-19.21\SOURCE\DLIB\ENTROPY_DECODER\ENTROPY_DECODER_KERNEL_1.CPP
/c /I"C:\DLIB-19.21\SOURCE\DLIB\EXTERNAL\LIBPNG" /I"C:\DLIB-19.21\SOURCE\DLIB\EXTERNAL\ZLIB" /Zi /nologo /W3 /WX- /diagnostics:column /Od /Ob0 /D WIN32 /D _WINDOWS /D DLIB_HAVE_SSE2 /D DLIB_DISABLE_ASSERTS /D DLIB_JPEG_SUPPORT /D DLIB_PNG_SUPPORT /D DLIB__CMAKE_GENERATED_A_CONFIG_H_FILE /D DLIB_CHECK_FOR_VERSION_MISMATCH=DLIB_VERSION_MISMATCH_CHECK__EXPECTED_VERSION_19_21_0 /D DLIB_JPEG_STATIC /D "CMAKE_INTDIR=\"Debug\"" /D _MBCS /Gm- /EHsc /RTC1 /MDd /GS /fp:precise /Zc:wchar_t /Zc:forScope /Zc:inline /GR /Fo"DLIB.DIR\DEBUG\\" /Fd"DLIB.DIR\DEBUG\DLIB.PDB" /Gd /TP  /bigobj C:\DLIB-19.21\SOURCE\DLIB\ENTROPY_DECODER\ENTROPY_DECODER_KERNEL_1.CPP
^C:\DLIB-19.21\SOURCE\DLIB\ENTROPY_DECODER\ENTROPY_DECODER_KERNEL_2.CPP
/c /I"C:\DLIB-19.21\SOURCE\DLIB\EXTERNAL\LIBPNG" /I"C:\DLIB-19.21\SOURCE\DLIB\EXTERNAL\ZLIB" /Zi /nologo /W3 /WX- /diagnostics:column /Od /Ob0 /D WIN32 /D _WINDOWS /D DLIB_HAVE_SSE2 /D DLIB_DISABLE_ASSERTS /D DLIB_JPEG_SUPPORT /D DLIB_PNG_SUPPORT /D DLIB__CMAKE_GENERATED_A_CONFIG_H_FILE /D DLIB_CHECK_FOR_VERSION_MISMATCH=DLIB_VERSION_MISMATCH_CHECK__EXPECTED_VERSION_19_21_0 /D DLIB_JPEG_STATIC /D "CMAKE_INTDIR=\"Debug\"" /D _MBCS /Gm- /EHsc /RTC1 /MDd /GS /fp:precise /Zc:wchar_t /Zc:forScope /Zc:inline /GR /Fo"DLIB.DIR\DEBUG\\" /Fd"DLIB.DIR\DEBUG\DLIB.PDB" /Gd /TP  /bigobj C:\DLIB-19.21\SOURCE\DLIB\ENTROPY_DECODER\ENTROPY_DECODER_KERNEL_2.CPP
^C:\DLIB-19.21\SOURCE\DLIB\ENTROPY_ENCODER\ENTROPY_ENCODER_KERNEL_1.CPP
/c /I"C:\DLIB-19.21\SOURCE\DLIB\EXTERNAL\LIBPNG" /I"C:\DLIB-19.21\SOURCE\DLIB\EXTERNAL\ZLIB" /Zi /nologo /W3 /WX- /diagnostics:column /Od /Ob0 /D WIN32 /D _WINDOWS /D DLIB_HAVE_SSE2 /D DLIB_DISABLE_ASSERTS /D DLIB_JPEG_SUPPORT /D DLIB_PNG_SUPPORT /D DLIB__CMAKE_GENERATED_A_CONFIG_H_FILE /D DLIB_CHECK_FOR_VERSION_MISMATCH=DLIB_VERSION_MISMATCH_CHECK__EXPECTED_VERSION_19_21_0 /D DLIB_JPEG_STATIC /D "CMAKE_INTDIR=\"Debug\"" /D _MBCS /Gm- /EHsc /RTC1 /MDd /GS /fp:precise /Zc:wchar_t /Zc:forScope /Zc:inline /GR /Fo"DLIB.DIR\DEBUG\\" /Fd"DLIB.DIR\DEBUG\DLIB.PDB" /Gd /TP  /bigobj C:\DLIB-19.21\SOURCE\DLIB\ENTROPY_ENCODER\ENTROPY_ENCODER_KERNEL_1.CPP
^C:\DLIB-19.21\SOURCE\DLIB\ENTROPY_ENCODER\ENTROPY_ENCODER_KERNEL_2.CPP
/c /I"C:\DLIB-19.21\SOURCE\DLIB\EXTERNAL\LIBPNG" /I"C:\DLIB-19.21\SOURCE\DLIB\EXTERNAL\ZLIB" /Zi /nologo /W3 /WX- /diagnostics:column /Od /Ob0 /D WIN32 /D _WINDOWS /D DLIB_HAVE_SSE2 /D DLIB_DISABLE_ASSERTS /D DLIB_JPEG_SUPPORT /D DLIB_PNG_SUPPORT /D DLIB__CMAKE_GENERATED_A_CONFIG_H_FILE /D DLIB_CHECK_FOR_VERSION_MISMATCH=DLIB_VERSION_MISMATCH_CHECK__EXPECTED_VERSION_19_21_0 /D DLIB_JPEG_STATIC /D "CMAKE_INTDIR=\"Debug\"" /D _MBCS /Gm- /EHsc /RTC1 /MDd /GS /fp:precise /Zc:wchar_t /Zc:forScope /Zc:inline /GR /Fo"DLIB.DIR\DEBUG\\" /Fd"DLIB.DIR\DEBUG\DLIB.PDB" /Gd /TP  /bigobj C:\DLIB-19.21\SOURCE\DLIB\ENTROPY_ENCODER\ENTROPY_ENCODER_KERNEL_2.CPP
^C:\DLIB-19.21\SOURCE\DLIB\MD5\MD5_KERNEL_1.CPP
/c /I"C:\DLIB-19.21\SOURCE\DLIB\EXTERNAL\LIBPNG" /I"C:\DLIB-19.21\SOURCE\DLIB\EXTERNAL\ZLIB" /Zi /nologo /W3 /WX- /diagnostics:column /Od /Ob0 /D WIN32 /D _WINDOWS /D DLIB_HAVE_SSE2 /D DLIB_DISABLE_ASSERTS /D DLIB_JPEG_SUPPORT /D DLIB_PNG_SUPPORT /D DLIB__CMAKE_GENERATED_A_CONFIG_H_FILE /D DLIB_CHECK_FOR_VERSION_MISMATCH=DLIB_VERSION_MISMATCH_CHECK__EXPECTED_VERSION_19_21_0 /D DLIB_JPEG_STATIC /D "CMAKE_INTDIR=\"Debug\"" /D _MBCS /Gm- /EHsc /RTC1 /MDd /GS /fp:precise /Zc:wchar_t /Zc:forScope /Zc:inline /GR /Fo"DLIB.DIR\DEBUG\\" /Fd"DLIB.DIR\DEBUG\DLIB.PDB" /Gd /TP  /bigobj C:\DLIB-19.21\SOURCE\DLIB\MD5\MD5_KERNEL_1.CPP
^C:\DLIB-19.21\SOURCE\DLIB\TOKENIZER\TOKENIZER_KERNEL_1.CPP
/c /I"C:\DLIB-19.21\SOURCE\DLIB\EXTERNAL\LIBPNG" /I"C:\DLIB-19.21\SOURCE\DLIB\EXTERNAL\ZLIB" /Zi /nologo /W3 /WX- /diagnostics:column /Od /Ob0 /D WIN32 /D _WINDOWS /D DLIB_HAVE_SSE2 /D DLIB_DISABLE_ASSERTS /D DLIB_JPEG_SUPPORT /D DLIB_PNG_SUPPORT /D DLIB__CMAKE_GENERATED_A_CONFIG_H_FILE /D DLIB_CHECK_FOR_VERSION_MISMATCH=DLIB_VERSION_MISMATCH_CHECK__EXPECTED_VERSION_19_21_0 /D DLIB_JPEG_STATIC /D "CMAKE_INTDIR=\"Debug\"" /D _MBCS /Gm- /EHsc /RTC1 /MDd /GS /fp:precise /Zc:wchar_t /Zc:forScope /Zc:inline /GR /Fo"DLIB.DIR\DEBUG\\" /Fd"DLIB.DIR\DEBUG\DLIB.PDB" /Gd /TP  /bigobj C:\DLIB-19.21\SOURCE\DLIB\TOKENIZER\TOKENIZER_KERNEL_1.CPP
^C:\DLIB-19.21\SOURCE\DLIB\UNICODE\UNICODE.CPP
/c /I"C:\DLIB-19.21\SOURCE\DLIB\EXTERNAL\LIBPNG" /I"C:\DLIB-19.21\SOURCE\DLIB\EXTERNAL\ZLIB" /Zi /nologo /W3 /WX- /diagnostics:column /Od /Ob0 /D WIN32 /D _WINDOWS /D DLIB_HAVE_SSE2 /D DLIB_DISABLE_ASSERTS /D DLIB_JPEG_SUPPORT /D DLIB_PNG_SUPPORT /D DLIB__CMAKE_GENERATED_A_CONFIG_H_FILE /D DLIB_CHECK_FOR_VERSION_MISMATCH=DLIB_VERSION_MISMATCH_CHECK__EXPECTED_VERSION_19_21_0 /D DLIB_JPEG_STATIC /D "CMAKE_INTDIR=\"Debug\"" /D _MBCS /Gm- /EHsc /RTC1 /MDd /GS /fp:precise /Zc:wchar_t /Zc:forScope /Zc:inline /GR /Fo"DLIB.DIR\DEBUG\\" /Fd"DLIB.DIR\DEBUG\DLIB.PDB" /Gd /TP  /bigobj C:\DLIB-19.21\SOURCE\DLIB\UNICODE\UNICODE.CPP
^C:\DLIB-19.21\SOURCE\DLIB\TEST_FOR_ODR_VIOLATIONS.CPP
/c /I"C:\DLIB-19.21\SOURCE\DLIB\EXTERNAL\LIBPNG" /I"C:\DLIB-19.21\SOURCE\DLIB\EXTERNAL\ZLIB" /Zi /nologo /W3 /WX- /diagnostics:column /Od /Ob0 /D WIN32 /D _WINDOWS /D DLIB_HAVE_SSE2 /D DLIB_DISABLE_ASSERTS /D DLIB_JPEG_SUPPORT /D DLIB_PNG_SUPPORT /D DLIB__CMAKE_GENERATED_A_CONFIG_H_FILE /D DLIB_CHECK_FOR_VERSION_MISMATCH=DLIB_VERSION_MISMATCH_CHECK__EXPECTED_VERSION_19_21_0 /D DLIB_JPEG_STATIC /D "CMAKE_INTDIR=\"Debug\"" /D _MBCS /Gm- /EHsc /RTC1 /MDd /GS /fp:precise /Zc:wchar_t /Zc:forScope /Zc:inline /GR /Fo"DLIB.DIR\DEBUG\\" /Fd"DLIB.DIR\DEBUG\DLIB.PDB" /Gd /TP  /bigobj C:\DLIB-19.21\SOURCE\DLIB\TEST_FOR_ODR_VIOLATIONS.CPP
^C:\DLIB-19.21\SOURCE\DLIB\SOCKETS\SOCKETS_KERNEL_1.CPP
/c /I"C:\DLIB-19.21\SOURCE\DLIB\EXTERNAL\LIBPNG" /I"C:\DLIB-19.21\SOURCE\DLIB\EXTERNAL\ZLIB" /Zi /nologo /W3 /WX- /diagnostics:column /Od /Ob0 /D WIN32 /D _WINDOWS /D DLIB_HAVE_SSE2 /D DLIB_DISABLE_ASSERTS /D DLIB_JPEG_SUPPORT /D DLIB_PNG_SUPPORT /D DLIB__CMAKE_GENERATED_A_CONFIG_H_FILE /D DLIB_CHECK_FOR_VERSION_MISMATCH=DLIB_VERSION_MISMATCH_CHECK__EXPECTED_VERSION_19_21_0 /D DLIB_JPEG_STATIC /D "CMAKE_INTDIR=\"Debug\"" /D _MBCS /Gm- /EHsc /RTC1 /MDd /GS /fp:precise /Zc:wchar_t /Zc:forScope /Zc:inline /GR /Fo"DLIB.DIR\DEBUG\\" /Fd"DLIB.DIR\DEBUG\DLIB.PDB" /Gd /TP  /bigobj C:\DLIB-19.21\SOURCE\DLIB\SOCKETS\SOCKETS_KERNEL_1.CPP
^C:\DLIB-19.21\SOURCE\DLIB\BSP\BSP.CPP
/c /I"C:\DLIB-19.21\SOURCE\DLIB\EXTERNAL\LIBPNG" /I"C:\DLIB-19.21\SOURCE\DLIB\EXTERNAL\ZLIB" /Zi /nologo /W3 /WX- /diagnostics:column /Od /Ob0 /D WIN32 /D _WINDOWS /D DLIB_HAVE_SSE2 /D DLIB_DISABLE_ASSERTS /D DLIB_JPEG_SUPPORT /D DLIB_PNG_SUPPORT /D DLIB__CMAKE_GENERATED_A_CONFIG_H_FILE /D DLIB_CHECK_FOR_VERSION_MISMATCH=DLIB_VERSION_MISMATCH_CHECK__EXPECTED_VERSION_19_21_0 /D DLIB_JPEG_STATIC /D "CMAKE_INTDIR=\"Debug\"" /D _MBCS /Gm- /EHsc /RTC1 /MDd /GS /fp:precise /Zc:wchar_t /Zc:forScope /Zc:inline /GR /Fo"DLIB.DIR\DEBUG\\" /Fd"DLIB.DIR\DEBUG\DLIB.PDB" /Gd /TP  /bigobj C:\DLIB-19.21\SOURCE\DLIB\BSP\BSP.CPP
^C:\DLIB-19.21\SOURCE\DLIB\DIR_NAV\DIR_NAV_KERNEL_1.CPP
/c /I"C:\DLIB-19.21\SOURCE\DLIB\EXTERNAL\LIBPNG" /I"C:\DLIB-19.21\SOURCE\DLIB\EXTERNAL\ZLIB" /Zi /nologo /W3 /WX- /diagnostics:column /Od /Ob0 /D WIN32 /D _WINDOWS /D DLIB_HAVE_SSE2 /D DLIB_DISABLE_ASSERTS /D DLIB_JPEG_SUPPORT /D DLIB_PNG_SUPPORT /D DLIB__CMAKE_GENERATED_A_CONFIG_H_FILE /D DLIB_CHECK_FOR_VERSION_MISMATCH=DLIB_VERSION_MISMATCH_CHECK__EXPECTED_VERSION_19_21_0 /D DLIB_JPEG_STATIC /D "CMAKE_INTDIR=\"Debug\"" /D _MBCS /Gm- /EHsc /RTC1 /MDd /GS /fp:precise /Zc:wchar_t /Zc:forScope /Zc:inline /GR /Fo"DLIB.DIR\DEBUG\\" /Fd"DLIB.DIR\DEBUG\DLIB.PDB" /Gd /TP  /bigobj C:\DLIB-19.21\SOURCE\DLIB\DIR_NAV\DIR_NAV_KERNEL_1.CPP
^C:\DLIB-19.21\SOURCE\DLIB\DIR_NAV\DIR_NAV_KERNEL_2.CPP
/c /I"C:\DLIB-19.21\SOURCE\DLIB\EXTERNAL\LIBPNG" /I"C:\DLIB-19.21\SOURCE\DLIB\EXTERNAL\ZLIB" /Zi /nologo /W3 /WX- /diagnostics:column /Od /Ob0 /D WIN32 /D _WINDOWS /D DLIB_HAVE_SSE2 /D DLIB_DISABLE_ASSERTS /D DLIB_JPEG_SUPPORT /D DLIB_PNG_SUPPORT /D DLIB__CMAKE_GENERATED_A_CONFIG_H_FILE /D DLIB_CHECK_FOR_VERSION_MISMATCH=DLIB_VERSION_MISMATCH_CHECK__EXPECTED_VERSION_19_21_0 /D DLIB_JPEG_STATIC /D "CMAKE_INTDIR=\"Debug\"" /D _MBCS /Gm- /EHsc /RTC1 /MDd /GS /fp:precise /Zc:wchar_t /Zc:forScope /Zc:inline /GR /Fo"DLIB.DIR\DEBUG\\" /Fd"DLIB.DIR\DEBUG\DLIB.PDB" /Gd /TP  /bigobj C:\DLIB-19.21\SOURCE\DLIB\DIR_NAV\DIR_NAV_KERNEL_2.CPP
^C:\DLIB-19.21\SOURCE\DLIB\DIR_NAV\DIR_NAV_EXTENSIONS.CPP
/c /I"C:\DLIB-19.21\SOURCE\DLIB\EXTERNAL\LIBPNG" /I"C:\DLIB-19.21\SOURCE\DLIB\EXTERNAL\ZLIB" /Zi /nologo /W3 /WX- /diagnostics:column /Od /Ob0 /D WIN32 /D _WINDOWS /D DLIB_HAVE_SSE2 /D DLIB_DISABLE_ASSERTS /D DLIB_JPEG_SUPPORT /D DLIB_PNG_SUPPORT /D DLIB__CMAKE_GENERATED_A_CONFIG_H_FILE /D DLIB_CHECK_FOR_VERSION_MISMATCH=DLIB_VERSION_MISMATCH_CHECK__EXPECTED_VERSION_19_21_0 /D DLIB_JPEG_STATIC /D "CMAKE_INTDIR=\"Debug\"" /D _MBCS /Gm- /EHsc /RTC1 /MDd /GS /fp:precise /Zc:wchar_t /Zc:forScope /Zc:inline /GR /Fo"DLIB.DIR\DEBUG\\" /Fd"DLIB.DIR\DEBUG\DLIB.PDB" /Gd /TP  /bigobj C:\DLIB-19.21\SOURCE\DLIB\DIR_NAV\DIR_NAV_EXTENSIONS.CPP
^C:\DLIB-19.21\SOURCE\DLIB\LINKER\LINKER_KERNEL_1.CPP
/c /I"C:\DLIB-19.21\SOURCE\DLIB\EXTERNAL\LIBPNG" /I"C:\DLIB-19.21\SOURCE\DLIB\EXTERNAL\ZLIB" /Zi /nologo /W3 /WX- /diagnostics:column /Od /Ob0 /D WIN32 /D _WINDOWS /D DLIB_HAVE_SSE2 /D DLIB_DISABLE_ASSERTS /D DLIB_JPEG_SUPPORT /D DLIB_PNG_SUPPORT /D DLIB__CMAKE_GENERATED_A_CONFIG_H_FILE /D DLIB_CHECK_FOR_VERSION_MISMATCH=DLIB_VERSION_MISMATCH_CHECK__EXPECTED_VERSION_19_21_0 /D DLIB_JPEG_STATIC /D "CMAKE_INTDIR=\"Debug\"" /D _MBCS /Gm- /EHsc /RTC1 /MDd /GS /fp:precise /Zc:wchar_t /Zc:forScope /Zc:inline /GR /Fo"DLIB.DIR\DEBUG\\" /Fd"DLIB.DIR\DEBUG\DLIB.PDB" /Gd /TP  /bigobj C:\DLIB-19.21\SOURCE\DLIB\LINKER\LINKER_KERNEL_1.CPP
^C:\DLIB-19.21\SOURCE\DLIB\LOGGER\EXTRA_LOGGER_HEADERS.CPP
/c /I"C:\DLIB-19.21\SOURCE\DLIB\EXTERNAL\LIBPNG" /I"C:\DLIB-19.21\SOURCE\DLIB\EXTERNAL\ZLIB" /Zi /nologo /W3 /WX- /diagnostics:column /Od /Ob0 /D WIN32 /D _WINDOWS /D DLIB_HAVE_SSE2 /D DLIB_DISABLE_ASSERTS /D DLIB_JPEG_SUPPORT /D DLIB_PNG_SUPPORT /D DLIB__CMAKE_GENERATED_A_CONFIG_H_FILE /D DLIB_CHECK_FOR_VERSION_MISMATCH=DLIB_VERSION_MISMATCH_CHECK__EXPECTED_VERSION_19_21_0 /D DLIB_JPEG_STATIC /D "CMAKE_INTDIR=\"Debug\"" /D _MBCS /Gm- /EHsc /RTC1 /MDd /GS /fp:precise /Zc:wchar_t /Zc:forScope /Zc:inline /GR /Fo"DLIB.DIR\DEBUG\\" /Fd"DLIB.DIR\DEBUG\DLIB.PDB" /Gd /TP  /bigobj C:\DLIB-19.21\SOURCE\DLIB\LOGGER\EXTRA_LOGGER_HEADERS.CPP
^C:\DLIB-19.21\SOURCE\DLIB\LOGGER\LOGGER_KERNEL_1.CPP
/c /I"C:\DLIB-19.21\SOURCE\DLIB\EXTERNAL\LIBPNG" /I"C:\DLIB-19.21\SOURCE\DLIB\EXTERNAL\ZLIB" /Zi /nologo /W3 /WX- /diagnostics:column /Od /Ob0 /D WIN32 /D _WINDOWS /D DLIB_HAVE_SSE2 /D DLIB_DISABLE_ASSERTS /D DLIB_JPEG_SUPPORT /D DLIB_PNG_SUPPORT /D DLIB__CMAKE_GENERATED_A_CONFIG_H_FILE /D DLIB_CHECK_FOR_VERSION_MISMATCH=DLIB_VERSION_MISMATCH_CHECK__EXPECTED_VERSION_19_21_0 /D DLIB_JPEG_STATIC /D "CMAKE_INTDIR=\"Debug\"" /D _MBCS /Gm- /EHsc /RTC1 /MDd /GS /fp:precise /Zc:wchar_t /Zc:forScope /Zc:inline /GR /Fo"DLIB.DIR\DEBUG\\" /Fd"DLIB.DIR\DEBUG\DLIB.PDB" /Gd /TP  /bigobj C:\DLIB-19.21\SOURCE\DLIB\LOGGER\LOGGER_KERNEL_1.CPP
^C:\DLIB-19.21\SOURCE\DLIB\LOGGER\LOGGER_CONFIG_FILE.CPP
/c /I"C:\DLIB-19.21\SOURCE\DLIB\EXTERNAL\LIBPNG" /I"C:\DLIB-19.21\SOURCE\DLIB\EXTERNAL\ZLIB" /Zi /nologo /W3 /WX- /diagnostics:column /Od /Ob0 /D WIN32 /D _WINDOWS /D DLIB_HAVE_SSE2 /D DLIB_DISABLE_ASSERTS /D DLIB_JPEG_SUPPORT /D DLIB_PNG_SUPPORT /D DLIB__CMAKE_GENERATED_A_CONFIG_H_FILE /D DLIB_CHECK_FOR_VERSION_MISMATCH=DLIB_VERSION_MISMATCH_CHECK__EXPECTED_VERSION_19_21_0 /D DLIB_JPEG_STATIC /D "CMAKE_INTDIR=\"Debug\"" /D _MBCS /Gm- /EHsc /RTC1 /MDd /GS /fp:precise /Zc:wchar_t /Zc:forScope /Zc:inline /GR /Fo"DLIB.DIR\DEBUG\\" /Fd"DLIB.DIR\DEBUG\DLIB.PDB" /Gd /TP  /bigobj C:\DLIB-19.21\SOURCE\DLIB\LOGGER\LOGGER_CONFIG_FILE.CPP
^C:\DLIB-19.21\SOURCE\DLIB\MISC_API\MISC_API_KERNEL_1.CPP
/c /I"C:\DLIB-19.21\SOURCE\DLIB\EXTERNAL\LIBPNG" /I"C:\DLIB-19.21\SOURCE\DLIB\EXTERNAL\ZLIB" /Zi /nologo /W3 /WX- /diagnostics:column /Od /Ob0 /D WIN32 /D _WINDOWS /D DLIB_HAVE_SSE2 /D DLIB_DISABLE_ASSERTS /D DLIB_JPEG_SUPPORT /D DLIB_PNG_SUPPORT /D DLIB__CMAKE_GENERATED_A_CONFIG_H_FILE /D DLIB_CHECK_FOR_VERSION_MISMATCH=DLIB_VERSION_MISMATCH_CHECK__EXPECTED_VERSION_19_21_0 /D DLIB_JPEG_STATIC /D "CMAKE_INTDIR=\"Debug\"" /D _MBCS /Gm- /EHsc /RTC1 /MDd /GS /fp:precise /Zc:wchar_t /Zc:forScope /Zc:inline /GR /Fo"DLIB.DIR\DEBUG\\" /Fd"DLIB.DIR\DEBUG\DLIB.PDB" /Gd /TP  /bigobj C:\DLIB-19.21\SOURCE\DLIB\MISC_API\MISC_API_KERNEL_1.CPP
^C:\DLIB-19.21\SOURCE\DLIB\MISC_API\MISC_API_KERNEL_2.CPP
/c /I"C:\DLIB-19.21\SOURCE\DLIB\EXTERNAL\LIBPNG" /I"C:\DLIB-19.21\SOURCE\DLIB\EXTERNAL\ZLIB" /Zi /nologo /W3 /WX- /diagnostics:column /Od /Ob0 /D WIN32 /D _WINDOWS /D DLIB_HAVE_SSE2 /D DLIB_DISABLE_ASSERTS /D DLIB_JPEG_SUPPORT /D DLIB_PNG_SUPPORT /D DLIB__CMAKE_GENERATED_A_CONFIG_H_FILE /D DLIB_CHECK_FOR_VERSION_MISMATCH=DLIB_VERSION_MISMATCH_CHECK__EXPECTED_VERSION_19_21_0 /D DLIB_JPEG_STATIC /D "CMAKE_INTDIR=\"Debug\"" /D _MBCS /Gm- /EHsc /RTC1 /MDd /GS /fp:precise /Zc:wchar_t /Zc:forScope /Zc:inline /GR /Fo"DLIB.DIR\DEBUG\\" /Fd"DLIB.DIR\DEBUG\DLIB.PDB" /Gd /TP  /bigobj C:\DLIB-19.21\SOURCE\DLIB\MISC_API\MISC_API_KERNEL_2.CPP
^C:\DLIB-19.21\SOURCE\DLIB\SOCKETS\SOCKETS_EXTENSIONS.CPP
/c /I"C:\DLIB-19.21\SOURCE\DLIB\EXTERNAL\LIBPNG" /I"C:\DLIB-19.21\SOURCE\DLIB\EXTERNAL\ZLIB" /Zi /nologo /W3 /WX- /diagnostics:column /Od /Ob0 /D WIN32 /D _WINDOWS /D DLIB_HAVE_SSE2 /D DLIB_DISABLE_ASSERTS /D DLIB_JPEG_SUPPORT /D DLIB_PNG_SUPPORT /D DLIB__CMAKE_GENERATED_A_CONFIG_H_FILE /D DLIB_CHECK_FOR_VERSION_MISMATCH=DLIB_VERSION_MISMATCH_CHECK__EXPECTED_VERSION_19_21_0 /D DLIB_JPEG_STATIC /D "CMAKE_INTDIR=\"Debug\"" /D _MBCS /Gm- /EHsc /RTC1 /MDd /GS /fp:precise /Zc:wchar_t /Zc:forScope /Zc:inline /GR /Fo"DLIB.DIR\DEBUG\\" /Fd"DLIB.DIR\DEBUG\DLIB.PDB" /Gd /TP  /bigobj C:\DLIB-19.21\SOURCE\DLIB\SOCKETS\SOCKETS_EXTENSIONS.CPP
^C:\DLIB-19.21\SOURCE\DLIB\SOCKETS\SOCKETS_KERNEL_2.CPP
/c /I"C:\DLIB-19.21\SOURCE\DLIB\EXTERNAL\LIBPNG" /I"C:\DLIB-19.21\SOURCE\DLIB\EXTERNAL\ZLIB" /Zi /nologo /W3 /WX- /diagnostics:column /Od /Ob0 /D WIN32 /D _WINDOWS /D DLIB_HAVE_SSE2 /D DLIB_DISABLE_ASSERTS /D DLIB_JPEG_SUPPORT /D DLIB_PNG_SUPPORT /D DLIB__CMAKE_GENERATED_A_CONFIG_H_FILE /D DLIB_CHECK_FOR_VERSION_MISMATCH=DLIB_VERSION_MISMATCH_CHECK__EXPECTED_VERSION_19_21_0 /D DLIB_JPEG_STATIC /D "CMAKE_INTDIR=\"Debug\"" /D _MBCS /Gm- /EHsc /RTC1 /MDd /GS /fp:precise /Zc:wchar_t /Zc:forScope /Zc:inline /GR /Fo"DLIB.DIR\DEBUG\\" /Fd"DLIB.DIR\DEBUG\DLIB.PDB" /Gd /TP  /bigobj C:\DLIB-19.21\SOURCE\DLIB\SOCKETS\SOCKETS_KERNEL_2.CPP
^C:\DLIB-19.21\SOURCE\DLIB\SOCKSTREAMBUF\SOCKSTREAMBUF.CPP
/c /I"C:\DLIB-19.21\SOURCE\DLIB\EXTERNAL\LIBPNG" /I"C:\DLIB-19.21\SOURCE\DLIB\EXTERNAL\ZLIB" /Zi /nologo /W3 /WX- /diagnostics:column /Od /Ob0 /D WIN32 /D _WINDOWS /D DLIB_HAVE_SSE2 /D DLIB_DISABLE_ASSERTS /D DLIB_JPEG_SUPPORT /D DLIB_PNG_SUPPORT /D DLIB__CMAKE_GENERATED_A_CONFIG_H_FILE /D DLIB_CHECK_FOR_VERSION_MISMATCH=DLIB_VERSION_MISMATCH_CHECK__EXPECTED_VERSION_19_21_0 /D DLIB_JPEG_STATIC /D "CMAKE_INTDIR=\"Debug\"" /D _MBCS /Gm- /EHsc /RTC1 /MDd /GS /fp:precise /Zc:wchar_t /Zc:forScope /Zc:inline /GR /Fo"DLIB.DIR\DEBUG\\" /Fd"DLIB.DIR\DEBUG\DLIB.PDB" /Gd /TP  /bigobj C:\DLIB-19.21\SOURCE\DLIB\SOCKSTREAMBUF\SOCKSTREAMBUF.CPP
^C:\DLIB-19.21\SOURCE\DLIB\SOCKSTREAMBUF\SOCKSTREAMBUF_UNBUFFERED.CPP
/c /I"C:\DLIB-19.21\SOURCE\DLIB\EXTERNAL\LIBPNG" /I"C:\DLIB-19.21\SOURCE\DLIB\EXTERNAL\ZLIB" /Zi /nologo /W3 /WX- /diagnostics:column /Od /Ob0 /D WIN32 /D _WINDOWS /D DLIB_HAVE_SSE2 /D DLIB_DISABLE_ASSERTS /D DLIB_JPEG_SUPPORT /D DLIB_PNG_SUPPORT /D DLIB__CMAKE_GENERATED_A_CONFIG_H_FILE /D DLIB_CHECK_FOR_VERSION_MISMATCH=DLIB_VERSION_MISMATCH_CHECK__EXPECTED_VERSION_19_21_0 /D DLIB_JPEG_STATIC /D "CMAKE_INTDIR=\"Debug\"" /D _MBCS /Gm- /EHsc /RTC1 /MDd /GS /fp:precise /Zc:wchar_t /Zc:forScope /Zc:inline /GR /Fo"DLIB.DIR\DEBUG\\" /Fd"DLIB.DIR\DEBUG\DLIB.PDB" /Gd /TP  /bigobj C:\DLIB-19.21\SOURCE\DLIB\SOCKSTREAMBUF\SOCKSTREAMBUF_UNBUFFERED.CPP
^C:\DLIB-19.21\SOURCE\DLIB\SERVER\SERVER_KERNEL.CPP
/c /I"C:\DLIB-19.21\SOURCE\DLIB\EXTERNAL\LIBPNG" /I"C:\DLIB-19.21\SOURCE\DLIB\EXTERNAL\ZLIB" /Zi /nologo /W3 /WX- /diagnostics:column /Od /Ob0 /D WIN32 /D _WINDOWS /D DLIB_HAVE_SSE2 /D DLIB_DISABLE_ASSERTS /D DLIB_JPEG_SUPPORT /D DLIB_PNG_SUPPORT /D DLIB__CMAKE_GENERATED_A_CONFIG_H_FILE /D DLIB_CHECK_FOR_VERSION_MISMATCH=DLIB_VERSION_MISMATCH_CHECK__EXPECTED_VERSION_19_21_0 /D DLIB_JPEG_STATIC /D "CMAKE_INTDIR=\"Debug\"" /D _MBCS /Gm- /EHsc /RTC1 /MDd /GS /fp:precise /Zc:wchar_t /Zc:forScope /Zc:inline /GR /Fo"DLIB.DIR\DEBUG\\" /Fd"DLIB.DIR\DEBUG\DLIB.PDB" /Gd /TP  /bigobj C:\DLIB-19.21\SOURCE\DLIB\SERVER\SERVER_KERNEL.CPP
^C:\DLIB-19.21\SOURCE\DLIB\SERVER\SERVER_IOSTREAM.CPP
/c /I"C:\DLIB-19.21\SOURCE\DLIB\EXTERNAL\LIBPNG" /I"C:\DLIB-19.21\SOURCE\DLIB\EXTERNAL\ZLIB" /Zi /nologo /W3 /WX- /diagnostics:column /Od /Ob0 /D WIN32 /D _WINDOWS /D DLIB_HAVE_SSE2 /D DLIB_DISABLE_ASSERTS /D DLIB_JPEG_SUPPORT /D DLIB_PNG_SUPPORT /D DLIB__CMAKE_GENERATED_A_CONFIG_H_FILE /D DLIB_CHECK_FOR_VERSION_MISMATCH=DLIB_VERSION_MISMATCH_CHECK__EXPECTED_VERSION_19_21_0 /D DLIB_JPEG_STATIC /D "CMAKE_INTDIR=\"Debug\"" /D _MBCS /Gm- /EHsc /RTC1 /MDd /GS /fp:precise /Zc:wchar_t /Zc:forScope /Zc:inline /GR /Fo"DLIB.DIR\DEBUG\\" /Fd"DLIB.DIR\DEBUG\DLIB.PDB" /Gd /TP  /bigobj C:\DLIB-19.21\SOURCE\DLIB\SERVER\SERVER_IOSTREAM.CPP
^C:\DLIB-19.21\SOURCE\DLIB\SERVER\SERVER_HTTP.CPP
/c /I"C:\DLIB-19.21\SOURCE\DLIB\EXTERNAL\LIBPNG" /I"C:\DLIB-19.21\SOURCE\DLIB\EXTERNAL\ZLIB" /Zi /nologo /W3 /WX- /diagnostics:column /Od /Ob0 /D WIN32 /D _WINDOWS /D DLIB_HAVE_SSE2 /D DLIB_DISABLE_ASSERTS /D DLIB_JPEG_SUPPORT /D DLIB_PNG_SUPPORT /D DLIB__CMAKE_GENERATED_A_CONFIG_H_FILE /D DLIB_CHECK_FOR_VERSION_MISMATCH=DLIB_VERSION_MISMATCH_CHECK__EXPECTED_VERSION_19_21_0 /D DLIB_JPEG_STATIC /D "CMAKE_INTDIR=\"Debug\"" /D _MBCS /Gm- /EHsc /RTC1 /MDd /GS /fp:precise /Zc:wchar_t /Zc:forScope /Zc:inline /GR /Fo"DLIB.DIR\DEBUG\\" /Fd"DLIB.DIR\DEBUG\DLIB.PDB" /Gd /TP  /bigobj C:\DLIB-19.21\SOURCE\DLIB\SERVER\SERVER_HTTP.CPP
^C:\DLIB-19.21\SOURCE\DLIB\THREADS\MULTITHREADED_OBJECT_EXTENSION.CPP
/c /I"C:\DLIB-19.21\SOURCE\DLIB\EXTERNAL\LIBPNG" /I"C:\DLIB-19.21\SOURCE\DLIB\EXTERNAL\ZLIB" /Zi /nologo /W3 /WX- /diagnostics:column /Od /Ob0 /D WIN32 /D _WINDOWS /D DLIB_HAVE_SSE2 /D DLIB_DISABLE_ASSERTS /D DLIB_JPEG_SUPPORT /D DLIB_PNG_SUPPORT /D DLIB__CMAKE_GENERATED_A_CONFIG_H_FILE /D DLIB_CHECK_FOR_VERSION_MISMATCH=DLIB_VERSION_MISMATCH_CHECK__EXPECTED_VERSION_19_21_0 /D DLIB_JPEG_STATIC /D "CMAKE_INTDIR=\"Debug\"" /D _MBCS /Gm- /EHsc /RTC1 /MDd /GS /fp:precise /Zc:wchar_t /Zc:forScope /Zc:inline /GR /Fo"DLIB.DIR\DEBUG\\" /Fd"DLIB.DIR\DEBUG\DLIB.PDB" /Gd /TP  /bigobj C:\DLIB-19.21\SOURCE\DLIB\THREADS\MULTITHREADED_OBJECT_EXTENSION.CPP
^C:\DLIB-19.21\SOURCE\DLIB\THREADS\THREADED_OBJECT_EXTENSION.CPP
/c /I"C:\DLIB-19.21\SOURCE\DLIB\EXTERNAL\LIBPNG" /I"C:\DLIB-19.21\SOURCE\DLIB\EXTERNAL\ZLIB" /Zi /nologo /W3 /WX- /diagnostics:column /Od /Ob0 /D WIN32 /D _WINDOWS /D DLIB_HAVE_SSE2 /D DLIB_DISABLE_ASSERTS /D DLIB_JPEG_SUPPORT /D DLIB_PNG_SUPPORT /D DLIB__CMAKE_GENERATED_A_CONFIG_H_FILE /D DLIB_CHECK_FOR_VERSION_MISMATCH=DLIB_VERSION_MISMATCH_CHECK__EXPECTED_VERSION_19_21_0 /D DLIB_JPEG_STATIC /D "CMAKE_INTDIR=\"Debug\"" /D _MBCS /Gm- /EHsc /RTC1 /MDd /GS /fp:precise /Zc:wchar_t /Zc:forScope /Zc:inline /GR /Fo"DLIB.DIR\DEBUG\\" /Fd"DLIB.DIR\DEBUG\DLIB.PDB" /Gd /TP  /bigobj C:\DLIB-19.21\SOURCE\DLIB\THREADS\THREADED_OBJECT_EXTENSION.CPP
^C:\DLIB-19.21\SOURCE\DLIB\THREADS\THREADS_KERNEL_1.CPP
/c /I"C:\DLIB-19.21\SOURCE\DLIB\EXTERNAL\LIBPNG" /I"C:\DLIB-19.21\SOURCE\DLIB\EXTERNAL\ZLIB" /Zi /nologo /W3 /WX- /diagnostics:column /Od /Ob0 /D WIN32 /D _WINDOWS /D DLIB_HAVE_SSE2 /D DLIB_DISABLE_ASSERTS /D DLIB_JPEG_SUPPORT /D DLIB_PNG_SUPPORT /D DLIB__CMAKE_GENERATED_A_CONFIG_H_FILE /D DLIB_CHECK_FOR_VERSION_MISMATCH=DLIB_VERSION_MISMATCH_CHECK__EXPECTED_VERSION_19_21_0 /D DLIB_JPEG_STATIC /D "CMAKE_INTDIR=\"Debug\"" /D _MBCS /Gm- /EHsc /RTC1 /MDd /GS /fp:precise /Zc:wchar_t /Zc:forScope /Zc:inline /GR /Fo"DLIB.DIR\DEBUG\\" /Fd"DLIB.DIR\DEBUG\DLIB.PDB" /Gd /TP  /bigobj C:\DLIB-19.21\SOURCE\DLIB\THREADS\THREADS_KERNEL_1.CPP
^C:\DLIB-19.21\SOURCE\DLIB\THREADS\THREADS_KERNEL_2.CPP
/c /I"C:\DLIB-19.21\SOURCE\DLIB\EXTERNAL\LIBPNG" /I"C:\DLIB-19.21\SOURCE\DLIB\EXTERNAL\ZLIB" /Zi /nologo /W3 /WX- /diagnostics:column /Od /Ob0 /D WIN32 /D _WINDOWS /D DLIB_HAVE_SSE2 /D DLIB_DISABLE_ASSERTS /D DLIB_JPEG_SUPPORT /D DLIB_PNG_SUPPORT /D DLIB__CMAKE_GENERATED_A_CONFIG_H_FILE /D DLIB_CHECK_FOR_VERSION_MISMATCH=DLIB_VERSION_MISMATCH_CHECK__EXPECTED_VERSION_19_21_0 /D DLIB_JPEG_STATIC /D "CMAKE_INTDIR=\"Debug\"" /D _MBCS /Gm- /EHsc /RTC1 /MDd /GS /fp:precise /Zc:wchar_t /Zc:forScope /Zc:inline /GR /Fo"DLIB.DIR\DEBUG\\" /Fd"DLIB.DIR\DEBUG\DLIB.PDB" /Gd /TP  /bigobj C:\DLIB-19.21\SOURCE\DLIB\THREADS\THREADS_KERNEL_2.CPP
^C:\DLIB-19.21\SOURCE\DLIB\THREADS\THREADS_KERNEL_SHARED.CPP
/c /I"C:\DLIB-19.21\SOURCE\DLIB\EXTERNAL\LIBPNG" /I"C:\DLIB-19.21\SOURCE\DLIB\EXTERNAL\ZLIB" /Zi /nologo /W3 /WX- /diagnostics:column /Od /Ob0 /D WIN32 /D _WINDOWS /D DLIB_HAVE_SSE2 /D DLIB_DISABLE_ASSERTS /D DLIB_JPEG_SUPPORT /D DLIB_PNG_SUPPORT /D DLIB__CMAKE_GENERATED_A_CONFIG_H_FILE /D DLIB_CHECK_FOR_VERSION_MISMATCH=DLIB_VERSION_MISMATCH_CHECK__EXPECTED_VERSION_19_21_0 /D DLIB_JPEG_STATIC /D "CMAKE_INTDIR=\"Debug\"" /D _MBCS /Gm- /EHsc /RTC1 /MDd /GS /fp:precise /Zc:wchar_t /Zc:forScope /Zc:inline /GR /Fo"DLIB.DIR\DEBUG\\" /Fd"DLIB.DIR\DEBUG\DLIB.PDB" /Gd /TP  /bigobj C:\DLIB-19.21\SOURCE\DLIB\THREADS\THREADS_KERNEL_SHARED.CPP
^C:\DLIB-19.21\SOURCE\DLIB\THREADS\THREAD_POOL_EXTENSION.CPP
/c /I"C:\DLIB-19.21\SOURCE\DLIB\EXTERNAL\LIBPNG" /I"C:\DLIB-19.21\SOURCE\DLIB\EXTERNAL\ZLIB" /Zi /nologo /W3 /WX- /diagnostics:column /Od /Ob0 /D WIN32 /D _WINDOWS /D DLIB_HAVE_SSE2 /D DLIB_DISABLE_ASSERTS /D DLIB_JPEG_SUPPORT /D DLIB_PNG_SUPPORT /D DLIB__CMAKE_GENERATED_A_CONFIG_H_FILE /D DLIB_CHECK_FOR_VERSION_MISMATCH=DLIB_VERSION_MISMATCH_CHECK__EXPECTED_VERSION_19_21_0 /D DLIB_JPEG_STATIC /D "CMAKE_INTDIR=\"Debug\"" /D _MBCS /Gm- /EHsc /RTC1 /MDd /GS /fp:precise /Zc:wchar_t /Zc:forScope /Zc:inline /GR /Fo"DLIB.DIR\DEBUG\\" /Fd"DLIB.DIR\DEBUG\DLIB.PDB" /Gd /TP  /bigobj C:\DLIB-19.21\SOURCE\DLIB\THREADS\THREAD_POOL_EXTENSION.CPP
^C:\DLIB-19.21\SOURCE\DLIB\THREADS\ASYNC.CPP
/c /I"C:\DLIB-19.21\SOURCE\DLIB\EXTERNAL\LIBPNG" /I"C:\DLIB-19.21\SOURCE\DLIB\EXTERNAL\ZLIB" /Zi /nologo /W3 /WX- /diagnostics:column /Od /Ob0 /D WIN32 /D _WINDOWS /D DLIB_HAVE_SSE2 /D DLIB_DISABLE_ASSERTS /D DLIB_JPEG_SUPPORT /D DLIB_PNG_SUPPORT /D DLIB__CMAKE_GENERATED_A_CONFIG_H_FILE /D DLIB_CHECK_FOR_VERSION_MISMATCH=DLIB_VERSION_MISMATCH_CHECK__EXPECTED_VERSION_19_21_0 /D DLIB_JPEG_STATIC /D "CMAKE_INTDIR=\"Debug\"" /D _MBCS /Gm- /EHsc /RTC1 /MDd /GS /fp:precise /Zc:wchar_t /Zc:forScope /Zc:inline /GR /Fo"DLIB.DIR\DEBUG\\" /Fd"DLIB.DIR\DEBUG\DLIB.PDB" /Gd /TP  /bigobj C:\DLIB-19.21\SOURCE\DLIB\THREADS\ASYNC.CPP
^C:\DLIB-19.21\SOURCE\DLIB\TIMER\TIMER.CPP
/c /I"C:\DLIB-19.21\SOURCE\DLIB\EXTERNAL\LIBPNG" /I"C:\DLIB-19.21\SOURCE\DLIB\EXTERNAL\ZLIB" /Zi /nologo /W3 /WX- /diagnostics:column /Od /Ob0 /D WIN32 /D _WINDOWS /D DLIB_HAVE_SSE2 /D DLIB_DISABLE_ASSERTS /D DLIB_JPEG_SUPPORT /D DLIB_PNG_SUPPORT /D DLIB__CMAKE_GENERATED_A_CONFIG_H_FILE /D DLIB_CHECK_FOR_VERSION_MISMATCH=DLIB_VERSION_MISMATCH_CHECK__EXPECTED_VERSION_19_21_0 /D DLIB_JPEG_STATIC /D "CMAKE_INTDIR=\"Debug\"" /D _MBCS /Gm- /EHsc /RTC1 /MDd /GS /fp:precise /Zc:wchar_t /Zc:forScope /Zc:inline /GR /Fo"DLIB.DIR\DEBUG\\" /Fd"DLIB.DIR\DEBUG\DLIB.PDB" /Gd /TP  /bigobj C:\DLIB-19.21\SOURCE\DLIB\TIMER\TIMER.CPP
^C:\DLIB-19.21\SOURCE\DLIB\STACK_TRACE.CPP
/c /I"C:\DLIB-19.21\SOURCE\DLIB\EXTERNAL\LIBPNG" /I"C:\DLIB-19.21\SOURCE\DLIB\EXTERNAL\ZLIB" /Zi /nologo /W3 /WX- /diagnostics:column /Od /Ob0 /D WIN32 /D _WINDOWS /D DLIB_HAVE_SSE2 /D DLIB_DISABLE_ASSERTS /D DLIB_JPEG_SUPPORT /D DLIB_PNG_SUPPORT /D DLIB__CMAKE_GENERATED_A_CONFIG_H_FILE /D DLIB_CHECK_FOR_VERSION_MISMATCH=DLIB_VERSION_MISMATCH_CHECK__EXPECTED_VERSION_19_21_0 /D DLIB_JPEG_STATIC /D "CMAKE_INTDIR=\"Debug\"" /D _MBCS /Gm- /EHsc /RTC1 /MDd /GS /fp:precise /Zc:wchar_t /Zc:forScope /Zc:inline /GR /Fo"DLIB.DIR\DEBUG\\" /Fd"DLIB.DIR\DEBUG\DLIB.PDB" /Gd /TP  /bigobj C:\DLIB-19.21\SOURCE\DLIB\STACK_TRACE.CPP
^C:\DLIB-19.21\SOURCE\DLIB\CUDA\CPU_DLIB.CPP
/c /I"C:\DLIB-19.21\SOURCE\DLIB\EXTERNAL\LIBPNG" /I"C:\DLIB-19.21\SOURCE\DLIB\EXTERNAL\ZLIB" /Zi /nologo /W3 /WX- /diagnostics:column /Od /Ob0 /D WIN32 /D _WINDOWS /D DLIB_HAVE_SSE2 /D DLIB_DISABLE_ASSERTS /D DLIB_JPEG_SUPPORT /D DLIB_PNG_SUPPORT /D DLIB__CMAKE_GENERATED_A_CONFIG_H_FILE /D DLIB_CHECK_FOR_VERSION_MISMATCH=DLIB_VERSION_MISMATCH_CHECK__EXPECTED_VERSION_19_21_0 /D DLIB_JPEG_STATIC /D "CMAKE_INTDIR=\"Debug\"" /D _MBCS /Gm- /EHsc /RTC1 /MDd /GS /fp:precise /Zc:wchar_t /Zc:forScope /Zc:inline /GR /Fo"DLIB.DIR\DEBUG\\" /Fd"DLIB.DIR\DEBUG\DLIB.PDB" /Gd /TP  /bigobj C:\DLIB-19.21\SOURCE\DLIB\CUDA\CPU_DLIB.CPP
^C:\DLIB-19.21\SOURCE\DLIB\CUDA\TENSOR_TOOLS.CPP
/c /I"C:\DLIB-19.21\SOURCE\DLIB\EXTERNAL\LIBPNG" /I"C:\DLIB-19.21\SOURCE\DLIB\EXTERNAL\ZLIB" /Zi /nologo /W3 /WX- /diagnostics:column /Od /Ob0 /D WIN32 /D _WINDOWS /D DLIB_HAVE_SSE2 /D DLIB_DISABLE_ASSERTS /D DLIB_JPEG_SUPPORT /D DLIB_PNG_SUPPORT /D DLIB__CMAKE_GENERATED_A_CONFIG_H_FILE /D DLIB_CHECK_FOR_VERSION_MISMATCH=DLIB_VERSION_MISMATCH_CHECK__EXPECTED_VERSION_19_21_0 /D DLIB_JPEG_STATIC /D "CMAKE_INTDIR=\"Debug\"" /D _MBCS /Gm- /EHsc /RTC1 /MDd /GS /fp:precise /Zc:wchar_t /Zc:forScope /Zc:inline /GR /Fo"DLIB.DIR\DEBUG\\" /Fd"DLIB.DIR\DEBUG\DLIB.PDB" /Gd /TP  /bigobj C:\DLIB-19.21\SOURCE\DLIB\CUDA\TENSOR_TOOLS.CPP
^C:\DLIB-19.21\SOURCE\DLIB\DATA_IO\IMAGE_DATASET_METADATA.CPP
/c /I"C:\DLIB-19.21\SOURCE\DLIB\EXTERNAL\LIBPNG" /I"C:\DLIB-19.21\SOURCE\DLIB\EXTERNAL\ZLIB" /Zi /nologo /W3 /WX- /diagnostics:column /Od /Ob0 /D WIN32 /D _WINDOWS /D DLIB_HAVE_SSE2 /D DLIB_DISABLE_ASSERTS /D DLIB_JPEG_SUPPORT /D DLIB_PNG_SUPPORT /D DLIB__CMAKE_GENERATED_A_CONFIG_H_FILE /D DLIB_CHECK_FOR_VERSION_MISMATCH=DLIB_VERSION_MISMATCH_CHECK__EXPECTED_VERSION_19_21_0 /D DLIB_JPEG_STATIC /D "CMAKE_INTDIR=\"Debug\"" /D _MBCS /Gm- /EHsc /RTC1 /MDd /GS /fp:precise /Zc:wchar_t /Zc:forScope /Zc:inline /GR /Fo"DLIB.DIR\DEBUG\\" /Fd"DLIB.DIR\DEBUG\DLIB.PDB" /Gd /TP  /bigobj C:\DLIB-19.21\SOURCE\DLIB\DATA_IO\IMAGE_DATASET_METADATA.CPP
^C:\DLIB-19.21\SOURCE\DLIB\DATA_IO\MNIST.CPP
/c /I"C:\DLIB-19.21\SOURCE\DLIB\EXTERNAL\LIBPNG" /I"C:\DLIB-19.21\SOURCE\DLIB\EXTERNAL\ZLIB" /Zi /nologo /W3 /WX- /diagnostics:column /Od /Ob0 /D WIN32 /D _WINDOWS /D DLIB_HAVE_SSE2 /D DLIB_DISABLE_ASSERTS /D DLIB_JPEG_SUPPORT /D DLIB_PNG_SUPPORT /D DLIB__CMAKE_GENERATED_A_CONFIG_H_FILE /D DLIB_CHECK_FOR_VERSION_MISMATCH=DLIB_VERSION_MISMATCH_CHECK__EXPECTED_VERSION_19_21_0 /D DLIB_JPEG_STATIC /D "CMAKE_INTDIR=\"Debug\"" /D _MBCS /Gm- /EHsc /RTC1 /MDd /GS /fp:precise /Zc:wchar_t /Zc:forScope /Zc:inline /GR /Fo"DLIB.DIR\DEBUG\\" /Fd"DLIB.DIR\DEBUG\DLIB.PDB" /Gd /TP  /bigobj C:\DLIB-19.21\SOURCE\DLIB\DATA_IO\MNIST.CPP
^C:\DLIB-19.21\SOURCE\DLIB\GLOBAL_OPTIMIZATION\GLOBAL_FUNCTION_SEARCH.CPP
/c /I"C:\DLIB-19.21\SOURCE\DLIB\EXTERNAL\LIBPNG" /I"C:\DLIB-19.21\SOURCE\DLIB\EXTERNAL\ZLIB" /Zi /nologo /W3 /WX- /diagnostics:column /Od /Ob0 /D WIN32 /D _WINDOWS /D DLIB_HAVE_SSE2 /D DLIB_DISABLE_ASSERTS /D DLIB_JPEG_SUPPORT /D DLIB_PNG_SUPPORT /D DLIB__CMAKE_GENERATED_A_CONFIG_H_FILE /D DLIB_CHECK_FOR_VERSION_MISMATCH=DLIB_VERSION_MISMATCH_CHECK__EXPECTED_VERSION_19_21_0 /D DLIB_JPEG_STATIC /D "CMAKE_INTDIR=\"Debug\"" /D _MBCS /Gm- /EHsc /RTC1 /MDd /GS /fp:precise /Zc:wchar_t /Zc:forScope /Zc:inline /GR /Fo"DLIB.DIR\DEBUG\\" /Fd"DLIB.DIR\DEBUG\DLIB.PDB" /Gd /TP  /bigobj C:\DLIB-19.21\SOURCE\DLIB\GLOBAL_OPTIMIZATION\GLOBAL_FUNCTION_SEARCH.CPP
^C:\DLIB-19.21\SOURCE\DLIB\FILTERING\KALMAN_FILTER.CPP
/c /I"C:\DLIB-19.21\SOURCE\DLIB\EXTERNAL\LIBPNG" /I"C:\DLIB-19.21\SOURCE\DLIB\EXTERNAL\ZLIB" /Zi /nologo /W3 /WX- /diagnostics:column /Od /Ob0 /D WIN32 /D _WINDOWS /D DLIB_HAVE_SSE2 /D DLIB_DISABLE_ASSERTS /D DLIB_JPEG_SUPPORT /D DLIB_PNG_SUPPORT /D DLIB__CMAKE_GENERATED_A_CONFIG_H_FILE /D DLIB_CHECK_FOR_VERSION_MISMATCH=DLIB_VERSION_MISMATCH_CHECK__EXPECTED_VERSION_19_21_0 /D DLIB_JPEG_STATIC /D "CMAKE_INTDIR=\"Debug\"" /D _MBCS /Gm- /EHsc /RTC1 /MDd /GS /fp:precise /Zc:wchar_t /Zc:forScope /Zc:inline /GR /Fo"DLIB.DIR\DEBUG\\" /Fd"DLIB.DIR\DEBUG\DLIB.PDB" /Gd /TP  /bigobj C:\DLIB-19.21\SOURCE\DLIB\FILTERING\KALMAN_FILTER.CPP
^C:\DLIB-19.21\SOURCE\DLIB\SVM\AUTO.CPP
/c /I"C:\DLIB-19.21\SOURCE\DLIB\EXTERNAL\LIBPNG" /I"C:\DLIB-19.21\SOURCE\DLIB\EXTERNAL\ZLIB" /Zi /nologo /W3 /WX- /diagnostics:column /Od /Ob0 /D WIN32 /D _WINDOWS /D DLIB_HAVE_SSE2 /D DLIB_DISABLE_ASSERTS /D DLIB_JPEG_SUPPORT /D DLIB_PNG_SUPPORT /D DLIB__CMAKE_GENERATED_A_CONFIG_H_FILE /D DLIB_CHECK_FOR_VERSION_MISMATCH=DLIB_VERSION_MISMATCH_CHECK__EXPECTED_VERSION_19_21_0 /D DLIB_JPEG_STATIC /D "CMAKE_INTDIR=\"Debug\"" /D _MBCS /Gm- /EHsc /RTC1 /MDd /GS /fp:precise /Zc:wchar_t /Zc:forScope /Zc:inline /GR /Fo"DLIB.DIR\DEBUG\\" /Fd"DLIB.DIR\DEBUG\DLIB.PDB" /Gd /TP  /bigobj C:\DLIB-19.21\SOURCE\DLIB\SVM\AUTO.CPP
^C:\DLIB-19.21\SOURCE\DLIB\GUI_WIDGETS\FONTS.CPP
/c /I"C:\DLIB-19.21\SOURCE\DLIB\EXTERNAL\LIBPNG" /I"C:\DLIB-19.21\SOURCE\DLIB\EXTERNAL\ZLIB" /Zi /nologo /W3 /WX- /diagnostics:column /Od /Ob0 /D WIN32 /D _WINDOWS /D DLIB_HAVE_SSE2 /D DLIB_DISABLE_ASSERTS /D DLIB_JPEG_SUPPORT /D DLIB_PNG_SUPPORT /D DLIB__CMAKE_GENERATED_A_CONFIG_H_FILE /D DLIB_CHECK_FOR_VERSION_MISMATCH=DLIB_VERSION_MISMATCH_CHECK__EXPECTED_VERSION_19_21_0 /D DLIB_JPEG_STATIC /D "CMAKE_INTDIR=\"Debug\"" /D _MBCS /Gm- /EHsc /RTC1 /MDd /GS /fp:precise /Zc:wchar_t /Zc:forScope /Zc:inline /GR /Fo"DLIB.DIR\DEBUG\\" /Fd"DLIB.DIR\DEBUG\DLIB.PDB" /Gd /TP  /bigobj C:\DLIB-19.21\SOURCE\DLIB\GUI_WIDGETS\FONTS.CPP
^C:\DLIB-19.21\SOURCE\DLIB\GUI_WIDGETS\WIDGETS.CPP
/c /I"C:\DLIB-19.21\SOURCE\DLIB\EXTERNAL\LIBPNG" /I"C:\DLIB-19.21\SOURCE\DLIB\EXTERNAL\ZLIB" /Zi /nologo /W3 /WX- /diagnostics:column /Od /Ob0 /D WIN32 /D _WINDOWS /D DLIB_HAVE_SSE2 /D DLIB_DISABLE_ASSERTS /D DLIB_JPEG_SUPPORT /D DLIB_PNG_SUPPORT /D DLIB__CMAKE_GENERATED_A_CONFIG_H_FILE /D DLIB_CHECK_FOR_VERSION_MISMATCH=DLIB_VERSION_MISMATCH_CHECK__EXPECTED_VERSION_19_21_0 /D DLIB_JPEG_STATIC /D "CMAKE_INTDIR=\"Debug\"" /D _MBCS /Gm- /EHsc /RTC1 /MDd /GS /fp:precise /Zc:wchar_t /Zc:forScope /Zc:inline /GR /Fo"DLIB.DIR\DEBUG\\" /Fd"DLIB.DIR\DEBUG\DLIB.PDB" /Gd /TP  /bigobj C:\DLIB-19.21\SOURCE\DLIB\GUI_WIDGETS\WIDGETS.CPP
^C:\DLIB-19.21\SOURCE\DLIB\GUI_WIDGETS\DRAWABLE.CPP
/c /I"C:\DLIB-19.21\SOURCE\DLIB\EXTERNAL\LIBPNG" /I"C:\DLIB-19.21\SOURCE\DLIB\EXTERNAL\ZLIB" /Zi /nologo /W3 /WX- /diagnostics:column /Od /Ob0 /D WIN32 /D _WINDOWS /D DLIB_HAVE_SSE2 /D DLIB_DISABLE_ASSERTS /D DLIB_JPEG_SUPPORT /D DLIB_PNG_SUPPORT /D DLIB__CMAKE_GENERATED_A_CONFIG_H_FILE /D DLIB_CHECK_FOR_VERSION_MISMATCH=DLIB_VERSION_MISMATCH_CHECK__EXPECTED_VERSION_19_21_0 /D DLIB_JPEG_STATIC /D "CMAKE_INTDIR=\"Debug\"" /D _MBCS /Gm- /EHsc /RTC1 /MDd /GS /fp:precise /Zc:wchar_t /Zc:forScope /Zc:inline /GR /Fo"DLIB.DIR\DEBUG\\" /Fd"DLIB.DIR\DEBUG\DLIB.PDB" /Gd /TP  /bigobj C:\DLIB-19.21\SOURCE\DLIB\GUI_WIDGETS\DRAWABLE.CPP
^C:\DLIB-19.21\SOURCE\DLIB\GUI_WIDGETS\CANVAS_DRAWING.CPP
/c /I"C:\DLIB-19.21\SOURCE\DLIB\EXTERNAL\LIBPNG" /I"C:\DLIB-19.21\SOURCE\DLIB\EXTERNAL\ZLIB" /Zi /nologo /W3 /WX- /diagnostics:column /Od /Ob0 /D WIN32 /D _WINDOWS /D DLIB_HAVE_SSE2 /D DLIB_DISABLE_ASSERTS /D DLIB_JPEG_SUPPORT /D DLIB_PNG_SUPPORT /D DLIB__CMAKE_GENERATED_A_CONFIG_H_FILE /D DLIB_CHECK_FOR_VERSION_MISMATCH=DLIB_VERSION_MISMATCH_CHECK__EXPECTED_VERSION_19_21_0 /D DLIB_JPEG_STATIC /D "CMAKE_INTDIR=\"Debug\"" /D _MBCS /Gm- /EHsc /RTC1 /MDd /GS /fp:precise /Zc:wchar_t /Zc:forScope /Zc:inline /GR /Fo"DLIB.DIR\DEBUG\\" /Fd"DLIB.DIR\DEBUG\DLIB.PDB" /Gd /TP  /bigobj C:\DLIB-19.21\SOURCE\DLIB\GUI_WIDGETS\CANVAS_DRAWING.CPP
^C:\DLIB-19.21\SOURCE\DLIB\GUI_WIDGETS\STYLE.CPP
/c /I"C:\DLIB-19.21\SOURCE\DLIB\EXTERNAL\LIBPNG" /I"C:\DLIB-19.21\SOURCE\DLIB\EXTERNAL\ZLIB" /Zi /nologo /W3 /WX- /diagnostics:column /Od /Ob0 /D WIN32 /D _WINDOWS /D DLIB_HAVE_SSE2 /D DLIB_DISABLE_ASSERTS /D DLIB_JPEG_SUPPORT /D DLIB_PNG_SUPPORT /D DLIB__CMAKE_GENERATED_A_CONFIG_H_FILE /D DLIB_CHECK_FOR_VERSION_MISMATCH=DLIB_VERSION_MISMATCH_CHECK__EXPECTED_VERSION_19_21_0 /D DLIB_JPEG_STATIC /D "CMAKE_INTDIR=\"Debug\"" /D _MBCS /Gm- /EHsc /RTC1 /MDd /GS /fp:precise /Zc:wchar_t /Zc:forScope /Zc:inline /GR /Fo"DLIB.DIR\DEBUG\\" /Fd"DLIB.DIR\DEBUG\DLIB.PDB" /Gd /TP  /bigobj C:\DLIB-19.21\SOURCE\DLIB\GUI_WIDGETS\STYLE.CPP
^C:\DLIB-19.21\SOURCE\DLIB\GUI_WIDGETS\BASE_WIDGETS.CPP
/c /I"C:\DLIB-19.21\SOURCE\DLIB\EXTERNAL\LIBPNG" /I"C:\DLIB-19.21\SOURCE\DLIB\EXTERNAL\ZLIB" /Zi /nologo /W3 /WX- /diagnostics:column /Od /Ob0 /D WIN32 /D _WINDOWS /D DLIB_HAVE_SSE2 /D DLIB_DISABLE_ASSERTS /D DLIB_JPEG_SUPPORT /D DLIB_PNG_SUPPORT /D DLIB__CMAKE_GENERATED_A_CONFIG_H_FILE /D DLIB_CHECK_FOR_VERSION_MISMATCH=DLIB_VERSION_MISMATCH_CHECK__EXPECTED_VERSION_19_21_0 /D DLIB_JPEG_STATIC /D "CMAKE_INTDIR=\"Debug\"" /D _MBCS /Gm- /EHsc /RTC1 /MDd /GS /fp:precise /Zc:wchar_t /Zc:forScope /Zc:inline /GR /Fo"DLIB.DIR\DEBUG\\" /Fd"DLIB.DIR\DEBUG\DLIB.PDB" /Gd /TP  /bigobj C:\DLIB-19.21\SOURCE\DLIB\GUI_WIDGETS\BASE_WIDGETS.CPP
^C:\DLIB-19.21\SOURCE\DLIB\GUI_CORE\GUI_CORE_KERNEL_1.CPP
/c /I"C:\DLIB-19.21\SOURCE\DLIB\EXTERNAL\LIBPNG" /I"C:\DLIB-19.21\SOURCE\DLIB\EXTERNAL\ZLIB" /Zi /nologo /W3 /WX- /diagnostics:column /Od /Ob0 /D WIN32 /D _WINDOWS /D DLIB_HAVE_SSE2 /D DLIB_DISABLE_ASSERTS /D DLIB_JPEG_SUPPORT /D DLIB_PNG_SUPPORT /D DLIB__CMAKE_GENERATED_A_CONFIG_H_FILE /D DLIB_CHECK_FOR_VERSION_MISMATCH=DLIB_VERSION_MISMATCH_CHECK__EXPECTED_VERSION_19_21_0 /D DLIB_JPEG_STATIC /D "CMAKE_INTDIR=\"Debug\"" /D _MBCS /Gm- /EHsc /RTC1 /MDd /GS /fp:precise /Zc:wchar_t /Zc:forScope /Zc:inline /GR /Fo"DLIB.DIR\DEBUG\\" /Fd"DLIB.DIR\DEBUG\DLIB.PDB" /Gd /TP  /bigobj C:\DLIB-19.21\SOURCE\DLIB\GUI_CORE\GUI_CORE_KERNEL_1.CPP
^C:\DLIB-19.21\SOURCE\DLIB\GUI_CORE\GUI_CORE_KERNEL_2.CPP
/c /I"C:\DLIB-19.21\SOURCE\DLIB\EXTERNAL\LIBPNG" /I"C:\DLIB-19.21\SOURCE\DLIB\EXTERNAL\ZLIB" /Zi /nologo /W3 /WX- /diagnostics:column /Od /Ob0 /D WIN32 /D _WINDOWS /D DLIB_HAVE_SSE2 /D DLIB_DISABLE_ASSERTS /D DLIB_JPEG_SUPPORT /D DLIB_PNG_SUPPORT /D DLIB__CMAKE_GENERATED_A_CONFIG_H_FILE /D DLIB_CHECK_FOR_VERSION_MISMATCH=DLIB_VERSION_MISMATCH_CHECK__EXPECTED_VERSION_19_21_0 /D DLIB_JPEG_STATIC /D "CMAKE_INTDIR=\"Debug\"" /D _MBCS /Gm- /EHsc /RTC1 /MDd /GS /fp:precise /Zc:wchar_t /Zc:forScope /Zc:inline /GR /Fo"DLIB.DIR\DEBUG\\" /Fd"DLIB.DIR\DEBUG\DLIB.PDB" /Gd /TP  /bigobj C:\DLIB-19.21\SOURCE\DLIB\GUI_CORE\GUI_CORE_KERNEL_2.CPP
^C:\DLIB-19.21\SOURCE\DLIB\IMAGE_LOADER\PNG_LOADER.CPP
/c /I"C:\DLIB-19.21\SOURCE\DLIB\EXTERNAL\LIBPNG" /I"C:\DLIB-19.21\SOURCE\DLIB\EXTERNAL\ZLIB" /Zi /nologo /W3 /WX- /diagnostics:column /Od /Ob0 /D WIN32 /D _WINDOWS /D DLIB_HAVE_SSE2 /D DLIB_DISABLE_ASSERTS /D DLIB_JPEG_SUPPORT /D DLIB_PNG_SUPPORT /D DLIB__CMAKE_GENERATED_A_CONFIG_H_FILE /D DLIB_CHECK_FOR_VERSION_MISMATCH=DLIB_VERSION_MISMATCH_CHECK__EXPECTED_VERSION_19_21_0 /D DLIB_JPEG_STATIC /D "CMAKE_INTDIR=\"Debug\"" /D _MBCS /Gm- /EHsc /RTC1 /MDd /GS /fp:precise /Zc:wchar_t /Zc:forScope /Zc:inline /GR /Fo"DLIB.DIR\DEBUG\\" /Fd"DLIB.DIR\DEBUG\DLIB.PDB" /Gd /TP  /bigobj C:\DLIB-19.21\SOURCE\DLIB\IMAGE_LOADER\PNG_LOADER.CPP
^C:\DLIB-19.21\SOURCE\DLIB\IMAGE_SAVER\SAVE_PNG.CPP
/c /I"C:\DLIB-19.21\SOURCE\DLIB\EXTERNAL\LIBPNG" /I"C:\DLIB-19.21\SOURCE\DLIB\EXTERNAL\ZLIB" /Zi /nologo /W3 /WX- /diagnostics:column /Od /Ob0 /D WIN32 /D _WINDOWS /D DLIB_HAVE_SSE2 /D DLIB_DISABLE_ASSERTS /D DLIB_JPEG_SUPPORT /D DLIB_PNG_SUPPORT /D DLIB__CMAKE_GENERATED_A_CONFIG_H_FILE /D DLIB_CHECK_FOR_VERSION_MISMATCH=DLIB_VERSION_MISMATCH_CHECK__EXPECTED_VERSION_19_21_0 /D DLIB_JPEG_STATIC /D "CMAKE_INTDIR=\"Debug\"" /D _MBCS /Gm- /EHsc /RTC1 /MDd /GS /fp:precise /Zc:wchar_t /Zc:forScope /Zc:inline /GR /Fo"DLIB.DIR\DEBUG\\" /Fd"DLIB.DIR\DEBUG\DLIB.PDB" /Gd /TP  /bigobj C:\DLIB-19.21\SOURCE\DLIB\IMAGE_SAVER\SAVE_PNG.CPP
^C:\DLIB-19.21\SOURCE\DLIB\IMAGE_LOADER\JPEG_LOADER.CPP
/c /I"C:\DLIB-19.21\SOURCE\DLIB\EXTERNAL\LIBPNG" /I"C:\DLIB-19.21\SOURCE\DLIB\EXTERNAL\ZLIB" /Zi /nologo /W3 /WX- /diagnostics:column /Od /Ob0 /D WIN32 /D _WINDOWS /D DLIB_HAVE_SSE2 /D DLIB_DISABLE_ASSERTS /D DLIB_JPEG_SUPPORT /D DLIB_PNG_SUPPORT /D DLIB__CMAKE_GENERATED_A_CONFIG_H_FILE /D DLIB_CHECK_FOR_VERSION_MISMATCH=DLIB_VERSION_MISMATCH_CHECK__EXPECTED_VERSION_19_21_0 /D DLIB_JPEG_STATIC /D "CMAKE_INTDIR=\"Debug\"" /D _MBCS /Gm- /EHsc /RTC1 /MDd /GS /fp:precise /Zc:wchar_t /Zc:forScope /Zc:inline /GR /Fo"DLIB.DIR\DEBUG\\" /Fd"DLIB.DIR\DEBUG\DLIB.PDB" /Gd /TP  /bigobj C:\DLIB-19.21\SOURCE\DLIB\IMAGE_LOADER\JPEG_LOADER.CPP
^C:\DLIB-19.21\SOURCE\DLIB\IMAGE_SAVER\SAVE_JPEG.CPP
/c /I"C:\DLIB-19.21\SOURCE\DLIB\EXTERNAL\LIBPNG" /I"C:\DLIB-19.21\SOURCE\DLIB\EXTERNAL\ZLIB" /Zi /nologo /W3 /WX- /diagnostics:column /Od /Ob0 /D WIN32 /D _WINDOWS /D DLIB_HAVE_SSE2 /D DLIB_DISABLE_ASSERTS /D DLIB_JPEG_SUPPORT /D DLIB_PNG_SUPPORT /D DLIB__CMAKE_GENERATED_A_CONFIG_H_FILE /D DLIB_CHECK_FOR_VERSION_MISMATCH=DLIB_VERSION_MISMATCH_CHECK__EXPECTED_VERSION_19_21_0 /D DLIB_JPEG_STATIC /D "CMAKE_INTDIR=\"Debug\"" /D _MBCS /Gm- /EHsc /RTC1 /MDd /GS /fp:precise /Zc:wchar_t /Zc:forScope /Zc:inline /GR /Fo"DLIB.DIR\DEBUG\\" /Fd"DLIB.DIR\DEBUG\DLIB.PDB" /Gd /TP  /bigobj C:\DLIB-19.21\SOURCE\DLIB\IMAGE_SAVER\SAVE_JPEG.CPP
^C:\DLIB-19.21\SOURCE\DLIB\EXTERNAL\LIBPNG\ARM\ARM_INIT.C
/c /I"C:\DLIB-19.21\SOURCE\DLIB\EXTERNAL\LIBPNG" /I"C:\DLIB-19.21\SOURCE\DLIB\EXTERNAL\ZLIB" /Zi /nologo /W3 /WX- /diagnostics:column /Od /Ob0 /D WIN32 /D _WINDOWS /D DLIB_HAVE_SSE2 /D DLIB_DISABLE_ASSERTS /D DLIB_JPEG_SUPPORT /D DLIB_PNG_SUPPORT /D DLIB__CMAKE_GENERATED_A_CONFIG_H_FILE /D DLIB_CHECK_FOR_VERSION_MISMATCH=DLIB_VERSION_MISMATCH_CHECK__EXPECTED_VERSION_19_21_0 /D DLIB_JPEG_STATIC /D "CMAKE_INTDIR=\"Debug\"" /D _MBCS /Gm- /EHsc /RTC1 /MDd /GS /fp:precise /Zc:wchar_t /Zc:forScope /Zc:inline /GR /Fo"DLIB.DIR\DEBUG\\" /Fd"DLIB.DIR\DEBUG\DLIB.PDB" /Gd /TC  /bigobj C:\DLIB-19.21\SOURCE\DLIB\EXTERNAL\LIBPNG\ARM\ARM_INIT.C
^C:\DLIB-19.21\SOURCE\DLIB\EXTERNAL\LIBPNG\ARM\FILTER_NEON_INTRINSICS.C
/c /I"C:\DLIB-19.21\SOURCE\DLIB\EXTERNAL\LIBPNG" /I"C:\DLIB-19.21\SOURCE\DLIB\EXTERNAL\ZLIB" /Zi /nologo /W3 /WX- /diagnostics:column /Od /Ob0 /D WIN32 /D _WINDOWS /D DLIB_HAVE_SSE2 /D DLIB_DISABLE_ASSERTS /D DLIB_JPEG_SUPPORT /D DLIB_PNG_SUPPORT /D DLIB__CMAKE_GENERATED_A_CONFIG_H_FILE /D DLIB_CHECK_FOR_VERSION_MISMATCH=DLIB_VERSION_MISMATCH_CHECK__EXPECTED_VERSION_19_21_0 /D DLIB_JPEG_STATIC /D "CMAKE_INTDIR=\"Debug\"" /D _MBCS /Gm- /EHsc /RTC1 /MDd /GS /fp:precise /Zc:wchar_t /Zc:forScope /Zc:inline /GR /Fo"DLIB.DIR\DEBUG\\" /Fd"DLIB.DIR\DEBUG\DLIB.PDB" /Gd /TC  /bigobj C:\DLIB-19.21\SOURCE\DLIB\EXTERNAL\LIBPNG\ARM\FILTER_NEON_INTRINSICS.C
^C:\DLIB-19.21\SOURCE\DLIB\EXTERNAL\LIBPNG\PNG.C
/c /I"C:\DLIB-19.21\SOURCE\DLIB\EXTERNAL\LIBPNG" /I"C:\DLIB-19.21\SOURCE\DLIB\EXTERNAL\ZLIB" /Zi /nologo /W3 /WX- /diagnostics:column /Od /Ob0 /D WIN32 /D _WINDOWS /D DLIB_HAVE_SSE2 /D DLIB_DISABLE_ASSERTS /D DLIB_JPEG_SUPPORT /D DLIB_PNG_SUPPORT /D DLIB__CMAKE_GENERATED_A_CONFIG_H_FILE /D DLIB_CHECK_FOR_VERSION_MISMATCH=DLIB_VERSION_MISMATCH_CHECK__EXPECTED_VERSION_19_21_0 /D DLIB_JPEG_STATIC /D "CMAKE_INTDIR=\"Debug\"" /D _MBCS /Gm- /EHsc /RTC1 /MDd /GS /fp:precise /Zc:wchar_t /Zc:forScope /Zc:inline /GR /Fo"DLIB.DIR\DEBUG\\" /Fd"DLIB.DIR\DEBUG\DLIB.PDB" /Gd /TC  /bigobj C:\DLIB-19.21\SOURCE\DLIB\EXTERNAL\LIBPNG\PNG.C
^C:\DLIB-19.21\SOURCE\DLIB\EXTERNAL\LIBPNG\PNGERROR.C
/c /I"C:\DLIB-19.21\SOURCE\DLIB\EXTERNAL\LIBPNG" /I"C:\DLIB-19.21\SOURCE\DLIB\EXTERNAL\ZLIB" /Zi /nologo /W3 /WX- /diagnostics:column /Od /Ob0 /D WIN32 /D _WINDOWS /D DLIB_HAVE_SSE2 /D DLIB_DISABLE_ASSERTS /D DLIB_JPEG_SUPPORT /D DLIB_PNG_SUPPORT /D DLIB__CMAKE_GENERATED_A_CONFIG_H_FILE /D DLIB_CHECK_FOR_VERSION_MISMATCH=DLIB_VERSION_MISMATCH_CHECK__EXPECTED_VERSION_19_21_0 /D DLIB_JPEG_STATIC /D "CMAKE_INTDIR=\"Debug\"" /D _MBCS /Gm- /EHsc /RTC1 /MDd /GS /fp:precise /Zc:wchar_t /Zc:forScope /Zc:inline /GR /Fo"DLIB.DIR\DEBUG\\" /Fd"DLIB.DIR\DEBUG\DLIB.PDB" /Gd /TC  /bigobj C:\DLIB-19.21\SOURCE\DLIB\EXTERNAL\LIBPNG\PNGERROR.C
^C:\DLIB-19.21\SOURCE\DLIB\EXTERNAL\LIBPNG\PNGGET.C
/c /I"C:\DLIB-19.21\SOURCE\DLIB\EXTERNAL\LIBPNG" /I"C:\DLIB-19.21\SOURCE\DLIB\EXTERNAL\ZLIB" /Zi /nologo /W3 /WX- /diagnostics:column /Od /Ob0 /D WIN32 /D _WINDOWS /D DLIB_HAVE_SSE2 /D DLIB_DISABLE_ASSERTS /D DLIB_JPEG_SUPPORT /D DLIB_PNG_SUPPORT /D DLIB__CMAKE_GENERATED_A_CONFIG_H_FILE /D DLIB_CHECK_FOR_VERSION_MISMATCH=DLIB_VERSION_MISMATCH_CHECK__EXPECTED_VERSION_19_21_0 /D DLIB_JPEG_STATIC /D "CMAKE_INTDIR=\"Debug\"" /D _MBCS /Gm- /EHsc /RTC1 /MDd /GS /fp:precise /Zc:wchar_t /Zc:forScope /Zc:inline /GR /Fo"DLIB.DIR\DEBUG\\" /Fd"DLIB.DIR\DEBUG\DLIB.PDB" /Gd /TC  /bigobj C:\DLIB-19.21\SOURCE\DLIB\EXTERNAL\LIBPNG\PNGGET.C
^C:\DLIB-19.21\SOURCE\DLIB\EXTERNAL\LIBPNG\PNGMEM.C
/c /I"C:\DLIB-19.21\SOURCE\DLIB\EXTERNAL\LIBPNG" /I"C:\DLIB-19.21\SOURCE\DLIB\EXTERNAL\ZLIB" /Zi /nologo /W3 /WX- /diagnostics:column /Od /Ob0 /D WIN32 /D _WINDOWS /D DLIB_HAVE_SSE2 /D DLIB_DISABLE_ASSERTS /D DLIB_JPEG_SUPPORT /D DLIB_PNG_SUPPORT /D DLIB__CMAKE_GENERATED_A_CONFIG_H_FILE /D DLIB_CHECK_FOR_VERSION_MISMATCH=DLIB_VERSION_MISMATCH_CHECK__EXPECTED_VERSION_19_21_0 /D DLIB_JPEG_STATIC /D "CMAKE_INTDIR=\"Debug\"" /D _MBCS /Gm- /EHsc /RTC1 /MDd /GS /fp:precise /Zc:wchar_t /Zc:forScope /Zc:inline /GR /Fo"DLIB.DIR\DEBUG\\" /Fd"DLIB.DIR\DEBUG\DLIB.PDB" /Gd /TC  /bigobj C:\DLIB-19.21\SOURCE\DLIB\EXTERNAL\LIBPNG\PNGMEM.C
^C:\DLIB-19.21\SOURCE\DLIB\EXTERNAL\LIBPNG\PNGPREAD.C
/c /I"C:\DLIB-19.21\SOURCE\DLIB\EXTERNAL\LIBPNG" /I"C:\DLIB-19.21\SOURCE\DLIB\EXTERNAL\ZLIB" /Zi /nologo /W3 /WX- /diagnostics:column /Od /Ob0 /D WIN32 /D _WINDOWS /D DLIB_HAVE_SSE2 /D DLIB_DISABLE_ASSERTS /D DLIB_JPEG_SUPPORT /D DLIB_PNG_SUPPORT /D DLIB__CMAKE_GENERATED_A_CONFIG_H_FILE /D DLIB_CHECK_FOR_VERSION_MISMATCH=DLIB_VERSION_MISMATCH_CHECK__EXPECTED_VERSION_19_21_0 /D DLIB_JPEG_STATIC /D "CMAKE_INTDIR=\"Debug\"" /D _MBCS /Gm- /EHsc /RTC1 /MDd /GS /fp:precise /Zc:wchar_t /Zc:forScope /Zc:inline /GR /Fo"DLIB.DIR\DEBUG\\" /Fd"DLIB.DIR\DEBUG\DLIB.PDB" /Gd /TC  /bigobj C:\DLIB-19.21\SOURCE\DLIB\EXTERNAL\LIBPNG\PNGPREAD.C
^C:\DLIB-19.21\SOURCE\DLIB\EXTERNAL\LIBPNG\PNGREAD.C
/c /I"C:\DLIB-19.21\SOURCE\DLIB\EXTERNAL\LIBPNG" /I"C:\DLIB-19.21\SOURCE\DLIB\EXTERNAL\ZLIB" /Zi /nologo /W3 /WX- /diagnostics:column /Od /Ob0 /D WIN32 /D _WINDOWS /D DLIB_HAVE_SSE2 /D DLIB_DISABLE_ASSERTS /D DLIB_JPEG_SUPPORT /D DLIB_PNG_SUPPORT /D DLIB__CMAKE_GENERATED_A_CONFIG_H_FILE /D DLIB_CHECK_FOR_VERSION_MISMATCH=DLIB_VERSION_MISMATCH_CHECK__EXPECTED_VERSION_19_21_0 /D DLIB_JPEG_STATIC /D "CMAKE_INTDIR=\"Debug\"" /D _MBCS /Gm- /EHsc /RTC1 /MDd /GS /fp:precise /Zc:wchar_t /Zc:forScope /Zc:inline /GR /Fo"DLIB.DIR\DEBUG\\" /Fd"DLIB.DIR\DEBUG\DLIB.PDB" /Gd /TC  /bigobj C:\DLIB-19.21\SOURCE\DLIB\EXTERNAL\LIBPNG\PNGREAD.C
^C:\DLIB-19.21\SOURCE\DLIB\EXTERNAL\LIBPNG\PNGRIO.C
/c /I"C:\DLIB-19.21\SOURCE\DLIB\EXTERNAL\LIBPNG" /I"C:\DLIB-19.21\SOURCE\DLIB\EXTERNAL\ZLIB" /Zi /nologo /W3 /WX- /diagnostics:column /Od /Ob0 /D WIN32 /D _WINDOWS /D DLIB_HAVE_SSE2 /D DLIB_DISABLE_ASSERTS /D DLIB_JPEG_SUPPORT /D DLIB_PNG_SUPPORT /D DLIB__CMAKE_GENERATED_A_CONFIG_H_FILE /D DLIB_CHECK_FOR_VERSION_MISMATCH=DLIB_VERSION_MISMATCH_CHECK__EXPECTED_VERSION_19_21_0 /D DLIB_JPEG_STATIC /D "CMAKE_INTDIR=\"Debug\"" /D _MBCS /Gm- /EHsc /RTC1 /MDd /GS /fp:precise /Zc:wchar_t /Zc:forScope /Zc:inline /GR /Fo"DLIB.DIR\DEBUG\\" /Fd"DLIB.DIR\DEBUG\DLIB.PDB" /Gd /TC  /bigobj C:\DLIB-19.21\SOURCE\DLIB\EXTERNAL\LIBPNG\PNGRIO.C
^C:\DLIB-19.21\SOURCE\DLIB\EXTERNAL\LIBPNG\PNGRTRAN.C
/c /I"C:\DLIB-19.21\SOURCE\DLIB\EXTERNAL\LIBPNG" /I"C:\DLIB-19.21\SOURCE\DLIB\EXTERNAL\ZLIB" /Zi /nologo /W3 /WX- /diagnostics:column /Od /Ob0 /D WIN32 /D _WINDOWS /D DLIB_HAVE_SSE2 /D DLIB_DISABLE_ASSERTS /D DLIB_JPEG_SUPPORT /D DLIB_PNG_SUPPORT /D DLIB__CMAKE_GENERATED_A_CONFIG_H_FILE /D DLIB_CHECK_FOR_VERSION_MISMATCH=DLIB_VERSION_MISMATCH_CHECK__EXPECTED_VERSION_19_21_0 /D DLIB_JPEG_STATIC /D "CMAKE_INTDIR=\"Debug\"" /D _MBCS /Gm- /EHsc /RTC1 /MDd /GS /fp:precise /Zc:wchar_t /Zc:forScope /Zc:inline /GR /Fo"DLIB.DIR\DEBUG\\" /Fd"DLIB.DIR\DEBUG\DLIB.PDB" /Gd /TC  /bigobj C:\DLIB-19.21\SOURCE\DLIB\EXTERNAL\LIBPNG\PNGRTRAN.C
^C:\DLIB-19.21\SOURCE\DLIB\EXTERNAL\LIBPNG\PNGRUTIL.C
/c /I"C:\DLIB-19.21\SOURCE\DLIB\EXTERNAL\LIBPNG" /I"C:\DLIB-19.21\SOURCE\DLIB\EXTERNAL\ZLIB" /Zi /nologo /W3 /WX- /diagnostics:column /Od /Ob0 /D WIN32 /D _WINDOWS /D DLIB_HAVE_SSE2 /D DLIB_DISABLE_ASSERTS /D DLIB_JPEG_SUPPORT /D DLIB_PNG_SUPPORT /D DLIB__CMAKE_GENERATED_A_CONFIG_H_FILE /D DLIB_CHECK_FOR_VERSION_MISMATCH=DLIB_VERSION_MISMATCH_CHECK__EXPECTED_VERSION_19_21_0 /D DLIB_JPEG_STATIC /D "CMAKE_INTDIR=\"Debug\"" /D _MBCS /Gm- /EHsc /RTC1 /MDd /GS /fp:precise /Zc:wchar_t /Zc:forScope /Zc:inline /GR /Fo"DLIB.DIR\DEBUG\\" /Fd"DLIB.DIR\DEBUG\DLIB.PDB" /Gd /TC  /bigobj C:\DLIB-19.21\SOURCE\DLIB\EXTERNAL\LIBPNG\PNGRUTIL.C
^C:\DLIB-19.21\SOURCE\DLIB\EXTERNAL\LIBPNG\PNGSET.C
/c /I"C:\DLIB-19.21\SOURCE\DLIB\EXTERNAL\LIBPNG" /I"C:\DLIB-19.21\SOURCE\DLIB\EXTERNAL\ZLIB" /Zi /nologo /W3 /WX- /diagnostics:column /Od /Ob0 /D WIN32 /D _WINDOWS /D DLIB_HAVE_SSE2 /D DLIB_DISABLE_ASSERTS /D DLIB_JPEG_SUPPORT /D DLIB_PNG_SUPPORT /D DLIB__CMAKE_GENERATED_A_CONFIG_H_FILE /D DLIB_CHECK_FOR_VERSION_MISMATCH=DLIB_VERSION_MISMATCH_CHECK__EXPECTED_VERSION_19_21_0 /D DLIB_JPEG_STATIC /D "CMAKE_INTDIR=\"Debug\"" /D _MBCS /Gm- /EHsc /RTC1 /MDd /GS /fp:precise /Zc:wchar_t /Zc:forScope /Zc:inline /GR /Fo"DLIB.DIR\DEBUG\\" /Fd"DLIB.DIR\DEBUG\DLIB.PDB" /Gd /TC  /bigobj C:\DLIB-19.21\SOURCE\DLIB\EXTERNAL\LIBPNG\PNGSET.C
^C:\DLIB-19.21\SOURCE\DLIB\EXTERNAL\LIBPNG\PNGTRANS.C
/c /I"C:\DLIB-19.21\SOURCE\DLIB\EXTERNAL\LIBPNG" /I"C:\DLIB-19.21\SOURCE\DLIB\EXTERNAL\ZLIB" /Zi /nologo /W3 /WX- /diagnostics:column /Od /Ob0 /D WIN32 /D _WINDOWS /D DLIB_HAVE_SSE2 /D DLIB_DISABLE_ASSERTS /D DLIB_JPEG_SUPPORT /D DLIB_PNG_SUPPORT /D DLIB__CMAKE_GENERATED_A_CONFIG_H_FILE /D DLIB_CHECK_FOR_VERSION_MISMATCH=DLIB_VERSION_MISMATCH_CHECK__EXPECTED_VERSION_19_21_0 /D DLIB_JPEG_STATIC /D "CMAKE_INTDIR=\"Debug\"" /D _MBCS /Gm- /EHsc /RTC1 /MDd /GS /fp:precise /Zc:wchar_t /Zc:forScope /Zc:inline /GR /Fo"DLIB.DIR\DEBUG\\" /Fd"DLIB.DIR\DEBUG\DLIB.PDB" /Gd /TC  /bigobj C:\DLIB-19.21\SOURCE\DLIB\EXTERNAL\LIBPNG\PNGTRANS.C
^C:\DLIB-19.21\SOURCE\DLIB\EXTERNAL\LIBPNG\PNGWIO.C
/c /I"C:\DLIB-19.21\SOURCE\DLIB\EXTERNAL\LIBPNG" /I"C:\DLIB-19.21\SOURCE\DLIB\EXTERNAL\ZLIB" /Zi /nologo /W3 /WX- /diagnostics:column /Od /Ob0 /D WIN32 /D _WINDOWS /D DLIB_HAVE_SSE2 /D DLIB_DISABLE_ASSERTS /D DLIB_JPEG_SUPPORT /D DLIB_PNG_SUPPORT /D DLIB__CMAKE_GENERATED_A_CONFIG_H_FILE /D DLIB_CHECK_FOR_VERSION_MISMATCH=DLIB_VERSION_MISMATCH_CHECK__EXPECTED_VERSION_19_21_0 /D DLIB_JPEG_STATIC /D "CMAKE_INTDIR=\"Debug\"" /D _MBCS /Gm- /EHsc /RTC1 /MDd /GS /fp:precise /Zc:wchar_t /Zc:forScope /Zc:inline /GR /Fo"DLIB.DIR\DEBUG\\" /Fd"DLIB.DIR\DEBUG\DLIB.PDB" /Gd /TC  /bigobj C:\DLIB-19.21\SOURCE\DLIB\EXTERNAL\LIBPNG\PNGWIO.C
^C:\DLIB-19.21\SOURCE\DLIB\EXTERNAL\LIBPNG\PNGWRITE.C
/c /I"C:\DLIB-19.21\SOURCE\DLIB\EXTERNAL\LIBPNG" /I"C:\DLIB-19.21\SOURCE\DLIB\EXTERNAL\ZLIB" /Zi /nologo /W3 /WX- /diagnostics:column /Od /Ob0 /D WIN32 /D _WINDOWS /D DLIB_HAVE_SSE2 /D DLIB_DISABLE_ASSERTS /D DLIB_JPEG_SUPPORT /D DLIB_PNG_SUPPORT /D DLIB__CMAKE_GENERATED_A_CONFIG_H_FILE /D DLIB_CHECK_FOR_VERSION_MISMATCH=DLIB_VERSION_MISMATCH_CHECK__EXPECTED_VERSION_19_21_0 /D DLIB_JPEG_STATIC /D "CMAKE_INTDIR=\"Debug\"" /D _MBCS /Gm- /EHsc /RTC1 /MDd /GS /fp:precise /Zc:wchar_t /Zc:forScope /Zc:inline /GR /Fo"DLIB.DIR\DEBUG\\" /Fd"DLIB.DIR\DEBUG\DLIB.PDB" /Gd /TC  /bigobj C:\DLIB-19.21\SOURCE\DLIB\EXTERNAL\LIBPNG\PNGWRITE.C
^C:\DLIB-19.21\SOURCE\DLIB\EXTERNAL\LIBPNG\PNGWTRAN.C
/c /I"C:\DLIB-19.21\SOURCE\DLIB\EXTERNAL\LIBPNG" /I"C:\DLIB-19.21\SOURCE\DLIB\EXTERNAL\ZLIB" /Zi /nologo /W3 /WX- /diagnostics:column /Od /Ob0 /D WIN32 /D _WINDOWS /D DLIB_HAVE_SSE2 /D DLIB_DISABLE_ASSERTS /D DLIB_JPEG_SUPPORT /D DLIB_PNG_SUPPORT /D DLIB__CMAKE_GENERATED_A_CONFIG_H_FILE /D DLIB_CHECK_FOR_VERSION_MISMATCH=DLIB_VERSION_MISMATCH_CHECK__EXPECTED_VERSION_19_21_0 /D DLIB_JPEG_STATIC /D "CMAKE_INTDIR=\"Debug\"" /D _MBCS /Gm- /EHsc /RTC1 /MDd /GS /fp:precise /Zc:wchar_t /Zc:forScope /Zc:inline /GR /Fo"DLIB.DIR\DEBUG\\" /Fd"DLIB.DIR\DEBUG\DLIB.PDB" /Gd /TC  /bigobj C:\DLIB-19.21\SOURCE\DLIB\EXTERNAL\LIBPNG\PNGWTRAN.C
^C:\DLIB-19.21\SOURCE\DLIB\EXTERNAL\LIBPNG\PNGWUTIL.C
/c /I"C:\DLIB-19.21\SOURCE\DLIB\EXTERNAL\LIBPNG" /I"C:\DLIB-19.21\SOURCE\DLIB\EXTERNAL\ZLIB" /Zi /nologo /W3 /WX- /diagnostics:column /Od /Ob0 /D WIN32 /D _WINDOWS /D DLIB_HAVE_SSE2 /D DLIB_DISABLE_ASSERTS /D DLIB_JPEG_SUPPORT /D DLIB_PNG_SUPPORT /D DLIB__CMAKE_GENERATED_A_CONFIG_H_FILE /D DLIB_CHECK_FOR_VERSION_MISMATCH=DLIB_VERSION_MISMATCH_CHECK__EXPECTED_VERSION_19_21_0 /D DLIB_JPEG_STATIC /D "CMAKE_INTDIR=\"Debug\"" /D _MBCS /Gm- /EHsc /RTC1 /MDd /GS /fp:precise /Zc:wchar_t /Zc:forScope /Zc:inline /GR /Fo"DLIB.DIR\DEBUG\\" /Fd"DLIB.DIR\DEBUG\DLIB.PDB" /Gd /TC  /bigobj C:\DLIB-19.21\SOURCE\DLIB\EXTERNAL\LIBPNG\PNGWUTIL.C
^C:\DLIB-19.21\SOURCE\DLIB\EXTERNAL\ZLIB\ADLER32.C
/c /I"C:\DLIB-19.21\SOURCE\DLIB\EXTERNAL\LIBPNG" /I"C:\DLIB-19.21\SOURCE\DLIB\EXTERNAL\ZLIB" /Zi /nologo /W3 /WX- /diagnostics:column /Od /Ob0 /D WIN32 /D _WINDOWS /D DLIB_HAVE_SSE2 /D DLIB_DISABLE_ASSERTS /D DLIB_JPEG_SUPPORT /D DLIB_PNG_SUPPORT /D DLIB__CMAKE_GENERATED_A_CONFIG_H_FILE /D DLIB_CHECK_FOR_VERSION_MISMATCH=DLIB_VERSION_MISMATCH_CHECK__EXPECTED_VERSION_19_21_0 /D DLIB_JPEG_STATIC /D "CMAKE_INTDIR=\"Debug\"" /D _MBCS /Gm- /EHsc /RTC1 /MDd /GS /fp:precise /Zc:wchar_t /Zc:forScope /Zc:inline /GR /Fo"DLIB.DIR\DEBUG\\" /Fd"DLIB.DIR\DEBUG\DLIB.PDB" /Gd /TC  /bigobj C:\DLIB-19.21\SOURCE\DLIB\EXTERNAL\ZLIB\ADLER32.C
^C:\DLIB-19.21\SOURCE\DLIB\EXTERNAL\ZLIB\COMPRESS.C
/c /I"C:\DLIB-19.21\SOURCE\DLIB\EXTERNAL\LIBPNG" /I"C:\DLIB-19.21\SOURCE\DLIB\EXTERNAL\ZLIB" /Zi /nologo /W3 /WX- /diagnostics:column /Od /Ob0 /D WIN32 /D _WINDOWS /D DLIB_HAVE_SSE2 /D DLIB_DISABLE_ASSERTS /D DLIB_JPEG_SUPPORT /D DLIB_PNG_SUPPORT /D DLIB__CMAKE_GENERATED_A_CONFIG_H_FILE /D DLIB_CHECK_FOR_VERSION_MISMATCH=DLIB_VERSION_MISMATCH_CHECK__EXPECTED_VERSION_19_21_0 /D DLIB_JPEG_STATIC /D "CMAKE_INTDIR=\"Debug\"" /D _MBCS /Gm- /EHsc /RTC1 /MDd /GS /fp:precise /Zc:wchar_t /Zc:forScope /Zc:inline /GR /Fo"DLIB.DIR\DEBUG\\" /Fd"DLIB.DIR\DEBUG\DLIB.PDB" /Gd /TC  /bigobj C:\DLIB-19.21\SOURCE\DLIB\EXTERNAL\ZLIB\COMPRESS.C
^C:\DLIB-19.21\SOURCE\DLIB\EXTERNAL\ZLIB\CRC32.C
/c /I"C:\DLIB-19.21\SOURCE\DLIB\EXTERNAL\LIBPNG" /I"C:\DLIB-19.21\SOURCE\DLIB\EXTERNAL\ZLIB" /Zi /nologo /W3 /WX- /diagnostics:column /Od /Ob0 /D WIN32 /D _WINDOWS /D DLIB_HAVE_SSE2 /D DLIB_DISABLE_ASSERTS /D DLIB_JPEG_SUPPORT /D DLIB_PNG_SUPPORT /D DLIB__CMAKE_GENERATED_A_CONFIG_H_FILE /D DLIB_CHECK_FOR_VERSION_MISMATCH=DLIB_VERSION_MISMATCH_CHECK__EXPECTED_VERSION_19_21_0 /D DLIB_JPEG_STATIC /D "CMAKE_INTDIR=\"Debug\"" /D _MBCS /Gm- /EHsc /RTC1 /MDd /GS /fp:precise /Zc:wchar_t /Zc:forScope /Zc:inline /GR /Fo"DLIB.DIR\DEBUG\\" /Fd"DLIB.DIR\DEBUG\DLIB.PDB" /Gd /TC  /bigobj C:\DLIB-19.21\SOURCE\DLIB\EXTERNAL\ZLIB\CRC32.C
^C:\DLIB-19.21\SOURCE\DLIB\EXTERNAL\ZLIB\DEFLATE.C
/c /I"C:\DLIB-19.21\SOURCE\DLIB\EXTERNAL\LIBPNG" /I"C:\DLIB-19.21\SOURCE\DLIB\EXTERNAL\ZLIB" /Zi /nologo /W3 /WX- /diagnostics:column /Od /Ob0 /D WIN32 /D _WINDOWS /D DLIB_HAVE_SSE2 /D DLIB_DISABLE_ASSERTS /D DLIB_JPEG_SUPPORT /D DLIB_PNG_SUPPORT /D DLIB__CMAKE_GENERATED_A_CONFIG_H_FILE /D DLIB_CHECK_FOR_VERSION_MISMATCH=DLIB_VERSION_MISMATCH_CHECK__EXPECTED_VERSION_19_21_0 /D DLIB_JPEG_STATIC /D "CMAKE_INTDIR=\"Debug\"" /D _MBCS /Gm- /EHsc /RTC1 /MDd /GS /fp:precise /Zc:wchar_t /Zc:forScope /Zc:inline /GR /Fo"DLIB.DIR\DEBUG\\" /Fd"DLIB.DIR\DEBUG\DLIB.PDB" /Gd /TC  /bigobj C:\DLIB-19.21\SOURCE\DLIB\EXTERNAL\ZLIB\DEFLATE.C
^C:\DLIB-19.21\SOURCE\DLIB\EXTERNAL\ZLIB\GZCLOSE.C
/c /I"C:\DLIB-19.21\SOURCE\DLIB\EXTERNAL\LIBPNG" /I"C:\DLIB-19.21\SOURCE\DLIB\EXTERNAL\ZLIB" /Zi /nologo /W3 /WX- /diagnostics:column /Od /Ob0 /D WIN32 /D _WINDOWS /D DLIB_HAVE_SSE2 /D DLIB_DISABLE_ASSERTS /D DLIB_JPEG_SUPPORT /D DLIB_PNG_SUPPORT /D DLIB__CMAKE_GENERATED_A_CONFIG_H_FILE /D DLIB_CHECK_FOR_VERSION_MISMATCH=DLIB_VERSION_MISMATCH_CHECK__EXPECTED_VERSION_19_21_0 /D DLIB_JPEG_STATIC /D "CMAKE_INTDIR=\"Debug\"" /D _MBCS /Gm- /EHsc /RTC1 /MDd /GS /fp:precise /Zc:wchar_t /Zc:forScope /Zc:inline /GR /Fo"DLIB.DIR\DEBUG\\" /Fd"DLIB.DIR\DEBUG\DLIB.PDB" /Gd /TC  /bigobj C:\DLIB-19.21\SOURCE\DLIB\EXTERNAL\ZLIB\GZCLOSE.C
^C:\DLIB-19.21\SOURCE\DLIB\EXTERNAL\ZLIB\GZLIB.C
/c /I"C:\DLIB-19.21\SOURCE\DLIB\EXTERNAL\LIBPNG" /I"C:\DLIB-19.21\SOURCE\DLIB\EXTERNAL\ZLIB" /Zi /nologo /W3 /WX- /diagnostics:column /Od /Ob0 /D WIN32 /D _WINDOWS /D DLIB_HAVE_SSE2 /D DLIB_DISABLE_ASSERTS /D DLIB_JPEG_SUPPORT /D DLIB_PNG_SUPPORT /D DLIB__CMAKE_GENERATED_A_CONFIG_H_FILE /D DLIB_CHECK_FOR_VERSION_MISMATCH=DLIB_VERSION_MISMATCH_CHECK__EXPECTED_VERSION_19_21_0 /D DLIB_JPEG_STATIC /D "CMAKE_INTDIR=\"Debug\"" /D _MBCS /Gm- /EHsc /RTC1 /MDd /GS /fp:precise /Zc:wchar_t /Zc:forScope /Zc:inline /GR /Fo"DLIB.DIR\DEBUG\\" /Fd"DLIB.DIR\DEBUG\DLIB.PDB" /Gd /TC  /bigobj C:\DLIB-19.21\SOURCE\DLIB\EXTERNAL\ZLIB\GZLIB.C
^C:\DLIB-19.21\SOURCE\DLIB\EXTERNAL\ZLIB\GZREAD.C
/c /I"C:\DLIB-19.21\SOURCE\DLIB\EXTERNAL\LIBPNG" /I"C:\DLIB-19.21\SOURCE\DLIB\EXTERNAL\ZLIB" /Zi /nologo /W3 /WX- /diagnostics:column /Od /Ob0 /D WIN32 /D _WINDOWS /D DLIB_HAVE_SSE2 /D DLIB_DISABLE_ASSERTS /D DLIB_JPEG_SUPPORT /D DLIB_PNG_SUPPORT /D DLIB__CMAKE_GENERATED_A_CONFIG_H_FILE /D DLIB_CHECK_FOR_VERSION_MISMATCH=DLIB_VERSION_MISMATCH_CHECK__EXPECTED_VERSION_19_21_0 /D DLIB_JPEG_STATIC /D "CMAKE_INTDIR=\"Debug\"" /D _MBCS /Gm- /EHsc /RTC1 /MDd /GS /fp:precise /Zc:wchar_t /Zc:forScope /Zc:inline /GR /Fo"DLIB.DIR\DEBUG\\" /Fd"DLIB.DIR\DEBUG\DLIB.PDB" /Gd /TC  /bigobj C:\DLIB-19.21\SOURCE\DLIB\EXTERNAL\ZLIB\GZREAD.C
^C:\DLIB-19.21\SOURCE\DLIB\EXTERNAL\ZLIB\GZWRITE.C
/c /I"C:\DLIB-19.21\SOURCE\DLIB\EXTERNAL\LIBPNG" /I"C:\DLIB-19.21\SOURCE\DLIB\EXTERNAL\ZLIB" /Zi /nologo /W3 /WX- /diagnostics:column /Od /Ob0 /D WIN32 /D _WINDOWS /D DLIB_HAVE_SSE2 /D DLIB_DISABLE_ASSERTS /D DLIB_JPEG_SUPPORT /D DLIB_PNG_SUPPORT /D DLIB__CMAKE_GENERATED_A_CONFIG_H_FILE /D DLIB_CHECK_FOR_VERSION_MISMATCH=DLIB_VERSION_MISMATCH_CHECK__EXPECTED_VERSION_19_21_0 /D DLIB_JPEG_STATIC /D "CMAKE_INTDIR=\"Debug\"" /D _MBCS /Gm- /EHsc /RTC1 /MDd /GS /fp:precise /Zc:wchar_t /Zc:forScope /Zc:inline /GR /Fo"DLIB.DIR\DEBUG\\" /Fd"DLIB.DIR\DEBUG\DLIB.PDB" /Gd /TC  /bigobj C:\DLIB-19.21\SOURCE\DLIB\EXTERNAL\ZLIB\GZWRITE.C
^C:\DLIB-19.21\SOURCE\DLIB\EXTERNAL\ZLIB\INFBACK.C
/c /I"C:\DLIB-19.21\SOURCE\DLIB\EXTERNAL\LIBPNG" /I"C:\DLIB-19.21\SOURCE\DLIB\EXTERNAL\ZLIB" /Zi /nologo /W3 /WX- /diagnostics:column /Od /Ob0 /D WIN32 /D _WINDOWS /D DLIB_HAVE_SSE2 /D DLIB_DISABLE_ASSERTS /D DLIB_JPEG_SUPPORT /D DLIB_PNG_SUPPORT /D DLIB__CMAKE_GENERATED_A_CONFIG_H_FILE /D DLIB_CHECK_FOR_VERSION_MISMATCH=DLIB_VERSION_MISMATCH_CHECK__EXPECTED_VERSION_19_21_0 /D DLIB_JPEG_STATIC /D "CMAKE_INTDIR=\"Debug\"" /D _MBCS /Gm- /EHsc /RTC1 /MDd /GS /fp:precise /Zc:wchar_t /Zc:forScope /Zc:inline /GR /Fo"DLIB.DIR\DEBUG\\" /Fd"DLIB.DIR\DEBUG\DLIB.PDB" /Gd /TC  /bigobj C:\DLIB-19.21\SOURCE\DLIB\EXTERNAL\ZLIB\INFBACK.C
^C:\DLIB-19.21\SOURCE\DLIB\EXTERNAL\ZLIB\INFFAST.C
/c /I"C:\DLIB-19.21\SOURCE\DLIB\EXTERNAL\LIBPNG" /I"C:\DLIB-19.21\SOURCE\DLIB\EXTERNAL\ZLIB" /Zi /nologo /W3 /WX- /diagnostics:column /Od /Ob0 /D WIN32 /D _WINDOWS /D DLIB_HAVE_SSE2 /D DLIB_DISABLE_ASSERTS /D DLIB_JPEG_SUPPORT /D DLIB_PNG_SUPPORT /D DLIB__CMAKE_GENERATED_A_CONFIG_H_FILE /D DLIB_CHECK_FOR_VERSION_MISMATCH=DLIB_VERSION_MISMATCH_CHECK__EXPECTED_VERSION_19_21_0 /D DLIB_JPEG_STATIC /D "CMAKE_INTDIR=\"Debug\"" /D _MBCS /Gm- /EHsc /RTC1 /MDd /GS /fp:precise /Zc:wchar_t /Zc:forScope /Zc:inline /GR /Fo"DLIB.DIR\DEBUG\\" /Fd"DLIB.DIR\DEBUG\DLIB.PDB" /Gd /TC  /bigobj C:\DLIB-19.21\SOURCE\DLIB\EXTERNAL\ZLIB\INFFAST.C
^C:\DLIB-19.21\SOURCE\DLIB\EXTERNAL\ZLIB\INFLATE.C
/c /I"C:\DLIB-19.21\SOURCE\DLIB\EXTERNAL\LIBPNG" /I"C:\DLIB-19.21\SOURCE\DLIB\EXTERNAL\ZLIB" /Zi /nologo /W3 /WX- /diagnostics:column /Od /Ob0 /D WIN32 /D _WINDOWS /D DLIB_HAVE_SSE2 /D DLIB_DISABLE_ASSERTS /D DLIB_JPEG_SUPPORT /D DLIB_PNG_SUPPORT /D DLIB__CMAKE_GENERATED_A_CONFIG_H_FILE /D DLIB_CHECK_FOR_VERSION_MISMATCH=DLIB_VERSION_MISMATCH_CHECK__EXPECTED_VERSION_19_21_0 /D DLIB_JPEG_STATIC /D "CMAKE_INTDIR=\"Debug\"" /D _MBCS /Gm- /EHsc /RTC1 /MDd /GS /fp:precise /Zc:wchar_t /Zc:forScope /Zc:inline /GR /Fo"DLIB.DIR\DEBUG\\" /Fd"DLIB.DIR\DEBUG\DLIB.PDB" /Gd /TC  /bigobj C:\DLIB-19.21\SOURCE\DLIB\EXTERNAL\ZLIB\INFLATE.C
^C:\DLIB-19.21\SOURCE\DLIB\EXTERNAL\ZLIB\INFTREES.C
/c /I"C:\DLIB-19.21\SOURCE\DLIB\EXTERNAL\LIBPNG" /I"C:\DLIB-19.21\SOURCE\DLIB\EXTERNAL\ZLIB" /Zi /nologo /W3 /WX- /diagnostics:column /Od /Ob0 /D WIN32 /D _WINDOWS /D DLIB_HAVE_SSE2 /D DLIB_DISABLE_ASSERTS /D DLIB_JPEG_SUPPORT /D DLIB_PNG_SUPPORT /D DLIB__CMAKE_GENERATED_A_CONFIG_H_FILE /D DLIB_CHECK_FOR_VERSION_MISMATCH=DLIB_VERSION_MISMATCH_CHECK__EXPECTED_VERSION_19_21_0 /D DLIB_JPEG_STATIC /D "CMAKE_INTDIR=\"Debug\"" /D _MBCS /Gm- /EHsc /RTC1 /MDd /GS /fp:precise /Zc:wchar_t /Zc:forScope /Zc:inline /GR /Fo"DLIB.DIR\DEBUG\\" /Fd"DLIB.DIR\DEBUG\DLIB.PDB" /Gd /TC  /bigobj C:\DLIB-19.21\SOURCE\DLIB\EXTERNAL\ZLIB\INFTREES.C
^C:\DLIB-19.21\SOURCE\DLIB\EXTERNAL\ZLIB\TREES.C
/c /I"C:\DLIB-19.21\SOURCE\DLIB\EXTERNAL\LIBPNG" /I"C:\DLIB-19.21\SOURCE\DLIB\EXTERNAL\ZLIB" /Zi /nologo /W3 /WX- /diagnostics:column /Od /Ob0 /D WIN32 /D _WINDOWS /D DLIB_HAVE_SSE2 /D DLIB_DISABLE_ASSERTS /D DLIB_JPEG_SUPPORT /D DLIB_PNG_SUPPORT /D DLIB__CMAKE_GENERATED_A_CONFIG_H_FILE /D DLIB_CHECK_FOR_VERSION_MISMATCH=DLIB_VERSION_MISMATCH_CHECK__EXPECTED_VERSION_19_21_0 /D DLIB_JPEG_STATIC /D "CMAKE_INTDIR=\"Debug\"" /D _MBCS /Gm- /EHsc /RTC1 /MDd /GS /fp:precise /Zc:wchar_t /Zc:forScope /Zc:inline /GR /Fo"DLIB.DIR\DEBUG\\" /Fd"DLIB.DIR\DEBUG\DLIB.PDB" /Gd /TC  /bigobj C:\DLIB-19.21\SOURCE\DLIB\EXTERNAL\ZLIB\TREES.C
^C:\DLIB-19.21\SOURCE\DLIB\EXTERNAL\ZLIB\UNCOMPR.C
/c /I"C:\DLIB-19.21\SOURCE\DLIB\EXTERNAL\LIBPNG" /I"C:\DLIB-19.21\SOURCE\DLIB\EXTERNAL\ZLIB" /Zi /nologo /W3 /WX- /diagnostics:column /Od /Ob0 /D WIN32 /D _WINDOWS /D DLIB_HAVE_SSE2 /D DLIB_DISABLE_ASSERTS /D DLIB_JPEG_SUPPORT /D DLIB_PNG_SUPPORT /D DLIB__CMAKE_GENERATED_A_CONFIG_H_FILE /D DLIB_CHECK_FOR_VERSION_MISMATCH=DLIB_VERSION_MISMATCH_CHECK__EXPECTED_VERSION_19_21_0 /D DLIB_JPEG_STATIC /D "CMAKE_INTDIR=\"Debug\"" /D _MBCS /Gm- /EHsc /RTC1 /MDd /GS /fp:precise /Zc:wchar_t /Zc:forScope /Zc:inline /GR /Fo"DLIB.DIR\DEBUG\\" /Fd"DLIB.DIR\DEBUG\DLIB.PDB" /Gd /TC  /bigobj C:\DLIB-19.21\SOURCE\DLIB\EXTERNAL\ZLIB\UNCOMPR.C
^C:\DLIB-19.21\SOURCE\DLIB\EXTERNAL\ZLIB\ZUTIL.C
/c /I"C:\DLIB-19.21\SOURCE\DLIB\EXTERNAL\LIBPNG" /I"C:\DLIB-19.21\SOURCE\DLIB\EXTERNAL\ZLIB" /Zi /nologo /W3 /WX- /diagnostics:column /Od /Ob0 /D WIN32 /D _WINDOWS /D DLIB_HAVE_SSE2 /D DLIB_DISABLE_ASSERTS /D DLIB_JPEG_SUPPORT /D DLIB_PNG_SUPPORT /D DLIB__CMAKE_GENERATED_A_CONFIG_H_FILE /D DLIB_CHECK_FOR_VERSION_MISMATCH=DLIB_VERSION_MISMATCH_CHECK__EXPECTED_VERSION_19_21_0 /D DLIB_JPEG_STATIC /D "CMAKE_INTDIR=\"Debug\"" /D _MBCS /Gm- /EHsc /RTC1 /MDd /GS /fp:precise /Zc:wchar_t /Zc:forScope /Zc:inline /GR /Fo"DLIB.DIR\DEBUG\\" /Fd"DLIB.DIR\DEBUG\DLIB.PDB" /Gd /TC  /bigobj C:\DLIB-19.21\SOURCE\DLIB\EXTERNAL\ZLIB\ZUTIL.C
^C:\DLIB-19.21\SOURCE\DLIB\EXTERNAL\LIBJPEG\JARICOM.C
/c /I"C:\DLIB-19.21\SOURCE\DLIB\EXTERNAL\LIBPNG" /I"C:\DLIB-19.21\SOURCE\DLIB\EXTERNAL\ZLIB" /Zi /nologo /W3 /WX- /diagnostics:column /Od /Ob0 /D WIN32 /D _WINDOWS /D DLIB_HAVE_SSE2 /D DLIB_DISABLE_ASSERTS /D DLIB_JPEG_SUPPORT /D DLIB_PNG_SUPPORT /D DLIB__CMAKE_GENERATED_A_CONFIG_H_FILE /D DLIB_CHECK_FOR_VERSION_MISMATCH=DLIB_VERSION_MISMATCH_CHECK__EXPECTED_VERSION_19_21_0 /D DLIB_JPEG_STATIC /D "CMAKE_INTDIR=\"Debug\"" /D _MBCS /Gm- /EHsc /RTC1 /MDd /GS /fp:precise /Zc:wchar_t /Zc:forScope /Zc:inline /GR /Fo"DLIB.DIR\DEBUG\\" /Fd"DLIB.DIR\DEBUG\DLIB.PDB" /Gd /TC  /bigobj C:\DLIB-19.21\SOURCE\DLIB\EXTERNAL\LIBJPEG\JARICOM.C
^C:\DLIB-19.21\SOURCE\DLIB\EXTERNAL\LIBJPEG\JCAPIMIN.C
/c /I"C:\DLIB-19.21\SOURCE\DLIB\EXTERNAL\LIBPNG" /I"C:\DLIB-19.21\SOURCE\DLIB\EXTERNAL\ZLIB" /Zi /nologo /W3 /WX- /diagnostics:column /Od /Ob0 /D WIN32 /D _WINDOWS /D DLIB_HAVE_SSE2 /D DLIB_DISABLE_ASSERTS /D DLIB_JPEG_SUPPORT /D DLIB_PNG_SUPPORT /D DLIB__CMAKE_GENERATED_A_CONFIG_H_FILE /D DLIB_CHECK_FOR_VERSION_MISMATCH=DLIB_VERSION_MISMATCH_CHECK__EXPECTED_VERSION_19_21_0 /D DLIB_JPEG_STATIC /D "CMAKE_INTDIR=\"Debug\"" /D _MBCS /Gm- /EHsc /RTC1 /MDd /GS /fp:precise /Zc:wchar_t /Zc:forScope /Zc:inline /GR /Fo"DLIB.DIR\DEBUG\\" /Fd"DLIB.DIR\DEBUG\DLIB.PDB" /Gd /TC  /bigobj C:\DLIB-19.21\SOURCE\DLIB\EXTERNAL\LIBJPEG\JCAPIMIN.C
^C:\DLIB-19.21\SOURCE\DLIB\EXTERNAL\LIBJPEG\JCAPISTD.C
/c /I"C:\DLIB-19.21\SOURCE\DLIB\EXTERNAL\LIBPNG" /I"C:\DLIB-19.21\SOURCE\DLIB\EXTERNAL\ZLIB" /Zi /nologo /W3 /WX- /diagnostics:column /Od /Ob0 /D WIN32 /D _WINDOWS /D DLIB_HAVE_SSE2 /D DLIB_DISABLE_ASSERTS /D DLIB_JPEG_SUPPORT /D DLIB_PNG_SUPPORT /D DLIB__CMAKE_GENERATED_A_CONFIG_H_FILE /D DLIB_CHECK_FOR_VERSION_MISMATCH=DLIB_VERSION_MISMATCH_CHECK__EXPECTED_VERSION_19_21_0 /D DLIB_JPEG_STATIC /D "CMAKE_INTDIR=\"Debug\"" /D _MBCS /Gm- /EHsc /RTC1 /MDd /GS /fp:precise /Zc:wchar_t /Zc:forScope /Zc:inline /GR /Fo"DLIB.DIR\DEBUG\\" /Fd"DLIB.DIR\DEBUG\DLIB.PDB" /Gd /TC  /bigobj C:\DLIB-19.21\SOURCE\DLIB\EXTERNAL\LIBJPEG\JCAPISTD.C
^C:\DLIB-19.21\SOURCE\DLIB\EXTERNAL\LIBJPEG\JCARITH.C
/c /I"C:\DLIB-19.21\SOURCE\DLIB\EXTERNAL\LIBPNG" /I"C:\DLIB-19.21\SOURCE\DLIB\EXTERNAL\ZLIB" /Zi /nologo /W3 /WX- /diagnostics:column /Od /Ob0 /D WIN32 /D _WINDOWS /D DLIB_HAVE_SSE2 /D DLIB_DISABLE_ASSERTS /D DLIB_JPEG_SUPPORT /D DLIB_PNG_SUPPORT /D DLIB__CMAKE_GENERATED_A_CONFIG_H_FILE /D DLIB_CHECK_FOR_VERSION_MISMATCH=DLIB_VERSION_MISMATCH_CHECK__EXPECTED_VERSION_19_21_0 /D DLIB_JPEG_STATIC /D "CMAKE_INTDIR=\"Debug\"" /D _MBCS /Gm- /EHsc /RTC1 /MDd /GS /fp:precise /Zc:wchar_t /Zc:forScope /Zc:inline /GR /Fo"DLIB.DIR\DEBUG\\" /Fd"DLIB.DIR\DEBUG\DLIB.PDB" /Gd /TC  /bigobj C:\DLIB-19.21\SOURCE\DLIB\EXTERNAL\LIBJPEG\JCARITH.C
^C:\DLIB-19.21\SOURCE\DLIB\EXTERNAL\LIBJPEG\JCCOEFCT.C
/c /I"C:\DLIB-19.21\SOURCE\DLIB\EXTERNAL\LIBPNG" /I"C:\DLIB-19.21\SOURCE\DLIB\EXTERNAL\ZLIB" /Zi /nologo /W3 /WX- /diagnostics:column /Od /Ob0 /D WIN32 /D _WINDOWS /D DLIB_HAVE_SSE2 /D DLIB_DISABLE_ASSERTS /D DLIB_JPEG_SUPPORT /D DLIB_PNG_SUPPORT /D DLIB__CMAKE_GENERATED_A_CONFIG_H_FILE /D DLIB_CHECK_FOR_VERSION_MISMATCH=DLIB_VERSION_MISMATCH_CHECK__EXPECTED_VERSION_19_21_0 /D DLIB_JPEG_STATIC /D "CMAKE_INTDIR=\"Debug\"" /D _MBCS /Gm- /EHsc /RTC1 /MDd /GS /fp:precise /Zc:wchar_t /Zc:forScope /Zc:inline /GR /Fo"DLIB.DIR\DEBUG\\" /Fd"DLIB.DIR\DEBUG\DLIB.PDB" /Gd /TC  /bigobj C:\DLIB-19.21\SOURCE\DLIB\EXTERNAL\LIBJPEG\JCCOEFCT.C
^C:\DLIB-19.21\SOURCE\DLIB\EXTERNAL\LIBJPEG\JCCOLOR.C
/c /I"C:\DLIB-19.21\SOURCE\DLIB\EXTERNAL\LIBPNG" /I"C:\DLIB-19.21\SOURCE\DLIB\EXTERNAL\ZLIB" /Zi /nologo /W3 /WX- /diagnostics:column /Od /Ob0 /D WIN32 /D _WINDOWS /D DLIB_HAVE_SSE2 /D DLIB_DISABLE_ASSERTS /D DLIB_JPEG_SUPPORT /D DLIB_PNG_SUPPORT /D DLIB__CMAKE_GENERATED_A_CONFIG_H_FILE /D DLIB_CHECK_FOR_VERSION_MISMATCH=DLIB_VERSION_MISMATCH_CHECK__EXPECTED_VERSION_19_21_0 /D DLIB_JPEG_STATIC /D "CMAKE_INTDIR=\"Debug\"" /D _MBCS /Gm- /EHsc /RTC1 /MDd /GS /fp:precise /Zc:wchar_t /Zc:forScope /Zc:inline /GR /Fo"DLIB.DIR\DEBUG\\" /Fd"DLIB.DIR\DEBUG\DLIB.PDB" /Gd /TC  /bigobj C:\DLIB-19.21\SOURCE\DLIB\EXTERNAL\LIBJPEG\JCCOLOR.C
^C:\DLIB-19.21\SOURCE\DLIB\EXTERNAL\LIBJPEG\JCDCTMGR.C
/c /I"C:\DLIB-19.21\SOURCE\DLIB\EXTERNAL\LIBPNG" /I"C:\DLIB-19.21\SOURCE\DLIB\EXTERNAL\ZLIB" /Zi /nologo /W3 /WX- /diagnostics:column /Od /Ob0 /D WIN32 /D _WINDOWS /D DLIB_HAVE_SSE2 /D DLIB_DISABLE_ASSERTS /D DLIB_JPEG_SUPPORT /D DLIB_PNG_SUPPORT /D DLIB__CMAKE_GENERATED_A_CONFIG_H_FILE /D DLIB_CHECK_FOR_VERSION_MISMATCH=DLIB_VERSION_MISMATCH_CHECK__EXPECTED_VERSION_19_21_0 /D DLIB_JPEG_STATIC /D "CMAKE_INTDIR=\"Debug\"" /D _MBCS /Gm- /EHsc /RTC1 /MDd /GS /fp:precise /Zc:wchar_t /Zc:forScope /Zc:inline /GR /Fo"DLIB.DIR\DEBUG\\" /Fd"DLIB.DIR\DEBUG\DLIB.PDB" /Gd /TC  /bigobj C:\DLIB-19.21\SOURCE\DLIB\EXTERNAL\LIBJPEG\JCDCTMGR.C
^C:\DLIB-19.21\SOURCE\DLIB\EXTERNAL\LIBJPEG\JCHUFF.C
/c /I"C:\DLIB-19.21\SOURCE\DLIB\EXTERNAL\LIBPNG" /I"C:\DLIB-19.21\SOURCE\DLIB\EXTERNAL\ZLIB" /Zi /nologo /W3 /WX- /diagnostics:column /Od /Ob0 /D WIN32 /D _WINDOWS /D DLIB_HAVE_SSE2 /D DLIB_DISABLE_ASSERTS /D DLIB_JPEG_SUPPORT /D DLIB_PNG_SUPPORT /D DLIB__CMAKE_GENERATED_A_CONFIG_H_FILE /D DLIB_CHECK_FOR_VERSION_MISMATCH=DLIB_VERSION_MISMATCH_CHECK__EXPECTED_VERSION_19_21_0 /D DLIB_JPEG_STATIC /D "CMAKE_INTDIR=\"Debug\"" /D _MBCS /Gm- /EHsc /RTC1 /MDd /GS /fp:precise /Zc:wchar_t /Zc:forScope /Zc:inline /GR /Fo"DLIB.DIR\DEBUG\\" /Fd"DLIB.DIR\DEBUG\DLIB.PDB" /Gd /TC  /bigobj C:\DLIB-19.21\SOURCE\DLIB\EXTERNAL\LIBJPEG\JCHUFF.C
^C:\DLIB-19.21\SOURCE\DLIB\EXTERNAL\LIBJPEG\JCINIT.C
/c /I"C:\DLIB-19.21\SOURCE\DLIB\EXTERNAL\LIBPNG" /I"C:\DLIB-19.21\SOURCE\DLIB\EXTERNAL\ZLIB" /Zi /nologo /W3 /WX- /diagnostics:column /Od /Ob0 /D WIN32 /D _WINDOWS /D DLIB_HAVE_SSE2 /D DLIB_DISABLE_ASSERTS /D DLIB_JPEG_SUPPORT /D DLIB_PNG_SUPPORT /D DLIB__CMAKE_GENERATED_A_CONFIG_H_FILE /D DLIB_CHECK_FOR_VERSION_MISMATCH=DLIB_VERSION_MISMATCH_CHECK__EXPECTED_VERSION_19_21_0 /D DLIB_JPEG_STATIC /D "CMAKE_INTDIR=\"Debug\"" /D _MBCS /Gm- /EHsc /RTC1 /MDd /GS /fp:precise /Zc:wchar_t /Zc:forScope /Zc:inline /GR /Fo"DLIB.DIR\DEBUG\\" /Fd"DLIB.DIR\DEBUG\DLIB.PDB" /Gd /TC  /bigobj C:\DLIB-19.21\SOURCE\DLIB\EXTERNAL\LIBJPEG\JCINIT.C
^C:\DLIB-19.21\SOURCE\DLIB\EXTERNAL\LIBJPEG\JCMAINCT.C
/c /I"C:\DLIB-19.21\SOURCE\DLIB\EXTERNAL\LIBPNG" /I"C:\DLIB-19.21\SOURCE\DLIB\EXTERNAL\ZLIB" /Zi /nologo /W3 /WX- /diagnostics:column /Od /Ob0 /D WIN32 /D _WINDOWS /D DLIB_HAVE_SSE2 /D DLIB_DISABLE_ASSERTS /D DLIB_JPEG_SUPPORT /D DLIB_PNG_SUPPORT /D DLIB__CMAKE_GENERATED_A_CONFIG_H_FILE /D DLIB_CHECK_FOR_VERSION_MISMATCH=DLIB_VERSION_MISMATCH_CHECK__EXPECTED_VERSION_19_21_0 /D DLIB_JPEG_STATIC /D "CMAKE_INTDIR=\"Debug\"" /D _MBCS /Gm- /EHsc /RTC1 /MDd /GS /fp:precise /Zc:wchar_t /Zc:forScope /Zc:inline /GR /Fo"DLIB.DIR\DEBUG\\" /Fd"DLIB.DIR\DEBUG\DLIB.PDB" /Gd /TC  /bigobj C:\DLIB-19.21\SOURCE\DLIB\EXTERNAL\LIBJPEG\JCMAINCT.C
^C:\DLIB-19.21\SOURCE\DLIB\EXTERNAL\LIBJPEG\JCMARKER.C
/c /I"C:\DLIB-19.21\SOURCE\DLIB\EXTERNAL\LIBPNG" /I"C:\DLIB-19.21\SOURCE\DLIB\EXTERNAL\ZLIB" /Zi /nologo /W3 /WX- /diagnostics:column /Od /Ob0 /D WIN32 /D _WINDOWS /D DLIB_HAVE_SSE2 /D DLIB_DISABLE_ASSERTS /D DLIB_JPEG_SUPPORT /D DLIB_PNG_SUPPORT /D DLIB__CMAKE_GENERATED_A_CONFIG_H_FILE /D DLIB_CHECK_FOR_VERSION_MISMATCH=DLIB_VERSION_MISMATCH_CHECK__EXPECTED_VERSION_19_21_0 /D DLIB_JPEG_STATIC /D "CMAKE_INTDIR=\"Debug\"" /D _MBCS /Gm- /EHsc /RTC1 /MDd /GS /fp:precise /Zc:wchar_t /Zc:forScope /Zc:inline /GR /Fo"DLIB.DIR\DEBUG\\" /Fd"DLIB.DIR\DEBUG\DLIB.PDB" /Gd /TC  /bigobj C:\DLIB-19.21\SOURCE\DLIB\EXTERNAL\LIBJPEG\JCMARKER.C
^C:\DLIB-19.21\SOURCE\DLIB\EXTERNAL\LIBJPEG\JCMASTER.C
/c /I"C:\DLIB-19.21\SOURCE\DLIB\EXTERNAL\LIBPNG" /I"C:\DLIB-19.21\SOURCE\DLIB\EXTERNAL\ZLIB" /Zi /nologo /W3 /WX- /diagnostics:column /Od /Ob0 /D WIN32 /D _WINDOWS /D DLIB_HAVE_SSE2 /D DLIB_DISABLE_ASSERTS /D DLIB_JPEG_SUPPORT /D DLIB_PNG_SUPPORT /D DLIB__CMAKE_GENERATED_A_CONFIG_H_FILE /D DLIB_CHECK_FOR_VERSION_MISMATCH=DLIB_VERSION_MISMATCH_CHECK__EXPECTED_VERSION_19_21_0 /D DLIB_JPEG_STATIC /D "CMAKE_INTDIR=\"Debug\"" /D _MBCS /Gm- /EHsc /RTC1 /MDd /GS /fp:precise /Zc:wchar_t /Zc:forScope /Zc:inline /GR /Fo"DLIB.DIR\DEBUG\\" /Fd"DLIB.DIR\DEBUG\DLIB.PDB" /Gd /TC  /bigobj C:\DLIB-19.21\SOURCE\DLIB\EXTERNAL\LIBJPEG\JCMASTER.C
^C:\DLIB-19.21\SOURCE\DLIB\EXTERNAL\LIBJPEG\JCOMAPI.C
/c /I"C:\DLIB-19.21\SOURCE\DLIB\EXTERNAL\LIBPNG" /I"C:\DLIB-19.21\SOURCE\DLIB\EXTERNAL\ZLIB" /Zi /nologo /W3 /WX- /diagnostics:column /Od /Ob0 /D WIN32 /D _WINDOWS /D DLIB_HAVE_SSE2 /D DLIB_DISABLE_ASSERTS /D DLIB_JPEG_SUPPORT /D DLIB_PNG_SUPPORT /D DLIB__CMAKE_GENERATED_A_CONFIG_H_FILE /D DLIB_CHECK_FOR_VERSION_MISMATCH=DLIB_VERSION_MISMATCH_CHECK__EXPECTED_VERSION_19_21_0 /D DLIB_JPEG_STATIC /D "CMAKE_INTDIR=\"Debug\"" /D _MBCS /Gm- /EHsc /RTC1 /MDd /GS /fp:precise /Zc:wchar_t /Zc:forScope /Zc:inline /GR /Fo"DLIB.DIR\DEBUG\\" /Fd"DLIB.DIR\DEBUG\DLIB.PDB" /Gd /TC  /bigobj C:\DLIB-19.21\SOURCE\DLIB\EXTERNAL\LIBJPEG\JCOMAPI.C
^C:\DLIB-19.21\SOURCE\DLIB\EXTERNAL\LIBJPEG\JCPARAM.C
/c /I"C:\DLIB-19.21\SOURCE\DLIB\EXTERNAL\LIBPNG" /I"C:\DLIB-19.21\SOURCE\DLIB\EXTERNAL\ZLIB" /Zi /nologo /W3 /WX- /diagnostics:column /Od /Ob0 /D WIN32 /D _WINDOWS /D DLIB_HAVE_SSE2 /D DLIB_DISABLE_ASSERTS /D DLIB_JPEG_SUPPORT /D DLIB_PNG_SUPPORT /D DLIB__CMAKE_GENERATED_A_CONFIG_H_FILE /D DLIB_CHECK_FOR_VERSION_MISMATCH=DLIB_VERSION_MISMATCH_CHECK__EXPECTED_VERSION_19_21_0 /D DLIB_JPEG_STATIC /D "CMAKE_INTDIR=\"Debug\"" /D _MBCS /Gm- /EHsc /RTC1 /MDd /GS /fp:precise /Zc:wchar_t /Zc:forScope /Zc:inline /GR /Fo"DLIB.DIR\DEBUG\\" /Fd"DLIB.DIR\DEBUG\DLIB.PDB" /Gd /TC  /bigobj C:\DLIB-19.21\SOURCE\DLIB\EXTERNAL\LIBJPEG\JCPARAM.C
^C:\DLIB-19.21\SOURCE\DLIB\EXTERNAL\LIBJPEG\JCPREPCT.C
/c /I"C:\DLIB-19.21\SOURCE\DLIB\EXTERNAL\LIBPNG" /I"C:\DLIB-19.21\SOURCE\DLIB\EXTERNAL\ZLIB" /Zi /nologo /W3 /WX- /diagnostics:column /Od /Ob0 /D WIN32 /D _WINDOWS /D DLIB_HAVE_SSE2 /D DLIB_DISABLE_ASSERTS /D DLIB_JPEG_SUPPORT /D DLIB_PNG_SUPPORT /D DLIB__CMAKE_GENERATED_A_CONFIG_H_FILE /D DLIB_CHECK_FOR_VERSION_MISMATCH=DLIB_VERSION_MISMATCH_CHECK__EXPECTED_VERSION_19_21_0 /D DLIB_JPEG_STATIC /D "CMAKE_INTDIR=\"Debug\"" /D _MBCS /Gm- /EHsc /RTC1 /MDd /GS /fp:precise /Zc:wchar_t /Zc:forScope /Zc:inline /GR /Fo"DLIB.DIR\DEBUG\\" /Fd"DLIB.DIR\DEBUG\DLIB.PDB" /Gd /TC  /bigobj C:\DLIB-19.21\SOURCE\DLIB\EXTERNAL\LIBJPEG\JCPREPCT.C
^C:\DLIB-19.21\SOURCE\DLIB\EXTERNAL\LIBJPEG\JCSAMPLE.C
/c /I"C:\DLIB-19.21\SOURCE\DLIB\EXTERNAL\LIBPNG" /I"C:\DLIB-19.21\SOURCE\DLIB\EXTERNAL\ZLIB" /Zi /nologo /W3 /WX- /diagnostics:column /Od /Ob0 /D WIN32 /D _WINDOWS /D DLIB_HAVE_SSE2 /D DLIB_DISABLE_ASSERTS /D DLIB_JPEG_SUPPORT /D DLIB_PNG_SUPPORT /D DLIB__CMAKE_GENERATED_A_CONFIG_H_FILE /D DLIB_CHECK_FOR_VERSION_MISMATCH=DLIB_VERSION_MISMATCH_CHECK__EXPECTED_VERSION_19_21_0 /D DLIB_JPEG_STATIC /D "CMAKE_INTDIR=\"Debug\"" /D _MBCS /Gm- /EHsc /RTC1 /MDd /GS /fp:precise /Zc:wchar_t /Zc:forScope /Zc:inline /GR /Fo"DLIB.DIR\DEBUG\\" /Fd"DLIB.DIR\DEBUG\DLIB.PDB" /Gd /TC  /bigobj C:\DLIB-19.21\SOURCE\DLIB\EXTERNAL\LIBJPEG\JCSAMPLE.C
^C:\DLIB-19.21\SOURCE\DLIB\EXTERNAL\LIBJPEG\JDAPIMIN.C
/c /I"C:\DLIB-19.21\SOURCE\DLIB\EXTERNAL\LIBPNG" /I"C:\DLIB-19.21\SOURCE\DLIB\EXTERNAL\ZLIB" /Zi /nologo /W3 /WX- /diagnostics:column /Od /Ob0 /D WIN32 /D _WINDOWS /D DLIB_HAVE_SSE2 /D DLIB_DISABLE_ASSERTS /D DLIB_JPEG_SUPPORT /D DLIB_PNG_SUPPORT /D DLIB__CMAKE_GENERATED_A_CONFIG_H_FILE /D DLIB_CHECK_FOR_VERSION_MISMATCH=DLIB_VERSION_MISMATCH_CHECK__EXPECTED_VERSION_19_21_0 /D DLIB_JPEG_STATIC /D "CMAKE_INTDIR=\"Debug\"" /D _MBCS /Gm- /EHsc /RTC1 /MDd /GS /fp:precise /Zc:wchar_t /Zc:forScope /Zc:inline /GR /Fo"DLIB.DIR\DEBUG\\" /Fd"DLIB.DIR\DEBUG\DLIB.PDB" /Gd /TC  /bigobj C:\DLIB-19.21\SOURCE\DLIB\EXTERNAL\LIBJPEG\JDAPIMIN.C
^C:\DLIB-19.21\SOURCE\DLIB\EXTERNAL\LIBJPEG\JDAPISTD.C
/c /I"C:\DLIB-19.21\SOURCE\DLIB\EXTERNAL\LIBPNG" /I"C:\DLIB-19.21\SOURCE\DLIB\EXTERNAL\ZLIB" /Zi /nologo /W3 /WX- /diagnostics:column /Od /Ob0 /D WIN32 /D _WINDOWS /D DLIB_HAVE_SSE2 /D DLIB_DISABLE_ASSERTS /D DLIB_JPEG_SUPPORT /D DLIB_PNG_SUPPORT /D DLIB__CMAKE_GENERATED_A_CONFIG_H_FILE /D DLIB_CHECK_FOR_VERSION_MISMATCH=DLIB_VERSION_MISMATCH_CHECK__EXPECTED_VERSION_19_21_0 /D DLIB_JPEG_STATIC /D "CMAKE_INTDIR=\"Debug\"" /D _MBCS /Gm- /EHsc /RTC1 /MDd /GS /fp:precise /Zc:wchar_t /Zc:forScope /Zc:inline /GR /Fo"DLIB.DIR\DEBUG\\" /Fd"DLIB.DIR\DEBUG\DLIB.PDB" /Gd /TC  /bigobj C:\DLIB-19.21\SOURCE\DLIB\EXTERNAL\LIBJPEG\JDAPISTD.C
^C:\DLIB-19.21\SOURCE\DLIB\EXTERNAL\LIBJPEG\JDARITH.C
/c /I"C:\DLIB-19.21\SOURCE\DLIB\EXTERNAL\LIBPNG" /I"C:\DLIB-19.21\SOURCE\DLIB\EXTERNAL\ZLIB" /Zi /nologo /W3 /WX- /diagnostics:column /Od /Ob0 /D WIN32 /D _WINDOWS /D DLIB_HAVE_SSE2 /D DLIB_DISABLE_ASSERTS /D DLIB_JPEG_SUPPORT /D DLIB_PNG_SUPPORT /D DLIB__CMAKE_GENERATED_A_CONFIG_H_FILE /D DLIB_CHECK_FOR_VERSION_MISMATCH=DLIB_VERSION_MISMATCH_CHECK__EXPECTED_VERSION_19_21_0 /D DLIB_JPEG_STATIC /D "CMAKE_INTDIR=\"Debug\"" /D _MBCS /Gm- /EHsc /RTC1 /MDd /GS /fp:precise /Zc:wchar_t /Zc:forScope /Zc:inline /GR /Fo"DLIB.DIR\DEBUG\\" /Fd"DLIB.DIR\DEBUG\DLIB.PDB" /Gd /TC  /bigobj C:\DLIB-19.21\SOURCE\DLIB\EXTERNAL\LIBJPEG\JDARITH.C
^C:\DLIB-19.21\SOURCE\DLIB\EXTERNAL\LIBJPEG\JDATADST.C
/c /I"C:\DLIB-19.21\SOURCE\DLIB\EXTERNAL\LIBPNG" /I"C:\DLIB-19.21\SOURCE\DLIB\EXTERNAL\ZLIB" /Zi /nologo /W3 /WX- /diagnostics:column /Od /Ob0 /D WIN32 /D _WINDOWS /D DLIB_HAVE_SSE2 /D DLIB_DISABLE_ASSERTS /D DLIB_JPEG_SUPPORT /D DLIB_PNG_SUPPORT /D DLIB__CMAKE_GENERATED_A_CONFIG_H_FILE /D DLIB_CHECK_FOR_VERSION_MISMATCH=DLIB_VERSION_MISMATCH_CHECK__EXPECTED_VERSION_19_21_0 /D DLIB_JPEG_STATIC /D "CMAKE_INTDIR=\"Debug\"" /D _MBCS /Gm- /EHsc /RTC1 /MDd /GS /fp:precise /Zc:wchar_t /Zc:forScope /Zc:inline /GR /Fo"DLIB.DIR\DEBUG\\" /Fd"DLIB.DIR\DEBUG\DLIB.PDB" /Gd /TC  /bigobj C:\DLIB-19.21\SOURCE\DLIB\EXTERNAL\LIBJPEG\JDATADST.C
^C:\DLIB-19.21\SOURCE\DLIB\EXTERNAL\LIBJPEG\JDATASRC.C
/c /I"C:\DLIB-19.21\SOURCE\DLIB\EXTERNAL\LIBPNG" /I"C:\DLIB-19.21\SOURCE\DLIB\EXTERNAL\ZLIB" /Zi /nologo /W3 /WX- /diagnostics:column /Od /Ob0 /D WIN32 /D _WINDOWS /D DLIB_HAVE_SSE2 /D DLIB_DISABLE_ASSERTS /D DLIB_JPEG_SUPPORT /D DLIB_PNG_SUPPORT /D DLIB__CMAKE_GENERATED_A_CONFIG_H_FILE /D DLIB_CHECK_FOR_VERSION_MISMATCH=DLIB_VERSION_MISMATCH_CHECK__EXPECTED_VERSION_19_21_0 /D DLIB_JPEG_STATIC /D "CMAKE_INTDIR=\"Debug\"" /D _MBCS /Gm- /EHsc /RTC1 /MDd /GS /fp:precise /Zc:wchar_t /Zc:forScope /Zc:inline /GR /Fo"DLIB.DIR\DEBUG\\" /Fd"DLIB.DIR\DEBUG\DLIB.PDB" /Gd /TC  /bigobj C:\DLIB-19.21\SOURCE\DLIB\EXTERNAL\LIBJPEG\JDATASRC.C
^C:\DLIB-19.21\SOURCE\DLIB\EXTERNAL\LIBJPEG\JDCOEFCT.C
/c /I"C:\DLIB-19.21\SOURCE\DLIB\EXTERNAL\LIBPNG" /I"C:\DLIB-19.21\SOURCE\DLIB\EXTERNAL\ZLIB" /Zi /nologo /W3 /WX- /diagnostics:column /Od /Ob0 /D WIN32 /D _WINDOWS /D DLIB_HAVE_SSE2 /D DLIB_DISABLE_ASSERTS /D DLIB_JPEG_SUPPORT /D DLIB_PNG_SUPPORT /D DLIB__CMAKE_GENERATED_A_CONFIG_H_FILE /D DLIB_CHECK_FOR_VERSION_MISMATCH=DLIB_VERSION_MISMATCH_CHECK__EXPECTED_VERSION_19_21_0 /D DLIB_JPEG_STATIC /D "CMAKE_INTDIR=\"Debug\"" /D _MBCS /Gm- /EHsc /RTC1 /MDd /GS /fp:precise /Zc:wchar_t /Zc:forScope /Zc:inline /GR /Fo"DLIB.DIR\DEBUG\\" /Fd"DLIB.DIR\DEBUG\DLIB.PDB" /Gd /TC  /bigobj C:\DLIB-19.21\SOURCE\DLIB\EXTERNAL\LIBJPEG\JDCOEFCT.C
^C:\DLIB-19.21\SOURCE\DLIB\EXTERNAL\LIBJPEG\JDCOLOR.C
/c /I"C:\DLIB-19.21\SOURCE\DLIB\EXTERNAL\LIBPNG" /I"C:\DLIB-19.21\SOURCE\DLIB\EXTERNAL\ZLIB" /Zi /nologo /W3 /WX- /diagnostics:column /Od /Ob0 /D WIN32 /D _WINDOWS /D DLIB_HAVE_SSE2 /D DLIB_DISABLE_ASSERTS /D DLIB_JPEG_SUPPORT /D DLIB_PNG_SUPPORT /D DLIB__CMAKE_GENERATED_A_CONFIG_H_FILE /D DLIB_CHECK_FOR_VERSION_MISMATCH=DLIB_VERSION_MISMATCH_CHECK__EXPECTED_VERSION_19_21_0 /D DLIB_JPEG_STATIC /D "CMAKE_INTDIR=\"Debug\"" /D _MBCS /Gm- /EHsc /RTC1 /MDd /GS /fp:precise /Zc:wchar_t /Zc:forScope /Zc:inline /GR /Fo"DLIB.DIR\DEBUG\\" /Fd"DLIB.DIR\DEBUG\DLIB.PDB" /Gd /TC  /bigobj C:\DLIB-19.21\SOURCE\DLIB\EXTERNAL\LIBJPEG\JDCOLOR.C
^C:\DLIB-19.21\SOURCE\DLIB\EXTERNAL\LIBJPEG\JDDCTMGR.C
/c /I"C:\DLIB-19.21\SOURCE\DLIB\EXTERNAL\LIBPNG" /I"C:\DLIB-19.21\SOURCE\DLIB\EXTERNAL\ZLIB" /Zi /nologo /W3 /WX- /diagnostics:column /Od /Ob0 /D WIN32 /D _WINDOWS /D DLIB_HAVE_SSE2 /D DLIB_DISABLE_ASSERTS /D DLIB_JPEG_SUPPORT /D DLIB_PNG_SUPPORT /D DLIB__CMAKE_GENERATED_A_CONFIG_H_FILE /D DLIB_CHECK_FOR_VERSION_MISMATCH=DLIB_VERSION_MISMATCH_CHECK__EXPECTED_VERSION_19_21_0 /D DLIB_JPEG_STATIC /D "CMAKE_INTDIR=\"Debug\"" /D _MBCS /Gm- /EHsc /RTC1 /MDd /GS /fp:precise /Zc:wchar_t /Zc:forScope /Zc:inline /GR /Fo"DLIB.DIR\DEBUG\\" /Fd"DLIB.DIR\DEBUG\DLIB.PDB" /Gd /TC  /bigobj C:\DLIB-19.21\SOURCE\DLIB\EXTERNAL\LIBJPEG\JDDCTMGR.C
^C:\DLIB-19.21\SOURCE\DLIB\EXTERNAL\LIBJPEG\JDHUFF.C
/c /I"C:\DLIB-19.21\SOURCE\DLIB\EXTERNAL\LIBPNG" /I"C:\DLIB-19.21\SOURCE\DLIB\EXTERNAL\ZLIB" /Zi /nologo /W3 /WX- /diagnostics:column /Od /Ob0 /D WIN32 /D _WINDOWS /D DLIB_HAVE_SSE2 /D DLIB_DISABLE_ASSERTS /D DLIB_JPEG_SUPPORT /D DLIB_PNG_SUPPORT /D DLIB__CMAKE_GENERATED_A_CONFIG_H_FILE /D DLIB_CHECK_FOR_VERSION_MISMATCH=DLIB_VERSION_MISMATCH_CHECK__EXPECTED_VERSION_19_21_0 /D DLIB_JPEG_STATIC /D "CMAKE_INTDIR=\"Debug\"" /D _MBCS /Gm- /EHsc /RTC1 /MDd /GS /fp:precise /Zc:wchar_t /Zc:forScope /Zc:inline /GR /Fo"DLIB.DIR\DEBUG\\" /Fd"DLIB.DIR\DEBUG\DLIB.PDB" /Gd /TC  /bigobj C:\DLIB-19.21\SOURCE\DLIB\EXTERNAL\LIBJPEG\JDHUFF.C
^C:\DLIB-19.21\SOURCE\DLIB\EXTERNAL\LIBJPEG\JDINPUT.C
/c /I"C:\DLIB-19.21\SOURCE\DLIB\EXTERNAL\LIBPNG" /I"C:\DLIB-19.21\SOURCE\DLIB\EXTERNAL\ZLIB" /Zi /nologo /W3 /WX- /diagnostics:column /Od /Ob0 /D WIN32 /D _WINDOWS /D DLIB_HAVE_SSE2 /D DLIB_DISABLE_ASSERTS /D DLIB_JPEG_SUPPORT /D DLIB_PNG_SUPPORT /D DLIB__CMAKE_GENERATED_A_CONFIG_H_FILE /D DLIB_CHECK_FOR_VERSION_MISMATCH=DLIB_VERSION_MISMATCH_CHECK__EXPECTED_VERSION_19_21_0 /D DLIB_JPEG_STATIC /D "CMAKE_INTDIR=\"Debug\"" /D _MBCS /Gm- /EHsc /RTC1 /MDd /GS /fp:precise /Zc:wchar_t /Zc:forScope /Zc:inline /GR /Fo"DLIB.DIR\DEBUG\\" /Fd"DLIB.DIR\DEBUG\DLIB.PDB" /Gd /TC  /bigobj C:\DLIB-19.21\SOURCE\DLIB\EXTERNAL\LIBJPEG\JDINPUT.C
^C:\DLIB-19.21\SOURCE\DLIB\EXTERNAL\LIBJPEG\JDMAINCT.C
/c /I"C:\DLIB-19.21\SOURCE\DLIB\EXTERNAL\LIBPNG" /I"C:\DLIB-19.21\SOURCE\DLIB\EXTERNAL\ZLIB" /Zi /nologo /W3 /WX- /diagnostics:column /Od /Ob0 /D WIN32 /D _WINDOWS /D DLIB_HAVE_SSE2 /D DLIB_DISABLE_ASSERTS /D DLIB_JPEG_SUPPORT /D DLIB_PNG_SUPPORT /D DLIB__CMAKE_GENERATED_A_CONFIG_H_FILE /D DLIB_CHECK_FOR_VERSION_MISMATCH=DLIB_VERSION_MISMATCH_CHECK__EXPECTED_VERSION_19_21_0 /D DLIB_JPEG_STATIC /D "CMAKE_INTDIR=\"Debug\"" /D _MBCS /Gm- /EHsc /RTC1 /MDd /GS /fp:precise /Zc:wchar_t /Zc:forScope /Zc:inline /GR /Fo"DLIB.DIR\DEBUG\\" /Fd"DLIB.DIR\DEBUG\DLIB.PDB" /Gd /TC  /bigobj C:\DLIB-19.21\SOURCE\DLIB\EXTERNAL\LIBJPEG\JDMAINCT.C
^C:\DLIB-19.21\SOURCE\DLIB\EXTERNAL\LIBJPEG\JDMARKER.C
/c /I"C:\DLIB-19.21\SOURCE\DLIB\EXTERNAL\LIBPNG" /I"C:\DLIB-19.21\SOURCE\DLIB\EXTERNAL\ZLIB" /Zi /nologo /W3 /WX- /diagnostics:column /Od /Ob0 /D WIN32 /D _WINDOWS /D DLIB_HAVE_SSE2 /D DLIB_DISABLE_ASSERTS /D DLIB_JPEG_SUPPORT /D DLIB_PNG_SUPPORT /D DLIB__CMAKE_GENERATED_A_CONFIG_H_FILE /D DLIB_CHECK_FOR_VERSION_MISMATCH=DLIB_VERSION_MISMATCH_CHECK__EXPECTED_VERSION_19_21_0 /D DLIB_JPEG_STATIC /D "CMAKE_INTDIR=\"Debug\"" /D _MBCS /Gm- /EHsc /RTC1 /MDd /GS /fp:precise /Zc:wchar_t /Zc:forScope /Zc:inline /GR /Fo"DLIB.DIR\DEBUG\\" /Fd"DLIB.DIR\DEBUG\DLIB.PDB" /Gd /TC  /bigobj C:\DLIB-19.21\SOURCE\DLIB\EXTERNAL\LIBJPEG\JDMARKER.C
^C:\DLIB-19.21\SOURCE\DLIB\EXTERNAL\LIBJPEG\JDMASTER.C
/c /I"C:\DLIB-19.21\SOURCE\DLIB\EXTERNAL\LIBPNG" /I"C:\DLIB-19.21\SOURCE\DLIB\EXTERNAL\ZLIB" /Zi /nologo /W3 /WX- /diagnostics:column /Od /Ob0 /D WIN32 /D _WINDOWS /D DLIB_HAVE_SSE2 /D DLIB_DISABLE_ASSERTS /D DLIB_JPEG_SUPPORT /D DLIB_PNG_SUPPORT /D DLIB__CMAKE_GENERATED_A_CONFIG_H_FILE /D DLIB_CHECK_FOR_VERSION_MISMATCH=DLIB_VERSION_MISMATCH_CHECK__EXPECTED_VERSION_19_21_0 /D DLIB_JPEG_STATIC /D "CMAKE_INTDIR=\"Debug\"" /D _MBCS /Gm- /EHsc /RTC1 /MDd /GS /fp:precise /Zc:wchar_t /Zc:forScope /Zc:inline /GR /Fo"DLIB.DIR\DEBUG\\" /Fd"DLIB.DIR\DEBUG\DLIB.PDB" /Gd /TC  /bigobj C:\DLIB-19.21\SOURCE\DLIB\EXTERNAL\LIBJPEG\JDMASTER.C
^C:\DLIB-19.21\SOURCE\DLIB\EXTERNAL\LIBJPEG\JDMERGE.C
/c /I"C:\DLIB-19.21\SOURCE\DLIB\EXTERNAL\LIBPNG" /I"C:\DLIB-19.21\SOURCE\DLIB\EXTERNAL\ZLIB" /Zi /nologo /W3 /WX- /diagnostics:column /Od /Ob0 /D WIN32 /D _WINDOWS /D DLIB_HAVE_SSE2 /D DLIB_DISABLE_ASSERTS /D DLIB_JPEG_SUPPORT /D DLIB_PNG_SUPPORT /D DLIB__CMAKE_GENERATED_A_CONFIG_H_FILE /D DLIB_CHECK_FOR_VERSION_MISMATCH=DLIB_VERSION_MISMATCH_CHECK__EXPECTED_VERSION_19_21_0 /D DLIB_JPEG_STATIC /D "CMAKE_INTDIR=\"Debug\"" /D _MBCS /Gm- /EHsc /RTC1 /MDd /GS /fp:precise /Zc:wchar_t /Zc:forScope /Zc:inline /GR /Fo"DLIB.DIR\DEBUG\\" /Fd"DLIB.DIR\DEBUG\DLIB.PDB" /Gd /TC  /bigobj C:\DLIB-19.21\SOURCE\DLIB\EXTERNAL\LIBJPEG\JDMERGE.C
^C:\DLIB-19.21\SOURCE\DLIB\EXTERNAL\LIBJPEG\JDPOSTCT.C
/c /I"C:\DLIB-19.21\SOURCE\DLIB\EXTERNAL\LIBPNG" /I"C:\DLIB-19.21\SOURCE\DLIB\EXTERNAL\ZLIB" /Zi /nologo /W3 /WX- /diagnostics:column /Od /Ob0 /D WIN32 /D _WINDOWS /D DLIB_HAVE_SSE2 /D DLIB_DISABLE_ASSERTS /D DLIB_JPEG_SUPPORT /D DLIB_PNG_SUPPORT /D DLIB__CMAKE_GENERATED_A_CONFIG_H_FILE /D DLIB_CHECK_FOR_VERSION_MISMATCH=DLIB_VERSION_MISMATCH_CHECK__EXPECTED_VERSION_19_21_0 /D DLIB_JPEG_STATIC /D "CMAKE_INTDIR=\"Debug\"" /D _MBCS /Gm- /EHsc /RTC1 /MDd /GS /fp:precise /Zc:wchar_t /Zc:forScope /Zc:inline /GR /Fo"DLIB.DIR\DEBUG\\" /Fd"DLIB.DIR\DEBUG\DLIB.PDB" /Gd /TC  /bigobj C:\DLIB-19.21\SOURCE\DLIB\EXTERNAL\LIBJPEG\JDPOSTCT.C
^C:\DLIB-19.21\SOURCE\DLIB\EXTERNAL\LIBJPEG\JDSAMPLE.C
/c /I"C:\DLIB-19.21\SOURCE\DLIB\EXTERNAL\LIBPNG" /I"C:\DLIB-19.21\SOURCE\DLIB\EXTERNAL\ZLIB" /Zi /nologo /W3 /WX- /diagnostics:column /Od /Ob0 /D WIN32 /D _WINDOWS /D DLIB_HAVE_SSE2 /D DLIB_DISABLE_ASSERTS /D DLIB_JPEG_SUPPORT /D DLIB_PNG_SUPPORT /D DLIB__CMAKE_GENERATED_A_CONFIG_H_FILE /D DLIB_CHECK_FOR_VERSION_MISMATCH=DLIB_VERSION_MISMATCH_CHECK__EXPECTED_VERSION_19_21_0 /D DLIB_JPEG_STATIC /D "CMAKE_INTDIR=\"Debug\"" /D _MBCS /Gm- /EHsc /RTC1 /MDd /GS /fp:precise /Zc:wchar_t /Zc:forScope /Zc:inline /GR /Fo"DLIB.DIR\DEBUG\\" /Fd"DLIB.DIR\DEBUG\DLIB.PDB" /Gd /TC  /bigobj C:\DLIB-19.21\SOURCE\DLIB\EXTERNAL\LIBJPEG\JDSAMPLE.C
^C:\DLIB-19.21\SOURCE\DLIB\EXTERNAL\LIBJPEG\JERROR.C
/c /I"C:\DLIB-19.21\SOURCE\DLIB\EXTERNAL\LIBPNG" /I"C:\DLIB-19.21\SOURCE\DLIB\EXTERNAL\ZLIB" /Zi /nologo /W3 /WX- /diagnostics:column /Od /Ob0 /D WIN32 /D _WINDOWS /D DLIB_HAVE_SSE2 /D DLIB_DISABLE_ASSERTS /D DLIB_JPEG_SUPPORT /D DLIB_PNG_SUPPORT /D DLIB__CMAKE_GENERATED_A_CONFIG_H_FILE /D DLIB_CHECK_FOR_VERSION_MISMATCH=DLIB_VERSION_MISMATCH_CHECK__EXPECTED_VERSION_19_21_0 /D DLIB_JPEG_STATIC /D "CMAKE_INTDIR=\"Debug\"" /D _MBCS /Gm- /EHsc /RTC1 /MDd /GS /fp:precise /Zc:wchar_t /Zc:forScope /Zc:inline /GR /Fo"DLIB.DIR\DEBUG\\" /Fd"DLIB.DIR\DEBUG\DLIB.PDB" /Gd /TC  /bigobj C:\DLIB-19.21\SOURCE\DLIB\EXTERNAL\LIBJPEG\JERROR.C
^C:\DLIB-19.21\SOURCE\DLIB\EXTERNAL\LIBJPEG\JFDCTFLT.C
/c /I"C:\DLIB-19.21\SOURCE\DLIB\EXTERNAL\LIBPNG" /I"C:\DLIB-19.21\SOURCE\DLIB\EXTERNAL\ZLIB" /Zi /nologo /W3 /WX- /diagnostics:column /Od /Ob0 /D WIN32 /D _WINDOWS /D DLIB_HAVE_SSE2 /D DLIB_DISABLE_ASSERTS /D DLIB_JPEG_SUPPORT /D DLIB_PNG_SUPPORT /D DLIB__CMAKE_GENERATED_A_CONFIG_H_FILE /D DLIB_CHECK_FOR_VERSION_MISMATCH=DLIB_VERSION_MISMATCH_CHECK__EXPECTED_VERSION_19_21_0 /D DLIB_JPEG_STATIC /D "CMAKE_INTDIR=\"Debug\"" /D _MBCS /Gm- /EHsc /RTC1 /MDd /GS /fp:precise /Zc:wchar_t /Zc:forScope /Zc:inline /GR /Fo"DLIB.DIR\DEBUG\\" /Fd"DLIB.DIR\DEBUG\DLIB.PDB" /Gd /TC  /bigobj C:\DLIB-19.21\SOURCE\DLIB\EXTERNAL\LIBJPEG\JFDCTFLT.C
^C:\DLIB-19.21\SOURCE\DLIB\EXTERNAL\LIBJPEG\JFDCTFST.C
/c /I"C:\DLIB-19.21\SOURCE\DLIB\EXTERNAL\LIBPNG" /I"C:\DLIB-19.21\SOURCE\DLIB\EXTERNAL\ZLIB" /Zi /nologo /W3 /WX- /diagnostics:column /Od /Ob0 /D WIN32 /D _WINDOWS /D DLIB_HAVE_SSE2 /D DLIB_DISABLE_ASSERTS /D DLIB_JPEG_SUPPORT /D DLIB_PNG_SUPPORT /D DLIB__CMAKE_GENERATED_A_CONFIG_H_FILE /D DLIB_CHECK_FOR_VERSION_MISMATCH=DLIB_VERSION_MISMATCH_CHECK__EXPECTED_VERSION_19_21_0 /D DLIB_JPEG_STATIC /D "CMAKE_INTDIR=\"Debug\"" /D _MBCS /Gm- /EHsc /RTC1 /MDd /GS /fp:precise /Zc:wchar_t /Zc:forScope /Zc:inline /GR /Fo"DLIB.DIR\DEBUG\\" /Fd"DLIB.DIR\DEBUG\DLIB.PDB" /Gd /TC  /bigobj C:\DLIB-19.21\SOURCE\DLIB\EXTERNAL\LIBJPEG\JFDCTFST.C
^C:\DLIB-19.21\SOURCE\DLIB\EXTERNAL\LIBJPEG\JFDCTINT.C
/c /I"C:\DLIB-19.21\SOURCE\DLIB\EXTERNAL\LIBPNG" /I"C:\DLIB-19.21\SOURCE\DLIB\EXTERNAL\ZLIB" /Zi /nologo /W3 /WX- /diagnostics:column /Od /Ob0 /D WIN32 /D _WINDOWS /D DLIB_HAVE_SSE2 /D DLIB_DISABLE_ASSERTS /D DLIB_JPEG_SUPPORT /D DLIB_PNG_SUPPORT /D DLIB__CMAKE_GENERATED_A_CONFIG_H_FILE /D DLIB_CHECK_FOR_VERSION_MISMATCH=DLIB_VERSION_MISMATCH_CHECK__EXPECTED_VERSION_19_21_0 /D DLIB_JPEG_STATIC /D "CMAKE_INTDIR=\"Debug\"" /D _MBCS /Gm- /EHsc /RTC1 /MDd /GS /fp:precise /Zc:wchar_t /Zc:forScope /Zc:inline /GR /Fo"DLIB.DIR\DEBUG\\" /Fd"DLIB.DIR\DEBUG\DLIB.PDB" /Gd /TC  /bigobj C:\DLIB-19.21\SOURCE\DLIB\EXTERNAL\LIBJPEG\JFDCTINT.C
^C:\DLIB-19.21\SOURCE\DLIB\EXTERNAL\LIBJPEG\JIDCTFLT.C
/c /I"C:\DLIB-19.21\SOURCE\DLIB\EXTERNAL\LIBPNG" /I"C:\DLIB-19.21\SOURCE\DLIB\EXTERNAL\ZLIB" /Zi /nologo /W3 /WX- /diagnostics:column /Od /Ob0 /D WIN32 /D _WINDOWS /D DLIB_HAVE_SSE2 /D DLIB_DISABLE_ASSERTS /D DLIB_JPEG_SUPPORT /D DLIB_PNG_SUPPORT /D DLIB__CMAKE_GENERATED_A_CONFIG_H_FILE /D DLIB_CHECK_FOR_VERSION_MISMATCH=DLIB_VERSION_MISMATCH_CHECK__EXPECTED_VERSION_19_21_0 /D DLIB_JPEG_STATIC /D "CMAKE_INTDIR=\"Debug\"" /D _MBCS /Gm- /EHsc /RTC1 /MDd /GS /fp:precise /Zc:wchar_t /Zc:forScope /Zc:inline /GR /Fo"DLIB.DIR\DEBUG\\" /Fd"DLIB.DIR\DEBUG\DLIB.PDB" /Gd /TC  /bigobj C:\DLIB-19.21\SOURCE\DLIB\EXTERNAL\LIBJPEG\JIDCTFLT.C
^C:\DLIB-19.21\SOURCE\DLIB\EXTERNAL\LIBJPEG\JIDCTFST.C
/c /I"C:\DLIB-19.21\SOURCE\DLIB\EXTERNAL\LIBPNG" /I"C:\DLIB-19.21\SOURCE\DLIB\EXTERNAL\ZLIB" /Zi /nologo /W3 /WX- /diagnostics:column /Od /Ob0 /D WIN32 /D _WINDOWS /D DLIB_HAVE_SSE2 /D DLIB_DISABLE_ASSERTS /D DLIB_JPEG_SUPPORT /D DLIB_PNG_SUPPORT /D DLIB__CMAKE_GENERATED_A_CONFIG_H_FILE /D DLIB_CHECK_FOR_VERSION_MISMATCH=DLIB_VERSION_MISMATCH_CHECK__EXPECTED_VERSION_19_21_0 /D DLIB_JPEG_STATIC /D "CMAKE_INTDIR=\"Debug\"" /D _MBCS /Gm- /EHsc /RTC1 /MDd /GS /fp:precise /Zc:wchar_t /Zc:forScope /Zc:inline /GR /Fo"DLIB.DIR\DEBUG\\" /Fd"DLIB.DIR\DEBUG\DLIB.PDB" /Gd /TC  /bigobj C:\DLIB-19.21\SOURCE\DLIB\EXTERNAL\LIBJPEG\JIDCTFST.C
^C:\DLIB-19.21\SOURCE\DLIB\EXTERNAL\LIBJPEG\JIDCTINT.C
/c /I"C:\DLIB-19.21\SOURCE\DLIB\EXTERNAL\LIBPNG" /I"C:\DLIB-19.21\SOURCE\DLIB\EXTERNAL\ZLIB" /Zi /nologo /W3 /WX- /diagnostics:column /Od /Ob0 /D WIN32 /D _WINDOWS /D DLIB_HAVE_SSE2 /D DLIB_DISABLE_ASSERTS /D DLIB_JPEG_SUPPORT /D DLIB_PNG_SUPPORT /D DLIB__CMAKE_GENERATED_A_CONFIG_H_FILE /D DLIB_CHECK_FOR_VERSION_MISMATCH=DLIB_VERSION_MISMATCH_CHECK__EXPECTED_VERSION_19_21_0 /D DLIB_JPEG_STATIC /D "CMAKE_INTDIR=\"Debug\"" /D _MBCS /Gm- /EHsc /RTC1 /MDd /GS /fp:precise /Zc:wchar_t /Zc:forScope /Zc:inline /GR /Fo"DLIB.DIR\DEBUG\\" /Fd"DLIB.DIR\DEBUG\DLIB.PDB" /Gd /TC  /bigobj C:\DLIB-19.21\SOURCE\DLIB\EXTERNAL\LIBJPEG\JIDCTINT.C
^C:\DLIB-19.21\SOURCE\DLIB\EXTERNAL\LIBJPEG\JMEMMGR.C
/c /I"C:\DLIB-19.21\SOURCE\DLIB\EXTERNAL\LIBPNG" /I"C:\DLIB-19.21\SOURCE\DLIB\EXTERNAL\ZLIB" /Zi /nologo /W3 /WX- /diagnostics:column /Od /Ob0 /D WIN32 /D _WINDOWS /D DLIB_HAVE_SSE2 /D DLIB_DISABLE_ASSERTS /D DLIB_JPEG_SUPPORT /D DLIB_PNG_SUPPORT /D DLIB__CMAKE_GENERATED_A_CONFIG_H_FILE /D DLIB_CHECK_FOR_VERSION_MISMATCH=DLIB_VERSION_MISMATCH_CHECK__EXPECTED_VERSION_19_21_0 /D DLIB_JPEG_STATIC /D "CMAKE_INTDIR=\"Debug\"" /D _MBCS /Gm- /EHsc /RTC1 /MDd /GS /fp:precise /Zc:wchar_t /Zc:forScope /Zc:inline /GR /Fo"DLIB.DIR\DEBUG\\" /Fd"DLIB.DIR\DEBUG\DLIB.PDB" /Gd /TC  /bigobj C:\DLIB-19.21\SOURCE\DLIB\EXTERNAL\LIBJPEG\JMEMMGR.C
^C:\DLIB-19.21\SOURCE\DLIB\EXTERNAL\LIBJPEG\JMEMNOBS.C
/c /I"C:\DLIB-19.21\SOURCE\DLIB\EXTERNAL\LIBPNG" /I"C:\DLIB-19.21\SOURCE\DLIB\EXTERNAL\ZLIB" /Zi /nologo /W3 /WX- /diagnostics:column /Od /Ob0 /D WIN32 /D _WINDOWS /D DLIB_HAVE_SSE2 /D DLIB_DISABLE_ASSERTS /D DLIB_JPEG_SUPPORT /D DLIB_PNG_SUPPORT /D DLIB__CMAKE_GENERATED_A_CONFIG_H_FILE /D DLIB_CHECK_FOR_VERSION_MISMATCH=DLIB_VERSION_MISMATCH_CHECK__EXPECTED_VERSION_19_21_0 /D DLIB_JPEG_STATIC /D "CMAKE_INTDIR=\"Debug\"" /D _MBCS /Gm- /EHsc /RTC1 /MDd /GS /fp:precise /Zc:wchar_t /Zc:forScope /Zc:inline /GR /Fo"DLIB.DIR\DEBUG\\" /Fd"DLIB.DIR\DEBUG\DLIB.PDB" /Gd /TC  /bigobj C:\DLIB-19.21\SOURCE\DLIB\EXTERNAL\LIBJPEG\JMEMNOBS.C
^C:\DLIB-19.21\SOURCE\DLIB\EXTERNAL\LIBJPEG\JQUANT1.C
/c /I"C:\DLIB-19.21\SOURCE\DLIB\EXTERNAL\LIBPNG" /I"C:\DLIB-19.21\SOURCE\DLIB\EXTERNAL\ZLIB" /Zi /nologo /W3 /WX- /diagnostics:column /Od /Ob0 /D WIN32 /D _WINDOWS /D DLIB_HAVE_SSE2 /D DLIB_DISABLE_ASSERTS /D DLIB_JPEG_SUPPORT /D DLIB_PNG_SUPPORT /D DLIB__CMAKE_GENERATED_A_CONFIG_H_FILE /D DLIB_CHECK_FOR_VERSION_MISMATCH=DLIB_VERSION_MISMATCH_CHECK__EXPECTED_VERSION_19_21_0 /D DLIB_JPEG_STATIC /D "CMAKE_INTDIR=\"Debug\"" /D _MBCS /Gm- /EHsc /RTC1 /MDd /GS /fp:precise /Zc:wchar_t /Zc:forScope /Zc:inline /GR /Fo"DLIB.DIR\DEBUG\\" /Fd"DLIB.DIR\DEBUG\DLIB.PDB" /Gd /TC  /bigobj C:\DLIB-19.21\SOURCE\DLIB\EXTERNAL\LIBJPEG\JQUANT1.C
^C:\DLIB-19.21\SOURCE\DLIB\EXTERNAL\LIBJPEG\JQUANT2.C
/c /I"C:\DLIB-19.21\SOURCE\DLIB\EXTERNAL\LIBPNG" /I"C:\DLIB-19.21\SOURCE\DLIB\EXTERNAL\ZLIB" /Zi /nologo /W3 /WX- /diagnostics:column /Od /Ob0 /D WIN32 /D _WINDOWS /D DLIB_HAVE_SSE2 /D DLIB_DISABLE_ASSERTS /D DLIB_JPEG_SUPPORT /D DLIB_PNG_SUPPORT /D DLIB__CMAKE_GENERATED_A_CONFIG_H_FILE /D DLIB_CHECK_FOR_VERSION_MISMATCH=DLIB_VERSION_MISMATCH_CHECK__EXPECTED_VERSION_19_21_0 /D DLIB_JPEG_STATIC /D "CMAKE_INTDIR=\"Debug\"" /D _MBCS /Gm- /EHsc /RTC1 /MDd /GS /fp:precise /Zc:wchar_t /Zc:forScope /Zc:inline /GR /Fo"DLIB.DIR\DEBUG\\" /Fd"DLIB.DIR\DEBUG\DLIB.PDB" /Gd /TC  /bigobj C:\DLIB-19.21\SOURCE\DLIB\EXTERNAL\LIBJPEG\JQUANT2.C
^C:\DLIB-19.21\SOURCE\DLIB\EXTERNAL\LIBJPEG\JUTILS.C
/c /I"C:\DLIB-19.21\SOURCE\DLIB\EXTERNAL\LIBPNG" /I"C:\DLIB-19.21\SOURCE\DLIB\EXTERNAL\ZLIB" /Zi /nologo /W3 /WX- /diagnostics:column /Od /Ob0 /D WIN32 /D _WINDOWS /D DLIB_HAVE_SSE2 /D DLIB_DISABLE_ASSERTS /D DLIB_JPEG_SUPPORT /D DLIB_PNG_SUPPORT /D DLIB__CMAKE_GENERATED_A_CONFIG_H_FILE /D DLIB_CHECK_FOR_VERSION_MISMATCH=DLIB_VERSION_MISMATCH_CHECK__EXPECTED_VERSION_19_21_0 /D DLIB_JPEG_STATIC /D "CMAKE_INTDIR=\"Debug\"" /D _MBCS /Gm- /EHsc /RTC1 /MDd /GS /fp:precise /Zc:wchar_t /Zc:forScope /Zc:inline /GR /Fo"DLIB.DIR\DEBUG\\" /Fd"DLIB.DIR\DEBUG\DLIB.PDB" /Gd /TC  /bigobj C:\DLIB-19.21\SOURCE\DLIB\EXTERNAL\LIBJPEG\JUTILS.C
