^C:\DLIB-19.21\SOURCE\DLIB\CMAKE_UTILS\TEST_FOR_CUDA\CUDA_TEST.CU
C:\DLIB-19.21\BUILD\DLIB\CUDA_TEST_BUILD\CMAKEFILES\CUDA_TEST.DIR\DEBUG\CUDA_TEST_GENERATED_CUDA_TEST.CU.OBJ
^C:\DLIB-19.21\SOURCE\DLIB\CMAKE_UTILS\TEST_FOR_CUDA\CMAKELISTS.TXT
C:\DLIB-19.21\BUILD\DLIB\CUDA_TEST_BUILD\CMAKEFILES\GENERATE.STAMP
