^C:\DLIB-19.21\SOURCE\DLIB\CMAKE_UTILS\TEST_FOR_CUDNN\CMAKELISTS.TXT
C:\PROGRAM FILES\CMAKE\SHARE\CMAKE-3.19\MODULES\CMAKECINFORMATION.CMAKE
C:\PROGRAM FILES\CMAKE\SHARE\CMAKE-3.19\MODULES\CMAKECXXINFORMATION.CMAKE
C:\PROGRAM FILES\CMAKE\SHARE\CMAKE-3.19\MODULES\CMAKECOMMONLANGUAGEINCLUDE.CMAKE
C:\PROGRAM FILES\CMAKE\SHARE\CMAKE-3.19\MODULES\CMAKEGENERICSYSTEM.CMAKE
C:\PROGRAM FILES\CMAKE\SHARE\CMAKE-3.19\MODULES\CMAKEINITIALIZECONFIGS.CMAKE
C:\PROGRAM FILES\CMAKE\SHARE\CMAKE-3.19\MODULES\CMAKELANGUAGEINFORMATION.CMAKE
C:\PROGRAM FILES\CMAKE\SHARE\CMAKE-3.19\MODULES\CMAKERCINFORMATION.CMAKE
C:\PROGRAM FILES\CMAKE\SHARE\CMAKE-3.19\MODULES\CMAKESYSTEMSPECIFICINFORMATION.CMAKE
C:\PROGRAM FILES\CMAKE\SHARE\CMAKE-3.19\MODULES\CMAKESYSTEMSPECIFICINITIALIZE.CMAKE
C:\PROGRAM FILES\CMAKE\SHARE\CMAKE-3.19\MODULES\COMPILER\CMAKECOMMONCOMPILERMACROS.CMAKE
C:\PROGRAM FILES\CMAKE\SHARE\CMAKE-3.19\MODULES\COMPILER\MSVC-C.CMAKE
C:\PROGRAM FILES\CMAKE\SHARE\CMAKE-3.19\MODULES\COMPILER\MSVC-CXX.CMAKE
C:\PROGRAM FILES\CMAKE\SHARE\CMAKE-3.19\MODULES\FINDCUDA.CMAKE
C:\PROGRAM FILES\CMAKE\SHARE\CMAKE-3.19\MODULES\FINDCUDA\SELECT_COMPUTE_ARCH.CMAKE
C:\PROGRAM FILES\CMAKE\SHARE\CMAKE-3.19\MODULES\FINDPACKAGEHANDLESTANDARDARGS.CMAKE
C:\PROGRAM FILES\CMAKE\SHARE\CMAKE-3.19\MODULES\FINDPACKAGEMESSAGE.CMAKE
C:\PROGRAM FILES\CMAKE\SHARE\CMAKE-3.19\MODULES\PLATFORM\WINDOWS-MSVC-C.CMAKE
C:\PROGRAM FILES\CMAKE\SHARE\CMAKE-3.19\MODULES\PLATFORM\WINDOWS-MSVC-CXX.CMAKE
C:\PROGRAM FILES\CMAKE\SHARE\CMAKE-3.19\MODULES\PLATFORM\WINDOWS-MSVC.CMAKE
C:\PROGRAM FILES\CMAKE\SHARE\CMAKE-3.19\MODULES\PLATFORM\WINDOWS.CMAKE
C:\PROGRAM FILES\CMAKE\SHARE\CMAKE-3.19\MODULES\PLATFORM\WINDOWSPATHS.CMAKE
C:\DLIB-19.21\BUILD\CMAKEFILES\3.19.1\CMAKECCOMPILER.CMAKE
C:\DLIB-19.21\BUILD\CMAKEFILES\3.19.1\CMAKECXXCOMPILER.CMAKE
C:\DLIB-19.21\BUILD\CMAKEFILES\3.19.1\CMAKERCCOMPILER.CMAKE
C:\DLIB-19.21\BUILD\CMAKEFILES\3.19.1\CMAKESYSTEM.CMAKE
C:\DLIB-19.21\SOURCE\DLIB\CMAKE_UTILS\TEST_FOR_CUDNN\FIND_CUDNN.TXT
C:\DLIB-19.21\SOURCE\DLIB\CMAKE_UTILS\USE_CPP_11.CMAKE
