^C:\DLIB-19.21\BUILD\DLIB\CUDA_TEST_BUILD\CMAKEFILES\CUDA_TEST.DIR\DEBUG\CUDA_TEST_GENERATED_CUDA_TEST.CU.OBJ
C:\DLIB-19.21\BUILD\DLIB\CUDA_TEST_BUILD\CMAKEFILES\CUDA_TEST.DIR\DEBUG\CUDA_TEST_GENERATED_CUDA_TEST.CU.OBJ
C:\WINDOWS\SYSTEM32\TZRES.DLL
