^C:\DLIB-19.21\BUILD\CUDA_TEST_BUILD\CMAKEFILES\1923B5BD21B0D79A281E336D685E7D58\GENERATE.STAMP.RULE
setlocal
"C:\Program Files\CMake\bin\cmake.exe" -SC:/dlib-19.21/source/dlib/cmake_utils/test_for_cuda -BC:/dlib-19.21/build/cuda_test_build --check-stamp-list CMakeFiles/generate.stamp.list --vs-solution-file C:/dlib-19.21/build/cuda_test_build/cuda_test.sln
if %errorlevel% neq 0 goto :cmEnd
:cmEnd
endlocal & call :cmErrorLevel %errorlevel% & goto :cmDone
:cmErrorLevel
exit /b %1
:cmDone
if %errorlevel% neq 0 goto :VCEnd
