^C:\DLIB-19.21\SOURCE\DLIB\CMAKELISTS.TXT
C:\PROGRAM FILES\CMAKE\SHARE\CMAKE-3.19\MODULES\BASICCONFIGVERSION-ANYNEWERVERSION.CMAKE.IN
C:\PROGRAM FILES\CMAKE\SHARE\CMAKE-3.19\MODULES\CMAKECINFORMATION.CMAKE
C:\PROGRAM FILES\CMAKE\SHARE\CMAKE-3.19\MODULES\CMAKECXXINFORMATION.CMAKE
C:\PROGRAM FILES\CMAKE\SHARE\CMAKE-3.19\MODULES\CMAKECOMMONLANGUAGEINCLUDE.CMAKE
C:\PROGRAM FILES\CMAKE\SHARE\CMAKE-3.19\MODULES\CMAKEGENERICSYSTEM.CMAKE
C:\PROGRAM FILES\CMAKE\SHARE\CMAKE-3.19\MODULES\CMAKEINITIALIZECONFIGS.CMAKE
C:\PROGRAM FILES\CMAKE\SHARE\CMAKE-3.19\MODULES\CMAKELANGUAGEINFORMATION.CMAKE
C:\PROGRAM FILES\CMAKE\SHARE\CMAKE-3.19\MODULES\CMAKEPACKAGECONFIGHELPERS.CMAKE
C:\PROGRAM FILES\CMAKE\SHARE\CMAKE-3.19\MODULES\CMAKERCINFORMATION.CMAKE
C:\PROGRAM FILES\CMAKE\SHARE\CMAKE-3.19\MODULES\CMAKESYSTEMSPECIFICINFORMATION.CMAKE
C:\PROGRAM FILES\CMAKE\SHARE\CMAKE-3.19\MODULES\CMAKESYSTEMSPECIFICINITIALIZE.CMAKE
C:\PROGRAM FILES\CMAKE\SHARE\CMAKE-3.19\MODULES\CPACK.CMAKE
C:\PROGRAM FILES\CMAKE\SHARE\CMAKE-3.19\MODULES\CPACKCOMPONENT.CMAKE
C:\PROGRAM FILES\CMAKE\SHARE\CMAKE-3.19\MODULES\CHECKFUNCTIONEXISTS.CMAKE
C:\PROGRAM FILES\CMAKE\SHARE\CMAKE-3.19\MODULES\CHECKINCLUDEFILE.CMAKE
C:\PROGRAM FILES\CMAKE\SHARE\CMAKE-3.19\MODULES\CHECKINCLUDEFILECXX.CMAKE
C:\PROGRAM FILES\CMAKE\SHARE\CMAKE-3.19\MODULES\CHECKTYPESIZE.CMAKE
C:\PROGRAM FILES\CMAKE\SHARE\CMAKE-3.19\MODULES\COMPILER\CMAKECOMMONCOMPILERMACROS.CMAKE
C:\PROGRAM FILES\CMAKE\SHARE\CMAKE-3.19\MODULES\COMPILER\MSVC-C.CMAKE
C:\PROGRAM FILES\CMAKE\SHARE\CMAKE-3.19\MODULES\COMPILER\MSVC-CXX.CMAKE
C:\PROGRAM FILES\CMAKE\SHARE\CMAKE-3.19\MODULES\FINDJPEG.CMAKE
C:\PROGRAM FILES\CMAKE\SHARE\CMAKE-3.19\MODULES\FINDPNG.CMAKE
C:\PROGRAM FILES\CMAKE\SHARE\CMAKE-3.19\MODULES\FINDPACKAGEHANDLESTANDARDARGS.CMAKE
C:\PROGRAM FILES\CMAKE\SHARE\CMAKE-3.19\MODULES\FINDPACKAGEMESSAGE.CMAKE
C:\PROGRAM FILES\CMAKE\SHARE\CMAKE-3.19\MODULES\FINDZLIB.CMAKE
C:\PROGRAM FILES\CMAKE\SHARE\CMAKE-3.19\MODULES\GNUINSTALLDIRS.CMAKE
C:\PROGRAM FILES\CMAKE\SHARE\CMAKE-3.19\MODULES\PLATFORM\WINDOWS-MSVC-C.CMAKE
C:\PROGRAM FILES\CMAKE\SHARE\CMAKE-3.19\MODULES\PLATFORM\WINDOWS-MSVC-CXX.CMAKE
C:\PROGRAM FILES\CMAKE\SHARE\CMAKE-3.19\MODULES\PLATFORM\WINDOWS-MSVC.CMAKE
C:\PROGRAM FILES\CMAKE\SHARE\CMAKE-3.19\MODULES\PLATFORM\WINDOWS.CMAKE
C:\PROGRAM FILES\CMAKE\SHARE\CMAKE-3.19\MODULES\PLATFORM\WINDOWSPATHS.CMAKE
C:\PROGRAM FILES\CMAKE\SHARE\CMAKE-3.19\MODULES\SELECTLIBRARYCONFIGURATIONS.CMAKE
C:\PROGRAM FILES\CMAKE\SHARE\CMAKE-3.19\MODULES\WRITEBASICCONFIGVERSIONFILE.CMAKE
C:\PROGRAM FILES\CMAKE\SHARE\CMAKE-3.19\TEMPLATES\CPACKCONFIG.CMAKE.IN
C:\DLIB-19.21\BUILD\CMAKEFILES\3.19.1\CMAKECCOMPILER.CMAKE
C:\DLIB-19.21\BUILD\CMAKEFILES\3.19.1\CMAKECXXCOMPILER.CMAKE
C:\DLIB-19.21\BUILD\CMAKEFILES\3.19.1\CMAKERCCOMPILER.CMAKE
C:\DLIB-19.21\BUILD\CMAKEFILES\3.19.1\CMAKESYSTEM.CMAKE
C:\DLIB-19.21\SOURCE\DLIB\CMAKE_UTILS\CHECK_IF_NEON_AVAILABLE.CMAKE
C:\DLIB-19.21\SOURCE\DLIB\CMAKE_UTILS\DLIB.PC.IN
C:\DLIB-19.21\SOURCE\DLIB\CMAKE_UTILS\DLIBCONFIG.CMAKE.IN
C:\DLIB-19.21\SOURCE\DLIB\CMAKE_UTILS\FIND_LIBJPEG.CMAKE
C:\DLIB-19.21\SOURCE\DLIB\CMAKE_UTILS\FIND_LIBPNG.CMAKE
C:\DLIB-19.21\SOURCE\DLIB\CMAKE_UTILS\RELEASE_BUILD_BY_DEFAULT
C:\DLIB-19.21\SOURCE\DLIB\CMAKE_UTILS\SET_COMPILER_SPECIFIC_OPTIONS.CMAKE
C:\DLIB-19.21\SOURCE\DLIB\CMAKE_UTILS\USE_CPP_11.CMAKE
C:\DLIB-19.21\SOURCE\DLIB\CONFIG.H.IN
C:\DLIB-19.21\SOURCE\DLIB\REVISION.H.IN
