{
	"extends": [
		"tslint:recommended",
		"rxjs-tslint-rules"
	],
	"rules": {
		"align": {
			"options": [
				"parameters",
				"statements"
			]
		},
		"array-type": false,
		"arrow-return-shorthand": true,
		"curly": false,
		"arrow-parens": false,
		"deprecation": {
			"severity": "warning"
		},
		"component-class-suffix": true,
		"contextual-lifecycle": true,
		"directive-class-suffix": true,
		"directive-selector": [
			true,
			"attribute",
			"app",
			"camelCase"
		],
		"component-selector": [
			true,
			"element",
			"app",
			"kebab-case"
		],
		"eofline": true,
		"import-blacklist": [
			true,
			"rxjs/Rx"
		],
		"import-spacing": false,
		"indent": [
			true,
			"tabs",
			2
		],
		"interface-name": false,
		"max-classes-per-file": false,
		"no-angle-bracket-type-assertion": false,
		"max-line-length": [
			false,
			140
		],
		"member-access": false,
		"member-ordering": [
			true,
			{
				"order": [
					"static-field",
					"instance-field",
					"static-method",
					"instance-method"
				]
			}
		],
		"no-consecutive-blank-lines": false,
		"no-console": [
			true,
			"debug",
			"info",
			"time",
			"timeEnd",
			"trace"
		],
		"no-empty": false,
		"no-inferrable-types": [
			true,
			"ignore-params"
		],
		"no-non-null-assertion": true,
		"no-redundant-jsdoc": true,
		"no-switch-case-fall-through": true,
		"no-var-requires": false,
		"object-literal-key-quotes": [
			true,
			"consistent"
		],
		"object-literal-sort-keys": false,
		"one-line": false,
		"ordered-imports": false,
		"quotemark": [
			true,
			"double"
		],
		"semicolon": {
			"options": [
				"always"
			]
		},
		"space-before-function-paren": {
			"options": {
				"anonymous": "never",
				"asyncArrow": "always",
				"constructor": "never",
				"method": "never",
				"named": "never"
			}
		},
		"typedef-whitespace": [
			true,
			{
				"call-signature": "nospace"
			}
		],
		"variable-name": {
			"options": [
				"ban-keywords",
				"check-format",
				"allow-pascal-case",
				"allow-leading-underscore"
			]
		},
		"whitespace": {
			"options": [
				"check-branch",
				"check-decl",
				"check-operator",
				"check-separator",
				"check-rest-spread",
				"check-type",
				"check-typecast"
			]
		},
		"no-conflicting-lifecycle": true,
		"no-host-metadata-property": true,
		"no-input-rename": true,
		"no-inputs-metadata-property": true,
		"no-output-native": true,
		"no-output-on-prefix": true,
		"no-output-rename": true,
		"no-outputs-metadata-property": true,
		"template-banana-in-box": true,
		"template-no-negated-async": true,
		"use-lifecycle-interface": true,
		"use-pipe-transform-interface": true,
		"jsdoc-format": false,
		"one-variable-per-declaration": false,
		"rxjs-no-internal": true,
		"rxjs-no-subject-unsubscribe": true,
		"rxjs-no-unsafe-switchmap": true,
		"rxjs-no-unsafe-takeuntil": true
	},
	"rulesDirectory": [
		"codelyzer"
	]
}
