{
	"$schema": "../../node_modules/ng-packagr/ng-package.schema.json",
	"dest": "../../dist/ng-lib",
	"lib": {
		"entryFile": "src/public_api.ts"
	},
	"allowedNonPeerDependencies": [
		"localforage"
	]
}
