{
	"info": {
		"_postman_id": "a7c1fb2c-f8b7-42b2-8491-dc573c0d94c8",
		"name": "User API",
		"schema": "https://schema.getpostman.com/json/collection/v2.1.0/collection.json",
		"_exporter_id": "3148970"
	},
	"item": [
		{
			"name": "Root page Copy",
			"request": {
				"method": "GET",
				"header": [],
				"url": {
					"raw": "{{baseURL}}/",
					"host": [
						"{{baseURL}}"
					],
					"path": [
						""
					]
				}
			},
			"response": []
		},
		{
			"name": "Get users Copy",
			"request": {
				"method": "GET",
				"header": [],
				"url": {
					"raw": "{{baseURL}}/users",
					"host": [
						"{{baseURL}}"
					],
					"path": [
						"users"
					],
					"query": [
						{
							"key": "apikey",
							"value": "pf6INMxWZ5HpGVRDZMXNngoSSWOldMUz",
							"disabled": true
						},
						{
							"key": "",
							"value": "",
							"disabled": true
						}
					]
				}
			},
			"response": []
		},
		{
			"name": "Get logs Copy",
			"request": {
				"method": "GET",
				"header": [],
				"url": {
					"raw": "{{baseURL}}/logs",
					"host": [
						"{{baseURL}}"
					],
					"path": [
						"logs"
					],
					"query": [
						{
							"key": "apikey",
							"value": "pf6INMxWZ5HpGVRDZMXNngoSSWOldMUz",
							"disabled": true
						}
					]
				}
			},
			"response": []
		},
		{
			"name": "Add user Copy",
			"request": {
				"method": "POST",
				"header": [],
				"body": {
					"mode": "raw",
					"raw": "{\r\n    \"username\":\"cath123\"\r\n}",
					"options": {
						"raw": {
							"language": "json"
						}
					}
				},
				"url": {
					"raw": "{{baseURL}}/users",
					"host": [
						"{{baseURL}}"
					],
					"path": [
						"users"
					],
					"query": [
						{
							"key": "apikey",
							"value": "pf6INMxWZ5HpGVRDZMXNngoSSWOldMUz",
							"disabled": true
						}
					]
				}
			},
			"response": []
		},
		{
			"name": "Add user - Already exist Copy",
			"request": {
				"method": "POST",
				"header": [],
				"body": {
					"mode": "raw",
					"raw": "{\r\n    \"username\":\"cath123\"\r\n}",
					"options": {
						"raw": {
							"language": "json"
						}
					}
				},
				"url": {
					"raw": "{{baseURL}}/users",
					"host": [
						"{{baseURL}}"
					],
					"path": [
						"users"
					],
					"query": [
						{
							"key": "apikey",
							"value": "pf6INMxWZ5HpGVRDZMXNngoSSWOldMUz",
							"disabled": true
						}
					]
				}
			},
			"response": []
		},
		{
			"name": "Add user - Sans param Copy",
			"request": {
				"method": "POST",
				"header": [],
				"body": {
					"mode": "raw",
					"raw": "{\r\n    \"name\":\"cath123\"\r\n}",
					"options": {
						"raw": {
							"language": "json"
						}
					}
				},
				"url": {
					"raw": "{{baseURL}}/users",
					"host": [
						"{{baseURL}}"
					],
					"path": [
						"users"
					],
					"query": [
						{
							"key": "username",
							"value": "cath",
							"disabled": true
						},
						{
							"key": "apikey",
							"value": "pf6INMxWZ5HpGVRDZMXNngoSSWOldMUz",
							"disabled": true
						}
					]
				}
			},
			"response": []
		},
		{
			"name": "Delete user Copy",
			"request": {
				"method": "DELETE",
				"header": [],
				"url": {
					"raw": "{{baseURL}}/users/cath123",
					"host": [
						"{{baseURL}}"
					],
					"path": [
						"users",
						"cath123"
					],
					"query": [
						{
							"key": "apikey",
							"value": "pf6INMxWZ5HpGVRDZMXNngoSSWOldMUz",
							"disabled": true
						}
					]
				}
			},
			"response": []
		},
		{
			"name": "Delete user - User does not exist Copy",
			"request": {
				"method": "DELETE",
				"header": [],
				"url": {
					"raw": "{{baseURL}}/users/cath1234",
					"host": [
						"{{baseURL}}"
					],
					"path": [
						"users",
						"cath1234"
					],
					"query": [
						{
							"key": "apikey",
							"value": "pf6INMxWZ5HpGVRDZMXNngoSSWOldMUz",
							"disabled": true
						}
					]
				}
			},
			"response": []
		},
		{
			"name": "Delete user - Initial user Copy",
			"request": {
				"method": "DELETE",
				"header": [],
				"url": {
					"raw": "{{baseURL}}/users/root",
					"host": [
						"{{baseURL}}"
					],
					"path": [
						"users",
						"root"
					],
					"query": [
						{
							"key": "apikey",
							"value": "pf6INMxWZ5HpGVRDZMXNngoSSWOldMUz",
							"disabled": true
						}
					]
				}
			},
			"response": []
		},
		{
			"name": "Reset users Copy",
			"request": {
				"method": "DELETE",
				"header": [],
				"url": {
					"raw": "{{baseURL}}/users",
					"host": [
						"{{baseURL}}"
					],
					"path": [
						"users"
					],
					"query": [
						{
							"key": "apikey",
							"value": "pf6INMxWZ5HpGVRDZMXNngoSSWOldMUz",
							"disabled": true
						}
					]
				}
			},
			"response": []
		}
	]
}