C:\Users\caserna\Documents\Proyecto\SIMOC\TFS\BFX\IMP\SIMOC-NetIQ\configuracionUsuario\src\main\java\mx\gob\imss\simo\administracionusuario\common\helper\UsuarioHelper.java
C:\Users\caserna\Documents\Proyecto\SIMOC\TFS\BFX\IMP\SIMOC-NetIQ\configuracionUsuario\src\main\java\mx\gob\imss\simo\administracionusuario\common\utileria\DirectorioActivoProperties.java
C:\Users\caserna\Documents\Proyecto\SIMOC\TFS\BFX\IMP\SIMOC-NetIQ\configuracionUsuario\src\main\java\mx\gob\imss\simo\administracionusuario\common\model\CatalogoObject.java
C:\Users\caserna\Documents\Proyecto\SIMOC\TFS\BFX\IMP\SIMOC-NetIQ\configuracionUsuario\src\main\java\mx\gob\imss\simo\administracionusuario\common\utileria\UtileriaUsuario.java
C:\Users\caserna\Documents\Proyecto\SIMOC\TFS\BFX\IMP\SIMOC-NetIQ\configuracionUsuario\src\main\java\mx\gob\imss\simo\administracionusuario\administracion\repository\impl\UsuarioRepositoryJDBCImpl.java
C:\Users\caserna\Documents\Proyecto\SIMOC\TFS\BFX\IMP\SIMOC-NetIQ\configuracionUsuario\src\main\java\mx\gob\imss\simo\administracionusuario\common\model\UnidadMedica.java
C:\Users\caserna\Documents\Proyecto\SIMOC\TFS\BFX\IMP\SIMOC-NetIQ\configuracionUsuario\src\main\java\mx\gob\imss\simo\administracionusuario\common\service\impl\CatalogoServiceImpl.java
C:\Users\caserna\Documents\Proyecto\SIMOC\TFS\BFX\IMP\SIMOC-NetIQ\configuracionUsuario\src\main\java\mx\gob\imss\simo\administracionusuario\common\constant\SQLCatalogosConstants.java
C:\Users\caserna\Documents\Proyecto\SIMOC\TFS\BFX\IMP\SIMOC-NetIQ\configuracionUsuario\src\main\java\mx\gob\imss\simo\administracionusuario\common\helper\AsignacionRowMapperHelper.java
C:\Users\caserna\Documents\Proyecto\SIMOC\TFS\BFX\IMP\SIMOC-NetIQ\configuracionUsuario\src\main\java\mx\gob\imss\simo\administracionusuario\common\mongodb\core\MongoManager.java
C:\Users\caserna\Documents\Proyecto\SIMOC\TFS\BFX\IMP\SIMOC-NetIQ\configuracionUsuario\src\main\java\mx\gob\imss\simo\administracionusuario\common\service\SiapService.java
C:\Users\caserna\Documents\Proyecto\SIMOC\TFS\BFX\IMP\SIMOC-NetIQ\configuracionUsuario\src\main\java\mx\gob\imss\simo\administracionusuario\common\constant\MensajesAdvertenciaConstants.java
C:\Users\caserna\Documents\Proyecto\SIMOC\TFS\BFX\IMP\SIMOC-NetIQ\configuracionUsuario\src\main\java\mx\gob\imss\simo\administracionusuario\common\enumeracion\TipoAsignacionEnum.java
C:\Users\caserna\Documents\Proyecto\SIMOC\TFS\BFX\IMP\SIMOC-NetIQ\configuracionUsuario\src\main\java\mx\gob\imss\simo\administracionusuario\common\helper\CatalogoRowMapperHelper.java
C:\Users\caserna\Documents\Proyecto\SIMOC\TFS\BFX\IMP\SIMOC-NetIQ\configuracionUsuario\src\main\java\mx\gob\imss\simo\administracionusuario\common\model\Rol.java
C:\Users\caserna\Documents\Proyecto\SIMOC\TFS\BFX\IMP\SIMOC-NetIQ\configuracionUsuario\src\main\java\mx\gob\imss\simo\administracionusuario\administracion\repository\UsuarioRepository.java
C:\Users\caserna\Documents\Proyecto\SIMOC\TFS\BFX\IMP\SIMOC-NetIQ\configuracionUsuario\src\main\java\mx\gob\imss\simo\administracionusuario\administracion\service\impl\AdministracionServiceImpl.java
C:\Users\caserna\Documents\Proyecto\SIMOC\TFS\BFX\IMP\SIMOC-NetIQ\configuracionUsuario\src\main\java\mx\gob\imss\simo\administracionusuario\common\helper\RolRowMapperHelper.java
C:\Users\caserna\Documents\Proyecto\SIMOC\TFS\BFX\IMP\SIMOC-NetIQ\configuracionUsuario\src\main\java\mx\gob\imss\simo\administracionusuario\common\service\CatalogoService.java
C:\Users\caserna\Documents\Proyecto\SIMOC\TFS\BFX\IMP\SIMOC-NetIQ\configuracionUsuario\src\main\java\mx\gob\imss\simo\administracionusuario\common\helper\ComparativaHelper.java
C:\Users\caserna\Documents\Proyecto\SIMOC\TFS\BFX\IMP\SIMOC-NetIQ\configuracionUsuario\src\main\java\mx\gob\imss\simo\administracionusuario\common\constant\MensajesGeneralesConstants.java
C:\Users\caserna\Documents\Proyecto\SIMOC\TFS\BFX\IMP\SIMOC-NetIQ\configuracionUsuario\src\main\java\mx\gob\imss\simo\administracionusuario\common\mongodb\dao\AdministracionMongoDao.java
C:\Users\caserna\Documents\Proyecto\SIMOC\TFS\BFX\IMP\SIMOC-NetIQ\configuracionUsuario\src\main\java\mx\gob\imss\simo\administracionusuario\administracion\controller\AdministracionController.java
C:\Users\caserna\Documents\Proyecto\SIMOC\TFS\BFX\IMP\SIMOC-NetIQ\configuracionUsuario\src\main\java\mx\gob\imss\simo\administracionusuario\common\helper\BaseHelper.java
C:\Users\caserna\Documents\Proyecto\SIMOC\TFS\BFX\IMP\SIMOC-NetIQ\configuracionUsuario\src\main\java\mx\gob\imss\simo\administracionusuario\common\mongodb\model\SitUnidadMedica.java
C:\Users\caserna\Documents\Proyecto\SIMOC\TFS\BFX\IMP\SIMOC-NetIQ\configuracionUsuario\src\main\java\mx\gob\imss\simo\administracionusuario\common\repository\BaseJDBCRepository.java
C:\Users\caserna\Documents\Proyecto\SIMOC\TFS\BFX\IMP\SIMOC-NetIQ\configuracionUsuario\src\main\java\mx\gob\imss\simo\administracionusuario\administracion\service\impl\UsuarioServiceImpl.java
C:\Users\caserna\Documents\Proyecto\SIMOC\TFS\BFX\IMP\SIMOC-NetIQ\configuracionUsuario\src\main\java\mx\gob\imss\simo\administracionusuario\common\controller\BaseUIComponentController.java
C:\Users\caserna\Documents\Proyecto\SIMOC\TFS\BFX\IMP\SIMOC-NetIQ\configuracionUsuario\src\main\java\mx\gob\imss\simo\administracionusuario\common\constant\BaseConstants.java
C:\Users\caserna\Documents\Proyecto\SIMOC\TFS\BFX\IMP\SIMOC-NetIQ\configuracionUsuario\src\main\java\mx\gob\imss\simo\administracionusuario\common\exception\AdministracionUsuarioException.java
C:\Users\caserna\Documents\Proyecto\SIMOC\TFS\BFX\IMP\SIMOC-NetIQ\configuracionUsuario\src\main\java\mx\gob\imss\simo\administracionusuario\common\mongodb\model\SicRol.java
C:\Users\caserna\Documents\Proyecto\SIMOC\TFS\BFX\IMP\SIMOC-NetIQ\configuracionUsuario\src\main\java\mx\gob\imss\simo\administracionusuario\common\service\ActiveDirectoryService.java
C:\Users\caserna\Documents\Proyecto\SIMOC\TFS\BFX\IMP\SIMOC-NetIQ\configuracionUsuario\src\main\java\mx\gob\imss\simo\administracionusuario\common\controller\CommonController.java
C:\Users\caserna\Documents\Proyecto\SIMOC\TFS\BFX\IMP\SIMOC-NetIQ\configuracionUsuario\src\main\java\mx\gob\imss\simo\administracionusuario\common\repository\impl\CatalogoRepositoryJDBCImpl.java
C:\Users\caserna\Documents\Proyecto\SIMOC\TFS\BFX\IMP\SIMOC-NetIQ\configuracionUsuario\src\main\java\mx\gob\imss\simo\administracionusuario\administracion\repository\AdministracionRepository.java
C:\Users\caserna\Documents\Proyecto\SIMOC\TFS\BFX\IMP\SIMOC-NetIQ\configuracionUsuario\src\main\java\mx\gob\imss\simo\administracionusuario\common\service\impl\ActiveDirectoryServiceImpl.java
C:\Users\caserna\Documents\Proyecto\SIMOC\TFS\BFX\IMP\SIMOC-NetIQ\configuracionUsuario\src\main\java\mx\gob\imss\simo\administracionusuario\common\helper\ParametroRowMapperHelper.java
C:\Users\caserna\Documents\Proyecto\SIMOC\TFS\BFX\IMP\SIMOC-NetIQ\configuracionUsuario\src\main\java\mx\gob\imss\simo\administracionusuario\common\exception\BaseException.java
C:\Users\caserna\Documents\Proyecto\SIMOC\TFS\BFX\IMP\SIMOC-NetIQ\configuracionUsuario\src\main\java\mx\gob\imss\simo\administracionusuario\administracion\service\UsuarioService.java
C:\Users\caserna\Documents\Proyecto\SIMOC\TFS\BFX\IMP\SIMOC-NetIQ\configuracionUsuario\src\main\java\mx\gob\imss\simo\administracionusuario\common\model\CuentaDirectorioActivo.java
C:\Users\caserna\Documents\Proyecto\SIMOC\TFS\BFX\IMP\SIMOC-NetIQ\configuracionUsuario\src\main\java\mx\gob\imss\simo\administracionusuario\common\mongodb\dao\impl\AdministracionMongoDaoImpl.java
C:\Users\caserna\Documents\Proyecto\SIMOC\TFS\BFX\IMP\SIMOC-NetIQ\configuracionUsuario\src\main\java\mx\gob\imss\simo\administracionusuario\common\constant\MensajesErrorConstants.java
C:\Users\caserna\Documents\Proyecto\SIMOC\TFS\BFX\IMP\SIMOC-NetIQ\configuracionUsuario\src\main\java\mx\gob\imss\simo\administracionusuario\common\constant\SQLColumnasConstants.java
C:\Users\caserna\Documents\Proyecto\SIMOC\TFS\BFX\IMP\SIMOC-NetIQ\configuracionUsuario\src\main\java\mx\gob\imss\simo\administracionusuario\administracion\repository\impl\AdministracionRepositoryJDBCImpl.java
C:\Users\caserna\Documents\Proyecto\SIMOC\TFS\BFX\IMP\SIMOC-NetIQ\configuracionUsuario\src\main\java\mx\gob\imss\simo\administracionusuario\common\service\impl\SiapServiceImpl.java
C:\Users\caserna\Documents\Proyecto\SIMOC\TFS\BFX\IMP\SIMOC-NetIQ\configuracionUsuario\src\main\java\mx\gob\imss\simo\administracionusuario\common\enumeracion\DominioEnum.java
C:\Users\caserna\Documents\Proyecto\SIMOC\TFS\BFX\IMP\SIMOC-NetIQ\configuracionUsuario\src\main\java\mx\gob\imss\simo\administracionusuario\common\helper\DirectorioActivoMapper.java
C:\Users\caserna\Documents\Proyecto\SIMOC\TFS\BFX\IMP\SIMOC-NetIQ\configuracionUsuario\src\main\java\mx\gob\imss\simo\administracionusuario\common\enumeracion\TipoAsignacionMongoEnum.java
C:\Users\caserna\Documents\Proyecto\SIMOC\TFS\BFX\IMP\SIMOC-NetIQ\configuracionUsuario\src\main\java\mx\gob\imss\simo\administracionusuario\common\enumeracion\EstatusEnum.java
C:\Users\caserna\Documents\Proyecto\SIMOC\TFS\BFX\IMP\SIMOC-NetIQ\configuracionUsuario\src\main\java\mx\gob\imss\simo\administracionusuario\common\mongodb\model\SitPersonalOperativo.java
C:\Users\caserna\Documents\Proyecto\SIMOC\TFS\BFX\IMP\SIMOC-NetIQ\configuracionUsuario\src\main\java\mx\gob\imss\simo\administracionusuario\common\repository\CatalogoRepository.java
C:\Users\caserna\Documents\Proyecto\SIMOC\TFS\BFX\IMP\SIMOC-NetIQ\configuracionUsuario\src\main\java\mx\gob\imss\simo\administracionusuario\common\model\Usuario.java
C:\Users\caserna\Documents\Proyecto\SIMOC\TFS\BFX\IMP\SIMOC-NetIQ\configuracionUsuario\src\main\java\mx\gob\imss\simo\administracionusuario\common\model\AsignacionUnidad.java
C:\Users\caserna\Documents\Proyecto\SIMOC\TFS\BFX\IMP\SIMOC-NetIQ\configuracionUsuario\src\main\java\mx\gob\imss\simo\administracionusuario\common\model\Parametro.java
C:\Users\caserna\Documents\Proyecto\SIMOC\TFS\BFX\IMP\SIMOC-NetIQ\configuracionUsuario\src\main\java\mx\gob\imss\simo\administracionusuario\common\model\DatosSiap.java
C:\Users\caserna\Documents\Proyecto\SIMOC\TFS\BFX\IMP\SIMOC-NetIQ\configuracionUsuario\src\main\java\mx\gob\imss\simo\administracionusuario\administracion\service\AdministracionService.java
C:\Users\caserna\Documents\Proyecto\SIMOC\TFS\BFX\IMP\SIMOC-NetIQ\configuracionUsuario\src\main\java\mx\gob\imss\simo\administracionusuario\common\constant\SecuenciaEnum.java
C:\Users\caserna\Documents\Proyecto\SIMOC\TFS\BFX\IMP\SIMOC-NetIQ\configuracionUsuario\src\main\java\mx\gob\imss\simo\administracionusuario\common\helper\UnidadMedicaRowMapperHelper.java
C:\Users\caserna\Documents\Proyecto\SIMOC\TFS\BFX\IMP\SIMOC-NetIQ\configuracionUsuario\src\main\java\mx\gob\imss\simo\administracionusuario\common\constant\SQLConstants.java
