-------------------------------------------------------------------------------
Test set: consultaexterna.service.LoginTest
-------------------------------------------------------------------------------
Tests run: 3, Failures: 0, Errors: 0, Skipped: 0, Time elapsed: 2.286 sec
