consultaexterna\service\ConsultaExternaServiceImplTest.class
consultaexterna\service\ConsultaExternaServiceImplTest$1.class
mx\gob\imss\simo\comun\core\ReglasNegocioTest.class
consultaexterna\service\LoginTest.class
consultaexterna\service\CrearDocumentoTest.class
consultaexterna\service\AppConfig.class
mx\gob\imss\simo\ws\service\implTest\AccederWsServiceImplTest.class
consultaexterna\service\ConsultaExternaTest.class
mx\gob\imss\simo\comun\core\AbstractBaseBeanTest.class
