-------------------------------------------------------------------------------
Test set: mx.gob.imss.simo.hospitalizacion.ingresos.rulesTest.CapturarIngresoRulesTest
-------------------------------------------------------------------------------
Tests run: 3, Failures: 0, Errors: 0, Skipped: 0, Time elapsed: 1.047 sec
