-------------------------------------------------------------------------------
Test set: consultaexterna.service.CrearDocumentoTest
-------------------------------------------------------------------------------
Tests run: 2, Failures: 0, Errors: 0, Skipped: 0, Time elapsed: 1.614 sec
