3761.14;3216.27;666.20;
-18.47;11.31;17.38;
4640.66;4205.31;701.53;
223.74;-41.31;16.03;
4843.75;1497.68;-792.53;
31.70;263.29;16.03;
-216.96;45.47;16.03;
-67.12;-222.46;16.03;
4501.10;-4283.00;-0.93;
-4288.20;-1247.81;188.25;
-5087.66;-1057.52;426.60;
-3956.93;-1775.84;393.10;
-4585.95;-661.75;369.19;
1296.00;-6406.10;-26.13;
3782.54;-6317.93;-15.56;
5824.04;-4481.20;13.39;
5052.66;-415.63;-680.09;
-3864.93;-6384.83;186.16;
4733.95;688.96;-703.07;
838.21;-6467.74;104.51;
4098.45;-6418.75;116.51;
6183.49;-5522.16;127.62;
5931.43;-3109.87;138.05;
5669.33;-420.76;95.30;
5087.93;3558.14;18.17;
4816.77;2497.11;-760.46;
-396.54;6227.75;74.26;
-4033.63;6169.75;68.41;
4193.31;3360.19;-140.99;
-6425.43;6239.79;85.41;
-7867.54;3674.02;110.83;
205.77;7400.25;-81.76;
-8038.66;618.46;131.74;
5332.60;4003.90;-55.56;
-7125.45;-2417.62;201.52;
-5319.25;-3731.79;515.84;
-6249.68;-4874.02;115.73;
-7.65;3923.38;13.52;
-2346.87;-4424.72;-6.73;
-2208.50;-5098.31;-126.11;
1701.21;4657.68;150.22;
-1624.16;-2112.83;501.79;
1754.65;4375.83;238.80;
-1048.66;-5241.14;-142.16;
1494.95;4543.75;205.57;
-1568.58;-3636.36;0.00;
-3000.43;3666.67;270.23;
3502.52;4613.87;785.78;
4868.49;-229.33;-327.79;
4840.25;1839.94;-559.45;
3428.34;-303.72;680.15;
-2934.20;3734.30;16.03;
4501.62;-4275.10;76.33;
2678.51;-1693.18;644.64;
-3020.66;3311.21;16.03;
2556.70;-4329.43;221.13;
-4750.16;1279.31;316.29;
-4439.33;2042.56;0.01;
-6237.72;3039.21;238.88;
-4641.68;4062.69;164.97;
-6187.95;2467.04;29.00;
-5073.72;4002.46;62.77;
-4508.66;3836.33;95.19;
-4698.06;3355.07;218.69;
-4801.39;4108.89;51.52;
-3706.56;4221.97;13.18;
-981.71;1042.72;108.76;
-1627.75;2433.64;-18.50;
-720.90;3849.27;8.97;
1429.27;-405.39;99.51;
-3121.04;3661.40;211.02;
-979.15;-959.63;111.87;
-2778.31;3499.15;211.02;
4836.64;-60.25;19.80;
-4397.33;-1755.43;0.02;
-4797.35;-1634.75;0.02;
-2424.97;3253.87;0.04;
-7426.42;5641.64;-19.11;
-3766.80;4659.83;18.71;
-3240.16;3546.76;16.03;
-6080.41;4101.77;61.95;
-7733.55;1270.59;-2.90;
-2358.40;-5099.80;48.80;
-2899.86;-6200.91;240.98;
-4341.31;-5743.64;202.99;
-7882.36;-5684.99;174.26;
-7722.62;-785.21;50.46;
-593.22;-3651.08;55.09;
-6944.58;-431.34;102.18;
-6968.15;511.46;190.65;
270.12;-3775.80;118.84;
818.86;-3736.11;116.90;
-4747.06;2709.44;233.47;
-2653.82;2454.56;584.93;
-2486.28;970.99;294.89;
-2304.68;121.10;93.89;
1120.63;-5168.35;27.63;
-2360.47;-1344.59;234.75;
-1749.27;-4248.71;122.65;
-1742.73;-4203.44;122.65;
-1383.73;-6397.22;140.58;
-2303.28;-3959.77;121.05;
-2306.61;-4141.44;120.20;
-2443.77;-6388.80;187.44;
-5604.73;-6370.06;102.86;
-2137.31;-4970.31;93.25;
-7378.90;-6107.73;155.02;
-7872.22;-1953.89;204.36;
-391.85;-5267.12;87.04;
-7873.36;-133.89;109.58;
-7838.78;2167.24;157.28;
-1153.10;-5138.07;49.46;
-2374.97;-653.00;44.67;
-2878.14;-1340.43;53.87;
-3570.95;-2898.16;68.80;
-3835.82;-4128.88;76.86;
-4650.46;-5524.99;92.81;
-4757.38;-5456.42;93.97;
-4570.93;-5529.53;91.78;
-4485.32;-5764.08;91.51;
-5967.47;-6317.80;113.17;
-6824.21;-6265.44;124.32;
-7953.80;-4830.24;112.14;
-8038.24;-2242.35;153.80;
-8089.11;-1338.01;182.16;
-5489.72;1797.16;148.76;
-4493.10;1545.13;184.73;
4477.16;-4154.51;50.67;
475.60;5166.46;63.42;
1315.17;-2449.40;311.96;
