knife;10
taser;15
hegrenade;20
incgrenade;20
tagrenade;10
healthshot;15
glock;20;8;20;8;20
usp_silencer;15;8;12;6;24
hkp2000;20;8;13;8;26
p250;15;8;13;8;26
fiveseven;10;8;20;8;20
elite;8;8;30;8;15
deagle;5;3;7;3;7
revolver;6;4;6;4;6
cz75a;12;6;12;6;24
mag7;6;3;5;3;10
nova;6;3;8;3;10
sawedoff;6;3;7;3;10
xm1014;6;3;7;3;10