2833.25;-561.33;-851.96;
2821.68;-1027.04;-731.20;
3385.26;-1443.00;-595.79;
3545.12;-1445.94;-86.94;
3712.50;-1431.45;-86.94;
2565.01;369.01;-784.65;
2917.72;1349.81;-655.65;
4166.14;966.96;-667.34;
4542.00;915.21;-665.40;
4995.64;-404.22;-912.96;
5766.10;-1307.42;-912.96;
4363.62;-2285.45;-626.65;
4621.43;-3783.46;-503.07;
3931.94;-4317.16;-599.21;
2381.11;-3203.78;-588.89;
2623.77;-3065.56;-638.01;
1267.46;-2067.87;-624.21;
1212.50;-1074.68;-683.96;
157.36;-951.77;-611.71;
-230.77;-788.65;-683.96;
-1464.00;-1151.95;-668.96;
-1990.35;-1982.51;-713.05;
-2868.16;-2961.67;-842.40;
-3516.41;-2961.04;-898.78;
-3328.64;-3547.02;-681.13;
-3040.29;-1316.45;-692.59;
-1686.39;-806.80;-683.96;
-2758.96;377.29;-743.25;
-1524.04;244.00;-686.46;
-1094.90;649.29;-684.46;
-755.25;680.09;-668.46;
-748.34;830.59;-668.46;
-490.75;874.66;-668.46;
1112.04;493.42;-684.46;
1943.91;1410.84;-655.59;
2897.97;1818.01;-550.75;
4547.64;1768.60;-260.01;
5072.27;2876.43;-572.79;
4189.37;3753.39;-843.65;
3788.13;3509.13;-851.46;
1971.46;3081.25;-740.40;
720.09;1889.48;-505.04;
-635.14;2310.30;-724.19;
-1268.06;3015.38;-685.57;
-2192.88;2989.66;-782.46;
-2424.70;3862.23;-663.64;
-589.60;3987.97;-684.32;
2178.73;-4350.33;-438.70;
2998.40;-4225.48;-436.07;
4953.64;-4027.91;-400.13;
4054.07;-4008.17;-473.07;
4693.20;-2862.12;-461.00;
3792.51;-2386.92;-552.25;
5678.22;-1401.40;-738.04;
5098.06;-1684.38;-706.49;
4849.54;566.65;-476.12;
3971.20;624.02;-478.07;
3234.41;1124.89;-482.75;
1934.51;884.60;-600.05;
855.14;1170.38;-616.65;
180.04;2702.32;-558.19;
564.00;3736.21;-576.16;
-4283.13;3388.85;71.03;
-4365.10;2166.45;114.47;
-3805.35;835.02;-566.38;
-3754.86;-978.12;-608.35;
-2899.67;702.73;-636.09;
-2977.98;2420.64;-656.70;
-1707.36;2116.41;-634.42;
-1924.41;1046.29;-634.29;
-845.30;1405.03;-657.00;
-301.89;896.74;-595.37;
-641.71;707.14;-399.74;
2252.93;-1018.52;-624.59;
1114.68;-3513.41;-107.76;
399.77;-4417.74;12.01;
-581.51;-4197.98;-222.98;
-2889.14;-4260.00;-509.80;
-2517.94;-2443.54;-739.33;
3708.79;3560.43;-644.27;
1556.16;3810.81;-508.48;
-1470.92;3681.62;-601.65;
-2955.22;1597.52;-677.58;
-2566.28;-1552.60;-686.02;
-888.36;-2027.63;-644.99;
-42.29;-2782.09;-388.62;
-3610.40;3810.24;-649.61;
2110.03;-162.27;-639.25;
