<?xml version="1.0" encoding="UTF-8" standalone="no"?>
<!-- Created with Inkscape (http://www.inkscape.org/) -->

<svg
   version="1.1"
   id="svg2"
   width="147.627"
   height="101.16"
   viewBox="0 0 147.627 101.16"
   xmlns="http://www.w3.org/2000/svg"
   xmlns:svg="http://www.w3.org/2000/svg">
  <defs
     id="defs6" />
  <g
     id="g10"
     transform="matrix(1.3333333,0,0,-1.3333333,0,156.16)">
    <g
       id="g12"
       transform="matrix(0.1,0,0,0.1,-0.305255,0.54580893)">
      <g
         id="g309"
         transform="translate(-205.33045,202.95294)">
        <path
           d="M 585.508,962.789 438.184,815.469 h 117.851 l 147.324,147.32 H 585.508"
           style="fill:#c8c7c7;fill-opacity:1;fill-rule:nonzero;stroke:none"
           id="path16" />
        <path
           d="M 703.359,668.082 H 585.508 L 438.184,815.469 H 556.035 L 703.359,668.082"
           style="fill:#706d6e;fill-opacity:1;fill-rule:nonzero;stroke:none"
           id="path18" />
        <path
           d="M 355.715,732.918 208.383,585.582 h 117.851 l 147.36,147.336 H 355.715"
           style="fill:#c8c7c7;fill-opacity:1;fill-rule:nonzero;stroke:none"
           id="path20" />
        <path
           d="M 473.594,438.262 H 355.715 l -147.332,147.383 117.851,-0.063 147.36,-147.32"
           style="fill:#706d6e;fill-opacity:1;fill-rule:nonzero;stroke:none"
           id="path22" />
        <path
           d="M 585.508,503.094 438.184,355.762 H 556.035 L 703.359,503.094 H 585.508"
           style="fill:#c8c7c7;fill-opacity:1;fill-rule:nonzero;stroke:none"
           id="path24" />
        <path
           d="M 703.359,208.379 H 585.508 L 438.184,355.762 H 556.035 L 703.359,208.379"
           style="fill:#706d6e;fill-opacity:1;fill-rule:nonzero;stroke:none"
           id="path26" />
        <path
           d="M 1080.55,815.469 933.215,668.082 785.883,815.469 933.215,962.789 1080.55,815.469"
           style="fill:#ed1c24;fill-opacity:1;fill-rule:nonzero;stroke:none"
           id="path28" />
        <path
           d="M 815.309,962.789 668.031,815.469 h 117.852 l 147.332,147.32 H 815.309"
           style="fill:#f68290;fill-opacity:1;fill-rule:nonzero;stroke:none"
           id="path30" />
        <path
           d="M 933.215,668.082 H 815.359 L 668.031,815.469 H 785.883 L 933.215,668.082"
           style="fill:#a61217;fill-opacity:1;fill-rule:nonzero;stroke:none"
           id="path32" />
        <path
           d="m 1310.36,585.582 -147.32,-147.32 -147.33,147.32 147.33,147.336 147.32,-147.336"
           style="fill:#ed1c24;fill-opacity:1;fill-rule:nonzero;stroke:none"
           id="path34" />
        <path
           d="M 1045.19,732.918 897.855,585.582 h 117.855 l 147.33,147.336 h -117.85"
           style="fill:#f68290;fill-opacity:1;fill-rule:nonzero;stroke:none"
           id="path36" />
        <path
           d="m 1163.04,438.262 h -117.85 l -147.335,147.383 117.855,-0.063 147.33,-147.32"
           style="fill:#a61217;fill-opacity:1;fill-rule:nonzero;stroke:none"
           id="path38" />
        <path
           d="M 850.664,585.582 703.359,438.262 556.035,585.582 703.359,732.918 850.664,585.582"
           style="fill:#ed1c24;fill-opacity:1;fill-rule:nonzero;stroke:none"
           id="path40" />
        <path
           d="M 585.508,732.918 438.184,585.582 H 556.035 L 703.359,732.918 H 585.508"
           style="fill:#f68290;fill-opacity:1;fill-rule:nonzero;stroke:none"
           id="path42" />
        <path
           d="M 703.359,438.262 H 585.508 l -147.324,147.383 117.851,-0.063 147.324,-147.32"
           style="fill:#a61217;fill-opacity:1;fill-rule:nonzero;stroke:none"
           id="path44" />
        <path
           d="M 1080.55,355.762 933.215,208.379 785.883,355.762 933.215,503.094 1080.55,355.762"
           style="fill:#ed1c24;fill-opacity:1;fill-rule:nonzero;stroke:none"
           id="path46" />
        <path
           d="M 815.359,503.094 668.031,355.762 H 785.883 L 933.215,503.094 H 815.359"
           style="fill:#f68290;fill-opacity:1;fill-rule:nonzero;stroke:none"
           id="path48" />
        <path
           d="M 933.215,208.379 H 815.359 L 668.031,355.762 H 785.883 L 933.215,208.379"
           style="fill:#a61217;fill-opacity:1;fill-rule:nonzero;stroke:none"
           id="path50" />
      </g>
    </g>
  </g>
</svg>
