cell.frame	cell.index	cell.center.x	cell.center.y	cell.majoraxis	cell.minoraxis	cell.orientation	cell.area	cell.volume	cell.perimeter	cell.eccentricity	cell.fractionOfGoodMembranePixels	cell.mem.area	cell.mem.volume	cell.nuc.radius	cell.nuc.area	mKOk.background.mean	mKOk.background.std	mKOk.cell.total	mKOk.cell.q25	mKOk.cell.q50	mKOk.cell.q75	mKOk.mem.total	mKOk.mem.q25	mKOk.mem.q50	mKOk.mem.q75	mKOk.nuc.total	mKOk.nuc.q25	mKOk.nuc.q50	mKOk.nuc.q75	mKOk.bright.total	mKOk.bright.q25	mKOk.bright.q50	mKOk.bright.q75	mKOk.bright.euler	mKate.background.mean	mKate.background.std	mKate.cell.total	mKate.cell.q25	mKate.cell.q50	mKate.cell.q75	mKate.mem.total	mKate.mem.q25	mKate.mem.q50	mKate.mem.q75	mKate.nuc.total	mKate.nuc.q25	mKate.nuc.q50	mKate.nuc.q75	mKate.bright.total	mKate.bright.q25	mKate.bright.q50	mKate.bright.q75	mKate.bright.euler
8	1	48	75	8	7	-70.440	44	206	23	0.40004	1.00000	33	183	2	9	193	12	8845	186	197	213	6653	184	197	211	838	205	214	215	2707	205	207	213	3	133	9	5911	126	131	138	4425	127	130	136	527	127	132	137	1764	134	135	138	2
8	2	80	44	37	29	+23.985	840	15516	107	0.62394	0.97744	189	5065	6	129	193	12	220198	242	262	283	44939	221	235	255	35660	271	287	301	72069	281	284	289	2	133	9	119811	131	138	147	27334	130	137	149	21880	141	161	202	39841	141	143	159	17
8	3	79	78	34	31	+83.151	818	15454	108	0.43574	0.94737	191	5049	6	129	193	12	211736	238	260	280	45258	216	234	257	35693	276	290	302	69688	278	283	292	4	133	9	112874	130	137	144	26170	128	134	143	17579	134	139	149	35557	141	143	147	10
8	4	106	61	29	27	+4.859	612	10418	88	0.39645	0.99099	151	3679	6	97	193	12	158102	234	256	278	34956	213	231	247	29443	289	306	324	53514	274	287	306	4	133	9	85911	133	140	148	20766	130	137	144	13988	140	146	152	27022	145	146	148	9
8	5	104	86	24	17	+59.934	293	2970	71	0.72158	0.79070	124	1709	4	45	193	12	58873	190	201	212	24810	190	201	213	9146	199	205	222	18416	205	207	212	9	133	9	37712	123	129	134	15971	124	129	135	5846	126	132	140	11729	132	132	134	3