cell.frame	cell.index	cell.center.x	cell.center.y	cell.majoraxis	cell.minoraxis	cell.orientation	cell.area	cell.volume	cell.perimeter	cell.eccentricity	cell.fractionOfGoodMembranePixels	cell.mem.area	cell.mem.volume	cell.nuc.radius	cell.nuc.area
30	1	154	258	22	15	-22.759	246	2356	58	0.73161	0.02778	159	1907	3	37
30	2	185	368	17	13	+42.056	167	1402	47	0.58395	0.08772	118	1193	3	25
30	3	225	232	22	14	-59.014	228	2112	55	0.77293	0.00000	146	1658	3	37
30	4	231	366	21	14	+23.289	223	2026	56	0.73184	0.04545	151	1738	3	37
30	5	271	217	19	17	-12.534	242	2516	56	0.46590	0.11765	150	1972	3	37
30	6	343	175	20	18	-21.770	271	2930	60	0.49356	0.13514	162	2177	4	45
30	7	351	147	15	12	-21.952	144	1220	41	0.59953	0.05769	104	1064	3	21
30	8	352	256	20	15	+24.546	218	2010	57	0.64780	0.15942	147	1667	3	37
30	9	378	123	17	16	+52.948	206	1882	51	0.39606	0.06667	136	1522	3	29
30	10	379	241	15	14	-26.805	165	1572	44	0.36994	0.13793	112	1297	3	25
30	11	390	178	15	13	+18.329	152	1252	43	0.51669	0.07407	111	1107	3	21
30	12	394	164	15	14	+45.667	166	1464	46	0.31985	0.05357	118	1240	3	25
30	13	126	219	80	28	-39.238	1705	32469	177	0.93782	0.52553	512	11986	8	213
30	14	191	246	78	27	-8.288	1632	29140	172	0.93590	0.90264	507	11851	8	193
30	15	199	298	89	24	-0.522	1631	26303	190	0.96177	0.84615	561	12417	8	177
30	16	197	273	73	27	-2.320	1509	26339	163	0.92961	0.88810	483	11201	8	177
30	17	212	321	109	26	+0.696	2149	37721	223	0.97034	0.81570	672	16226	9	233
30	18	183	445	65	27	+75.612	1346	23604	149	0.91063	0.64599	440	10164	7	177
30	19	207	347	64	27	+0.851	1315	22625	148	0.90804	0.87755	434	9892	7	169
30	20	200	388	65	28	+68.511	1381	24415	151	0.90234	0.86511	449	10157	7	177
30	21	260	266	67	26	+10.408	1332	22458	158	0.92131	0.77601	464	10358	7	169
30	22	262	241	61	25	+7.252	1172	18960	141	0.91308	0.93042	411	8667	7	145
30	23	268	345	71	26	-0.155	1420	24272	158	0.93030	0.86059	466	10694	7	177
30	24	274	295	79	26	-14.035	1558	26920	176	0.94432	0.75583	524	12186	8	185
30	25	291	322	69	26	-13.905	1312	21008	159	0.93000	0.72973	471	10051	7	149
30	26	318	234	73	26	-21.368	1445	24481	162	0.93398	0.81373	480	10428	7	177
30	27	317	286	77	26	-20.181	1537	27163	173	0.94024	0.77819	513	11791	8	185
30	28	316	259	62	24	-25.662	1162	19010	141	0.91827	0.82865	416	8704	7	145
30	29	339	205	60	27	+23.560	1246	22292	140	0.89168	0.90137	413	9301	7	161
30	30	351	316	68	27	+13.153	1409	24739	155	0.91772	0.87633	459	10625	7	177
30	31	371	216	71	27	+53.659	1494	27676	161	0.92202	0.89011	471	10811	8	185
30	32	388	285	80	26	+6.301	1610	28060	176	0.94470	0.83902	519	12089	8	185
30	33	371	163	62	29	+76.924	1377	25833	148	0.88675	0.89873	436	10524	8	177
30	34	400	124	62	27	+80.921	1300	22556	145	0.89547	0.81008	428	9698	7	169
30	35	412	71	59	27	+77.351	1211	20877	138	0.88847	0.50298	406	9178	7	149