cell.frame	cell.index	cell.center.x	cell.center.y	cell.majoraxis	cell.minoraxis	cell.orientation	cell.area	cell.volume	cell.perimeter	cell.eccentricity	cell.fractionOfGoodMembranePixels	cell.mem.area	cell.mem.volume	cell.nuc.radius	cell.nuc.area	mKOk.background.mean	mKOk.background.std	mKOk.cell.total	mKOk.cell.q25	mKOk.cell.q50	mKOk.cell.q75	mKOk.mem.total	mKOk.mem.q25	mKOk.mem.q50	mKOk.mem.q75	mKOk.nuc.total	mKOk.nuc.q25	mKOk.nuc.q50	mKOk.nuc.q75	mKOk.bright.total	mKOk.bright.q25	mKOk.bright.q50	mKOk.bright.q75	mKOk.bright.euler	mKate.background.mean	mKate.background.std	mKate.cell.total	mKate.cell.q25	mKate.cell.q50	mKate.cell.q75	mKate.mem.total	mKate.mem.q25	mKate.mem.q50	mKate.mem.q75	mKate.nuc.total	mKate.nuc.q25	mKate.nuc.q50	mKate.nuc.q75	mKate.bright.total	mKate.bright.q25	mKate.bright.q50	mKate.bright.q75	mKate.bright.euler
7	1	49	74	9	7	-26.867	48	236	23	0.47866	0.86207	34	206	2	9	195	11	9514	191	198	210	6720	191	198	207	813	195	208	212	2875	203	204	207	3	122	7	6294	123	130	136	4463	120	130	134	503	121	125	131	1890	134	135	136	1
7	2	81	44	38	30	+27.269	864	16188	106	0.61636	0.99254	191	5119	6	137	195	11	229138	245	266	287	45412	218	235	254	36215	277	293	308	75305	286	290	294	5	122	7	124289	131	139	149	27099	130	136	148	22253	149	172	198	41553	144	146	166	13
7	3	80	77	35	31	+78.109	848	16416	103	0.45295	0.96850	186	5220	6	137	195	11	219714	237	260	280	42488	213	228	242	36189	276	290	310	72829	279	285	291	4	122	7	116744	130	138	144	25009	128	134	142	17698	138	143	148	36665	143	144	146	10
7	4	106	61	29	27	+7.010	592	9962	87	0.37970	0.97297	150	3586	6	97	195	11	153629	234	255	281	34723	214	230	245	27468	292	311	334	52902	279	292	313	1	122	7	83763	133	141	150	20549	129	137	144	12949	139	147	156	26396	146	147	150	8
7	5	104	87	22	15	-42.455	232	2088	65	0.75749	0.58228	108	1296	3	37	195	11	46371	190	200	210	21587	190	201	211	6492	195	204	213	14597	206	207	212	4	122	7	29928	124	129	135	13896	123	128	135	4216	128	132	137	9329	132	133	134	7