cell.frame	cell.index	cell.center.x	cell.center.y	cell.majoraxis	cell.minoraxis	cell.orientation	cell.area	cell.volume	cell.perimeter	cell.eccentricity	cell.fractionOfGoodMembranePixels	cell.mem.area	cell.mem.volume	cell.nuc.radius	cell.nuc.area
12	1	157	259	15	13	+73.134	159	1394	43	0.49785	0.01786	110	1161	3	25
12	2	202	340	12	11	-87.135	102	708	35	0.36573	0.00000	84	666	2	21
12	3	211	243	17	16	+60.804	213	2134	51	0.21894	0.13333	135	1700	3	37
12	4	236	371	15	13	-80.335	157	1334	44	0.49802	0.08929	111	1128	3	21
12	5	229	245	15	14	-69.721	156	1296	43	0.39790	0.11765	111	1107	3	21
12	6	247	247	18	15	-37.719	205	1896	51	0.55501	0.15000	133	1522	3	37
12	7	262	359	14	14	-86.869	151	1270	43	0.30311	0.00000	107	1082	3	21
12	8	295	235	18	15	-49.970	202	1894	51	0.59073	0.09375	134	1524	3	37
12	9	308	220	17	13	-68.371	170	1508	45	0.62480	0.00000	115	1261	3	25
12	10	335	183	17	13	-13.246	175	1502	46	0.64548	0.05357	120	1247	3	25
12	11	337	206	18	14	-45.070	183	1610	50	0.62527	0.09375	128	1339	3	25
12	12	340	270	14	12	+27.089	124	878	39	0.54234	0.08333	98	808	2	21
12	13	345	161	17	13	-15.896	167	1438	46	0.62683	0.10526	116	1203	3	25
12	14	341	254	18	14	+10.441	175	1490	50	0.63334	0.10938	126	1293	3	25
12	15	355	312	15	14	-71.692	152	1232	43	0.31564	0.05769	112	1088	3	21
12	16	363	242	15	14	+18.328	165	1466	46	0.34758	0.12069	118	1251	3	25
12	17	386	182	15	15	-29.886	167	1512	46	0.20270	0.15517	117	1270	3	25
12	18	395	168	15	13	-13.434	155	1346	41	0.47441	0.01923	106	1125	3	21
12	19	156	232	108	28	-28.170	2299	45743	224	0.96480	0.73211	670	17422	9	261
12	20	191	409	90	27	+77.814	1887	34039	193	0.95220	0.74747	576	13794	8	221
12	21	225	319	80	25	+4.875	1572	25872	174	0.94836	0.84899	515	11199	8	177
12	22	234	268	94	27	-3.590	1979	35497	203	0.95735	0.84794	604	14482	8	221
12	23	234	348	90	27	+24.980	1879	34705	194	0.95193	0.87139	579	13769	8	221
12	24	244	293	102	25	+3.786	1932	31824	212	0.96968	0.80838	636	14276	8	213
12	25	295	257	83	26	-16.222	1638	27470	181	0.95094	0.79777	541	11865	8	185
12	26	304	313	91	27	+3.064	1860	32544	196	0.95637	0.79338	582	13676	8	213
12	27	336	289	109	26	-8.047	2140	37560	225	0.97089	0.80057	675	16367	9	233
12	28	347	226	94	28	+26.499	2031	39955	202	0.95399	0.92988	599	15323	9	241
12	29	367	172	80	29	+63.270	1793	35325	179	0.93218	0.89773	532	13392	8	221
12	30	403	109	82	28	+67.256	1756	32370	180	0.94131	0.72115	538	12762	8	213