cell.frame	cell.index	cell.center.x	cell.center.y	cell.majoraxis	cell.minoraxis	cell.orientation	cell.area	cell.volume	cell.perimeter	cell.eccentricity	cell.fractionOfGoodMembranePixels	cell.mem.area	cell.mem.volume	cell.nuc.radius	cell.nuc.area	mKOk.background.mean	mKOk.background.std	mKOk.cell.total	mKOk.cell.q25	mKOk.cell.q50	mKOk.cell.q75	mKOk.mem.total	mKOk.mem.q25	mKOk.mem.q50	mKOk.mem.q75	mKOk.nuc.total	mKOk.nuc.q25	mKOk.nuc.q50	mKOk.nuc.q75	mKOk.bright.total	mKOk.bright.q25	mKOk.bright.q50	mKOk.bright.q75	mKOk.bright.euler	mKate.background.mean	mKate.background.std	mKate.cell.total	mKate.cell.q25	mKate.cell.q50	mKate.cell.q75	mKate.mem.total	mKate.mem.q25	mKate.mem.q50	mKate.mem.q75	mKate.nuc.total	mKate.nuc.q25	mKate.nuc.q50	mKate.nuc.q75	mKate.bright.total	mKate.bright.q25	mKate.bright.q50	mKate.bright.q75	mKate.bright.euler
11	1	49	77	11	8	+48.338	70	420	28	0.66055	0.69444	45	347	2	9	193	13	14179	189	204	211	9116	191	201	210	2431	191	200	210	4384	208	208	209	2	133	10	9132	124	129	137	5859	123	128	140	1596	127	131	140	2794	131	133	134	2
11	2	59	64	18	16	-84.618	212	2044	52	0.41790	0.97015	88	1166	3	37	193	13	52450	230	247	264	20734	219	235	252	8570	255	267	284	17038	262	264	270	1	133	10	29686	133	139	147	12067	128	136	147	7981	214	245	296	9412	145	146	148	4
11	3	79	45	37	29	+21.791	847	16006	105	0.60221	0.97692	184	5023	6	137	193	13	220685	241	260	279	43180	218	233	248	35393	271	284	301	71991	277	282	289	8	133	10	120827	131	138	145	26662	128	136	144	21602	138	150	192	40561	141	143	153	18
11	4	78	79	35	30	+54.076	841	16576	103	0.51177	0.96212	180	5061	7	137	193	13	221283	242	265	284	43190	220	238	258	36213	277	290	308	72539	281	286	292	4	133	10	116439	129	136	145	24849	127	134	143	19324	137	148	171	37723	141	144	150	14
11	5	106	62	31	27	-4.360	660	11454	90	0.51715	1.00000	157	3917	6	101	193	13	169979	234	257	278	36307	212	228	249	33368	278	298	319	57037	273	283	301	2	133	10	92747	132	140	149	21315	129	134	143	16605	141	149	155	29330	146	148	150	7