cell.frame	cell.index	cell.center.x	cell.center.y	cell.majoraxis	cell.minoraxis	cell.orientation	cell.area	cell.volume	cell.perimeter	cell.eccentricity	cell.fractionOfGoodMembranePixels	cell.mem.area	cell.mem.volume	cell.nuc.radius	cell.nuc.area	mKOk.background.mean	mKOk.background.std	mKOk.cell.total	mKOk.cell.q25	mKOk.cell.q50	mKOk.cell.q75	mKOk.mem.total	mKOk.mem.q25	mKOk.mem.q50	mKOk.mem.q75	mKOk.nuc.total	mKOk.nuc.q25	mKOk.nuc.q50	mKOk.nuc.q75	mKOk.bright.total	mKOk.bright.q25	mKOk.bright.q50	mKOk.bright.q75	mKOk.bright.euler	mKate.background.mean	mKate.background.std	mKate.cell.total	mKate.cell.q25	mKate.cell.q50	mKate.cell.q75	mKate.mem.total	mKate.mem.q25	mKate.mem.q50	mKate.mem.q75	mKate.nuc.total	mKate.nuc.q25	mKate.nuc.q50	mKate.nuc.q75	mKate.bright.total	mKate.bright.q25	mKate.bright.q50	mKate.bright.q75	mKate.bright.euler
15	1	52	63	27	23	+56.465	486	7176	80	0.55285	0.96078	138	2798	5	69	196	13	120900	232	248	269	32358	215	236	250	20473	260	272	283	39323	264	269	273	2	138	9	69448	134	142	149	19679	134	141	149	15189	159	176	245	21767	146	148	151	15
15	2	75	42	36	30	+20.172	842	15940	102	0.56401	0.98462	182	4976	6	137	196	13	215519	236	256	275	43069	220	235	251	34957	265	282	297	70418	272	278	283	7	138	9	124467	136	143	153	27024	133	142	151	21556	144	153	182	41303	146	150	161	13
15	3	75	76	36	29	+53.131	798	15084	101	0.58266	0.99225	173	4687	6	121	196	13	207802	242	262	280	41354	220	239	254	33982	267	286	299	67586	276	282	288	6	138	9	114002	134	141	150	24665	131	136	147	18541	139	149	162	36428	147	150	152	10
15	4	101	82	22	19	+9.568	315	3758	61	0.52918	1.00000	109	1850	4	45	196	13	77072	225	245	262	25484	211	227	257	13743	248	266	279	25057	257	262	268	4	138	9	44441	134	140	149	15309	132	139	149	7754	140	151	159	14164	145	149	151	7
15	5	103	58	32	27	-2.780	687	11960	97	0.54509	0.95968	162	4069	6	109	196	13	179505	241	261	282	38661	217	239	256	32787	276	293	309	59378	278	286	298	5	138	9	100344	138	146	154	22946	134	141	150	16886	144	151	159	31404	151	152	154	8