cell.frame	cell.index	cell.center.x	cell.center.y	cell.majoraxis	cell.minoraxis	cell.orientation	cell.area	cell.volume	cell.perimeter	cell.eccentricity	cell.fractionOfGoodMembranePixels	cell.mem.area	cell.mem.volume	cell.nuc.radius	cell.nuc.area
22	1	179	267	16	15	-23.068	189	1708	50	0.29076	0.05000	129	1400	3	29
22	2	186	341	15	15	-15.740	171	1498	45	0.24665	0.00000	118	1273	3	25
22	3	220	247	19	15	+23.755	203	1834	54	0.61451	0.14063	139	1530	3	29
22	4	221	374	18	14	+17.188	190	1688	51	0.62500	0.06452	133	1439	3	29
22	5	244	249	15	12	-46.488	140	1108	41	0.61927	0.20833	105	1001	3	21
22	6	267	362	14	13	+57.584	144	1188	41	0.37845	0.00000	105	1029	3	21
22	7	288	228	22	15	-45.272	256	2612	58	0.70956	0.05405	153	1925	4	37
22	8	299	337	16	15	-31.635	176	1522	48	0.37307	0.08929	123	1297	3	25
22	9	313	215	19	16	-28.184	223	2140	55	0.51996	0.07353	144	1659	3	37
22	10	331	179	17	14	-37.083	181	1642	46	0.56502	0.00000	119	1308	3	29
22	11	344	159	17	13	-15.954	167	1458	44	0.65233	0.05357	115	1218	3	25
22	12	341	253	15	14	-10.242	155	1282	46	0.46712	0.08475	116	1115	3	21
22	13	364	244	15	14	+86.003	156	1308	43	0.41781	0.11111	111	1115	3	21
22	14	376	308	15	14	+86.232	165	1438	43	0.36520	0.00000	114	1219	3	25
22	15	378	191	29	15	+46.343	323	3310	72	0.85879	0.21277	198	2523	4	45
22	16	391	229	12	11	-0.597	98	696	34	0.46832	0.00000	81	659	2	21
22	17	392	174	15	13	-10.773	157	1378	42	0.53452	0.00000	108	1145	3	25
22	18	396	137	28	18	-34.976	371	4266	73	0.77758	0.41304	202	2953	4	57
22	19	415	77	42	25	+70.259	834	14140	109	0.79931	0.26812	312	7094	6	121
22	20	130	219	61	28	-42.553	1267	23083	148	0.89077	0.41700	420	9296	7	169
22	21	178	243	64	28	-13.896	1389	25637	150	0.89439	0.74022	445	10757	8	177
22	22	190	416	111	28	+76.745	2315	42133	229	0.96866	0.60904	688	16850	9	241
22	23	238	270	108	28	-1.138	2284	41044	229	0.96712	0.79392	687	16539	9	241
22	24	239	348	109	27	+12.747	2267	41055	227	0.96779	0.85121	684	16594	9	241
22	25	267	294	63	24	-3.676	1165	18345	145	0.92123	0.76453	422	8746	7	145
22	26	292	252	100	26	-20.426	1906	32206	209	0.96686	0.80911	623	13967	8	213
22	27	312	315	106	27	+4.330	2144	37610	224	0.96748	0.73141	671	16015	9	233
22	28	316	286	62	26	-15.142	1230	20924	146	0.90403	0.72832	427	9401	7	149
22	29	348	226	106	29	+20.177	2288	44572	224	0.96279	0.80288	670	17462	9	261
22	30	359	179	104	29	+53.158	2297	47121	222	0.96005	0.83809	648	16664	9	277
22	31	374	288	64	27	+5.067	1295	22179	146	0.90836	0.86931	429	9677	7	161
22	32	218	320	102	27	+0.957	2040	35798	214	0.96516	0.81085	635	15173	8	221
22	33	207	296	70	25	+1.989	1348	21856	154	0.93119	0.87311	453	9693	7	161