cell.frame	cell.index	cell.center.x	cell.center.y	cell.majoraxis	cell.minoraxis	cell.orientation	cell.area	cell.volume	cell.perimeter	cell.eccentricity	cell.fractionOfGoodMembranePixels	cell.mem.area	cell.mem.volume	cell.nuc.radius	cell.nuc.area
11	1	203	340	12	12	-85.631	111	790	36	0.34393	0.00000	87	718	2	21
11	2	211	243	17	16	-80.346	205	1928	50	0.32269	0.05172	131	1528	3	37
11	3	234	372	16	15	-52.920	179	1700	48	0.34600	0.01563	122	1395	3	29
11	4	230	245	15	13	-88.177	153	1286	43	0.51902	0.07843	108	1109	3	21
11	5	248	248	18	15	-34.263	206	1944	50	0.61149	0.13333	131	1535	3	37
11	6	258	361	15	13	+84.698	153	1298	42	0.43301	0.00000	107	1096	3	21
11	7	281	336	14	14	+60.333	148	1208	42	0.16091	0.02083	106	1038	3	21
11	8	297	236	18	14	-57.014	193	1822	49	0.61185	0.05000	127	1482	3	29
11	9	308	221	17	13	-72.067	171	1526	45	0.61390	0.00000	116	1267	3	25
11	10	337	184	17	13	-10.684	169	1442	45	0.61413	0.00000	117	1214	3	25
11	11	339	206	17	14	-37.401	184	1724	50	0.52998	0.07813	128	1418	3	29
11	12	347	161	18	13	-0.535	183	1586	48	0.66016	0.15517	124	1307	3	25
11	13	340	270	14	13	+35.420	128	960	41	0.40402	0.08333	101	889	3	21
11	14	342	254	18	14	+11.983	189	1654	50	0.64662	0.09524	129	1382	3	29
11	15	354	312	16	14	-64.284	167	1454	45	0.42552	0.09615	115	1230	3	25
11	16	364	242	15	14	-88.313	155	1302	44	0.36719	0.12727	112	1115	3	21
11	17	387	183	16	14	-47.511	169	1528	46	0.43526	0.05172	119	1286	3	25
11	18	157	233	105	28	-28.073	2255	44887	219	0.96273	0.73675	655	17003	9	261
11	19	192	409	88	27	+77.643	1821	32675	189	0.95046	0.58984	564	13462	8	213
11	20	227	319	79	25	+5.042	1528	25044	170	0.94778	0.84429	504	10932	7	177
11	21	234	268	92	27	-3.967	1939	34913	199	0.95441	0.83045	588	14142	8	221
11	22	245	294	103	25	+4.255	1916	31444	212	0.97071	0.76200	636	14328	8	213
11	23	233	349	87	27	+25.778	1826	33664	189	0.94955	0.83106	563	13401	8	221
11	24	297	258	81	26	-14.914	1601	26857	176	0.94717	0.83567	524	11508	8	185
11	25	303	313	89	27	+2.793	1810	31560	193	0.95453	0.79891	572	13410	8	213
11	26	336	289	105	26	-7.734	2071	36263	218	0.96900	0.80247	652	15748	8	221
11	27	347	227	91	28	+27.395	1968	36974	196	0.95213	0.91688	584	14016	9	225
11	28	368	172	78	29	+64.595	1740	34136	175	0.92899	0.89197	519	13059	8	221
11	29	403	110	80	28	+66.965	1700	31316	176	0.93890	0.64441	524	12442	8	197