cell.frame	cell.index	cell.center.x	cell.center.y	cell.majoraxis	cell.minoraxis	cell.orientation	cell.area	cell.volume	cell.perimeter	cell.eccentricity	cell.fractionOfGoodMembranePixels	cell.mem.area	cell.mem.volume	cell.nuc.radius	cell.nuc.area	mKOk.background.mean	mKOk.background.std	mKOk.cell.total	mKOk.cell.q25	mKOk.cell.q50	mKOk.cell.q75	mKOk.mem.total	mKOk.mem.q25	mKOk.mem.q50	mKOk.mem.q75	mKOk.nuc.total	mKOk.nuc.q25	mKOk.nuc.q50	mKOk.nuc.q75	mKOk.bright.total	mKOk.bright.q25	mKOk.bright.q50	mKOk.bright.q75	mKOk.bright.euler	mKate.background.mean	mKate.background.std	mKate.cell.total	mKate.cell.q25	mKate.cell.q50	mKate.cell.q75	mKate.mem.total	mKate.mem.q25	mKate.mem.q50	mKate.mem.q75	mKate.nuc.total	mKate.nuc.q25	mKate.nuc.q50	mKate.nuc.q75	mKate.bright.total	mKate.bright.q25	mKate.bright.q50	mKate.bright.q75	mKate.bright.euler
29	1	13	64	25	15	-16.174	294	2942	66	0.80381	0.30263	115	1593	4	45	192	14	59762	191	203	215	23382	192	200	215	9326	198	211	226	18842	209	211	217	10	125	8	38749	125	131	139	15075	123	130	136	5925	126	134	141	12009	134	136	139	10
29	2	21	88	14	12	-62.272	136	1132	39	0.53303	0.12000	66	750	3	21	192	14	27720	195	205	214	13476	196	205	213	5035	200	210	219	8670	210	211	213	5	125	8	17707	124	130	137	8619	125	130	137	3187	126	131	140	5543	133	135	137	7
29	3	41	62	35	26	+67.413	719	12472	97	0.66894	1.00000	171	4270	6	109	192	14	199367	254	276	299	42275	227	245	261	36743	306	325	348	67549	295	304	329	1	125	8	106946	140	148	157	24054	133	140	148	17373	148	154	162	33652	153	155	157	4
29	4	55	91	36	29	-9.340	824	15292	102	0.58623	0.99231	183	4979	6	129	192	14	219491	245	267	287	44380	228	242	258	35714	280	295	314	71836	283	288	296	5	125	8	115499	132	139	147	25690	131	137	145	17477	134	142	152	36527	143	145	148	15
29	5	61	118	23	23	-44.429	402	5556	70	0.15176	0.97727	124	2500	5	69	192	14	98425	226	245	263	28858	216	232	246	18221	254	270	281	32144	260	265	271	2	125	8	56063	131	139	148	17014	130	137	144	9913	139	146	153	17806	145	146	148	3
29	6	66	67	24	19	+28.054	348	4104	70	0.61811	0.86667	123	2049	4	49	192	14	96002	259	276	293	32541	248	265	281	15322	282	293	308	30567	289	291	299	4	125	8	49770	136	143	150	17476	136	143	149	7685	140	146	155	15363	146	147	149	10
29	7	70	40	37	31	+26.090	907	18108	107	0.53380	0.96324	187	5432	7	145	192	14	239002	247	264	281	45479	228	246	258	42141	270	283	299	77103	277	281	289	5	125	8	132712	132	141	149	26056	131	137	147	27682	151	164	203	45268	145	148	167	16
29	8	81	81	24	20	+76.773	357	4288	71	0.59276	0.96629	122	2087	4	57	192	14	96063	254	269	283	31739	245	258	274	14976	272	283	307	30577	282	283	288	3	125	8	50802	134	143	150	17338	133	142	150	7559	140	145	153	15943	147	148	151	4
29	9	97	58	35	30	+1.545	809	15078	103	0.51666	0.99219	184	4777	6	121	192	14	211062	241	260	281	43966	223	237	255	34378	275	285	300	69219	279	283	289	6	125	8	117395	133	141	149	27894	130	138	150	21355	146	158	189	39469	145	148	160	13
29	10	101	92	38	25	+48.782	736	12452	99	0.73978	1.00000	171	4167	6	109	192	14	194099	240	263	284	40535	217	234	255	33835	283	303	320	65062	282	290	303	4	125	8	104271	134	141	149	23242	129	136	143	16468	139	147	155	32786	146	148	150	12