cell.frame	cell.index	cell.center.x	cell.center.y	cell.majoraxis	cell.minoraxis	cell.orientation	cell.area	cell.volume	cell.perimeter	cell.eccentricity	cell.fractionOfGoodMembranePixels	cell.mem.area	cell.mem.volume	cell.nuc.radius	cell.nuc.area	mKOk.background.mean	mKOk.background.std	mKOk.cell.total	mKOk.cell.q25	mKOk.cell.q50	mKOk.cell.q75	mKOk.mem.total	mKOk.mem.q25	mKOk.mem.q50	mKOk.mem.q75	mKOk.nuc.total	mKOk.nuc.q25	mKOk.nuc.q50	mKOk.nuc.q75	mKOk.bright.total	mKOk.bright.q25	mKOk.bright.q50	mKOk.bright.q75	mKOk.bright.euler	mKate.background.mean	mKate.background.std	mKate.cell.total	mKate.cell.q25	mKate.cell.q50	mKate.cell.q75	mKate.mem.total	mKate.mem.q25	mKate.mem.q50	mKate.mem.q75	mKate.nuc.total	mKate.nuc.q25	mKate.nuc.q50	mKate.nuc.q75	mKate.bright.total	mKate.bright.q25	mKate.bright.q50	mKate.bright.q75	mKate.bright.euler
30	1	23	87	24	18	+16.502	317	3646	70	0.63729	0.52809	118	1857	4	45	198	14	65029	195	206	217	24132	196	207	215	11071	203	211	224	20448	212	214	218	8	134	8	41388	124	130	137	15355	123	129	136	6963	126	136	141	12904	134	135	137	10
30	2	41	62	36	26	+69.587	722	12064	98	0.68967	1.00000	173	4111	6	109	198	14	197015	251	271	295	42380	228	244	262	35300	299	318	332	66063	291	299	317	3	134	8	107027	140	148	157	24695	134	143	150	17271	146	154	162	33759	153	155	157	6
30	3	42	34	20	17	-53.296	249	2562	61	0.53729	0.56757	104	1409	3	37	198	14	52097	198	208	220	21825	198	208	224	6923	207	215	230	16471	215	217	224	4	134	8	32914	124	132	139	13735	125	131	140	4325	129	133	143	10198	134	135	137	12
30	4	54	92	36	29	-10.102	815	15074	101	0.57200	1.00000	183	4918	6	121	198	14	213499	243	261	280	44370	226	243	255	34622	274	287	303	69827	279	284	291	7	134	8	113705	132	138	146	25467	129	135	144	17996	136	146	158	36225	143	144	148	10
30	5	61	119	25	24	-26.637	471	7030	77	0.21930	0.98936	136	2975	5	69	198	14	116198	230	248	263	31109	209	226	245	20597	254	270	290	37831	262	269	272	3	134	8	64514	129	137	144	18684	130	138	146	10783	135	141	148	20116	140	143	144	7
30	6	81	83	26	19	+63.690	362	4324	74	0.67349	0.95745	125	2087	4	57	198	14	97433	252	268	287	32254	243	260	275	15153	277	292	303	31272	280	287	292	5	134	8	51082	132	141	149	17520	132	139	146	7691	141	146	155	16201	146	149	151	4
30	7	97	59	35	29	+1.719	807	15142	100	0.55636	0.98387	178	4793	6	129	198	14	207600	236	255	276	41748	223	233	249	35242	277	297	307	68755	272	282	295	2	134	8	116638	134	141	150	26216	130	138	148	19808	143	153	169	38251	147	150	153	8
30	8	101	93	38	26	+51.785	758	12996	99	0.73604	1.00000	171	4201	6	113	198	14	197912	236	260	284	39316	213	227	245	34518	288	308	327	66956	281	288	308	3	134	8	106363	133	140	148	23199	129	135	141	16335	139	146	152	33202	144	146	148	8
30	9	66	65	26	22	+74.274	438	5752	77	0.48854	0.89583	133	2189	5	69	198	14	120996	258	273	295	34523	247	258	271	20913	290	310	322	39486	290	299	311	2	134	8	64375	137	145	154	19861	136	145	155	10905	148	157	168	20725	150	153	158	4
30	10	70	39	37	29	+7.242	832	14468	109	0.62472	0.95775	191	4223	6	121	198	14	215100	237	256	277	45828	222	235	255	36092	282	297	320	72224	274	284	299	5	134	8	118236	134	142	150	26749	132	138	148	17614	138	146	154	37269	146	148	150	18