cell.frame	cell.index	cell.center.x	cell.center.y	cell.majoraxis	cell.minoraxis	cell.orientation	cell.area	cell.volume	cell.perimeter	cell.eccentricity	cell.fractionOfGoodMembranePixels	cell.mem.area	cell.mem.volume	cell.nuc.radius	cell.nuc.area	mKOk.background.mean	mKOk.background.std	mKOk.cell.total	mKOk.cell.q25	mKOk.cell.q50	mKOk.cell.q75	mKOk.mem.total	mKOk.mem.q25	mKOk.mem.q50	mKOk.mem.q75	mKOk.nuc.total	mKOk.nuc.q25	mKOk.nuc.q50	mKOk.nuc.q75	mKOk.bright.total	mKOk.bright.q25	mKOk.bright.q50	mKOk.bright.q75	mKOk.bright.euler	mKate.background.mean	mKate.background.std	mKate.cell.total	mKate.cell.q25	mKate.cell.q50	mKate.cell.q75	mKate.mem.total	mKate.mem.q25	mKate.mem.q50	mKate.mem.q75	mKate.nuc.total	mKate.nuc.q25	mKate.nuc.q50	mKate.nuc.q75	mKate.bright.total	mKate.bright.q25	mKate.bright.q50	mKate.bright.q75	mKate.bright.euler
2	1	50	73	8	7	+6.680	40	180	21	0.33624	1.00000	32	168	1	9	191	12	8024	189	200	208	6417	189	199	211	819	198	201	212	2500	205	207	211	1	128	7	5359	127	133	142	4228	126	130	137	561	138	143	143	1681	137	140	143	1
2	2	84	42	36	28	+23.670	780	13912	99	0.62089	1.00000	175	4529	6	121	191	12	206224	242	263	283	41511	220	238	254	36782	288	307	325	68739	279	288	307	7	128	7	110575	134	142	149	24094	130	138	144	17503	138	146	155	34662	146	148	150	8
2	3	80	74	34	29	-80.679	754	13456	101	0.53917	0.95238	184	4606	6	113	191	12	192610	233	254	275	42408	209	230	250	36356	280	306	323	65315	274	280	307	4	128	7	104022	131	138	146	24950	129	135	142	16993	136	141	149	32480	141	143	146	10
2	4	106	59	26	24	+45.938	500	7868	78	0.40094	0.95050	132	3040	5	81	191	12	129750	236	258	281	30821	215	234	250	23880	282	295	313	43602	280	291	298	3	128	7	69190	130	138	147	18009	129	135	145	11549	136	144	153	21961	144	146	148	4