cell.frame	cell.index	cell.center.x	cell.center.y	cell.majoraxis	cell.minoraxis	cell.orientation	cell.area	cell.volume	cell.perimeter	cell.eccentricity	cell.fractionOfGoodMembranePixels	cell.mem.area	cell.mem.volume	cell.nuc.radius	cell.nuc.area	mKOk.background.mean	mKOk.background.std	mKOk.cell.total	mKOk.cell.q25	mKOk.cell.q50	mKOk.cell.q75	mKOk.mem.total	mKOk.mem.q25	mKOk.mem.q50	mKOk.mem.q75	mKOk.nuc.total	mKOk.nuc.q25	mKOk.nuc.q50	mKOk.nuc.q75	mKOk.bright.total	mKOk.bright.q25	mKOk.bright.q50	mKOk.bright.q75	mKOk.bright.euler	mKate.background.mean	mKate.background.std	mKate.cell.total	mKate.cell.q25	mKate.cell.q50	mKate.cell.q75	mKate.mem.total	mKate.mem.q25	mKate.mem.q50	mKate.mem.q75	mKate.nuc.total	mKate.nuc.q25	mKate.nuc.q50	mKate.nuc.q75	mKate.bright.total	mKate.bright.q25	mKate.bright.q50	mKate.bright.q75	mKate.bright.euler
13	1	56	64	23	20	+57.846	353	4610	67	0.43253	0.97674	115	2068	4	61	198	17	88281	234	251	266	27524	224	236	255	13847	252	266	282	28175	261	263	270	2	133	8	49702	133	141	148	16002	129	139	148	7680	141	148	155	15624	144	146	150	6
13	2	77	78	35	29	+55.884	804	15064	102	0.55621	0.96154	179	4755	6	121	198	17	210791	244	263	282	42599	218	238	256	34422	271	286	304	68563	279	284	288	4	133	8	111133	129	138	145	24863	126	136	144	17764	138	145	155	35346	142	144	146	13
13	3	78	44	36	29	+22.386	825	15482	102	0.58646	0.96875	181	4906	6	129	198	17	211743	237	258	274	42501	217	233	251	34485	266	277	292	68648	272	276	281	6	133	8	117290	130	138	146	25781	127	136	145	20980	136	150	184	38954	142	144	154	13
13	4	102	82	17	15	+15.315	189	1740	48	0.50798	0.95000	84	1079	3	29	198	17	44980	221	240	255	19314	211	231	248	8084	241	251	262	14367	249	251	255	1	133	8	26335	131	138	146	11677	131	138	145	4631	137	142	151	8363	142	145	150	2
13	5	105	60	32	27	-6.654	677	11728	93	0.53637	1.00000	162	4017	6	101	198	17	176146	237	258	281	37837	213	232	255	33997	282	301	326	59434	278	288	304	2	133	8	96257	134	141	150	22168	130	136	143	16440	141	146	154	30213	146	148	150	10
13	6	123	80	23	14	-10.593	239	2114	69	0.77544	0.67901	115	1342	3	37	198	17	47184	187	196	206	22498	185	195	205	6482	192	199	211	14657	202	203	205	5	133	8	31368	124	130	136	14993	124	129	136	4387	127	132	136	9689	133	134	136	5
13	7	136	60	15	12	-32.515	137	1008	42	0.63908	0.40385	71	706	3	21	198	17	26556	185	195	203	13878	187	198	203	4663	186	194	205	8274	200	201	203	4	133	8	17618	124	128	134	9126	124	129	134	3122	124	130	136	5450	132	133	133	6