cell.frame	cell.index	cell.center.x	cell.center.y	cell.majoraxis	cell.minoraxis	cell.orientation	cell.area	cell.volume	cell.perimeter	cell.eccentricity	cell.fractionOfGoodMembranePixels	cell.mem.area	cell.mem.volume	cell.nuc.radius	cell.nuc.area	mKOk.background.mean	mKOk.background.std	mKOk.cell.total	mKOk.cell.q25	mKOk.cell.q50	mKOk.cell.q75	mKOk.mem.total	mKOk.mem.q25	mKOk.mem.q50	mKOk.mem.q75	mKOk.nuc.total	mKOk.nuc.q25	mKOk.nuc.q50	mKOk.nuc.q75	mKOk.bright.total	mKOk.bright.q25	mKOk.bright.q50	mKOk.bright.q75	mKOk.bright.euler	mKate.background.mean	mKate.background.std	mKate.cell.total	mKate.cell.q25	mKate.cell.q50	mKate.cell.q75	mKate.mem.total	mKate.mem.q25	mKate.mem.q50	mKate.mem.q75	mKate.nuc.total	mKate.nuc.q25	mKate.nuc.q50	mKate.nuc.q75	mKate.bright.total	mKate.bright.q25	mKate.bright.q50	mKate.bright.q75	mKate.bright.euler
9	1	48	75	8	7	+64.893	43	210	21	0.32858	0.96296	31	186	2	9	196	14	8738	188	202	215	6405	194	205	219	883	210	223	232	2688	204	206	208	2	131	8	5788	126	132	138	4179	125	132	138	544	134	136	139	1785	136	136	138	1
9	2	80	44	37	29	+22.447	845	15906	104	0.59812	0.98462	186	4979	6	137	196	14	223473	247	265	284	44757	219	238	259	35934	275	289	306	73240	282	287	293	6	131	8	119966	130	138	146	26472	127	136	146	21533	140	157	193	40235	142	144	160	8
9	3	79	78	35	31	+63.493	853	16712	105	0.45171	0.99254	185	5154	7	137	196	14	223895	241	263	284	43584	221	236	253	40998	280	294	306	74131	281	288	297	7	131	8	118003	130	136	144	25478	128	134	143	20973	136	143	159	37674	141	143	146	18
9	4	107	61	30	27	-6.547	623	10614	88	0.43638	0.99107	154	3737	6	97	196	14	161498	236	257	279	35557	214	230	246	29630	290	307	325	54843	275	289	306	2	131	8	88107	134	141	148	20911	130	136	141	14100	141	147	153	27662	146	148	149	6
9	5	103	86	18	16	+66.754	215	2070	57	0.44276	0.67143	98	1289	3	37	196	14	43547	193	202	215	19615	193	201	210	6698	199	211	221	13757	210	211	213	5	131	8	28168	125	131	138	12744	124	131	137	4311	129	134	142	8814	134	135	137	5