cell.frame	cell.index	cell.center.x	cell.center.y	cell.majoraxis	cell.minoraxis	cell.orientation	cell.area	cell.volume	cell.perimeter	cell.eccentricity	cell.fractionOfGoodMembranePixels	cell.mem.area	cell.mem.volume	cell.nuc.radius	cell.nuc.area	mKOk.background.mean	mKOk.background.std	mKOk.cell.total	mKOk.cell.q25	mKOk.cell.q50	mKOk.cell.q75	mKOk.mem.total	mKOk.mem.q25	mKOk.mem.q50	mKOk.mem.q75	mKOk.nuc.total	mKOk.nuc.q25	mKOk.nuc.q50	mKOk.nuc.q75	mKOk.bright.total	mKOk.bright.q25	mKOk.bright.q50	mKOk.bright.q75	mKOk.bright.euler	mKate.background.mean	mKate.background.std	mKate.cell.total	mKate.cell.q25	mKate.cell.q50	mKate.cell.q75	mKate.mem.total	mKate.mem.q25	mKate.mem.q50	mKate.mem.q75	mKate.nuc.total	mKate.nuc.q25	mKate.nuc.q50	mKate.nuc.q75	mKate.bright.total	mKate.bright.q25	mKate.bright.q50	mKate.bright.q75	mKate.bright.euler
14	1	54	63	24	22	+53.596	403	5526	74	0.36617	0.96809	130	2405	5	69	196	13	99171	231	246	262	30833	222	238	257	15854	254	263	275	31816	257	262	268	3	130	7	57348	134	141	149	18430	133	140	150	8705	137	146	152	17933	146	147	150	8
14	2	76	77	36	29	+53.525	793	14902	102	0.58873	0.96923	175	4676	6	121	196	13	204691	238	258	278	41681	217	239	258	34157	267	286	301	67487	276	285	288	5	130	7	110908	132	139	146	24591	131	139	146	18002	136	145	154	35065	143	144	147	13
14	3	76	43	36	29	+23.057	831	15582	104	0.58955	0.95276	184	4931	6	129	196	13	214673	239	259	279	43958	224	238	252	34860	265	284	296	70071	275	281	285	3	130	7	120338	133	141	149	27091	131	139	148	21091	141	151	187	40009	146	148	155	13
14	4	102	82	20	17	+11.800	252	2696	55	0.53001	0.98529	98	1450	4	37	196	13	59825	222	237	254	22464	209	228	247	11389	244	261	273	19488	251	255	260	2	130	7	34761	131	137	144	13579	131	137	146	6240	134	142	147	11008	142	144	147	5
14	5	103	59	33	27	-6.966	700	12268	94	0.55449	0.98305	164	4136	6	109	196	13	181130	238	258	280	39001	218	236	255	32618	279	292	305	60056	277	285	293	3	130	7	100564	137	144	150	22936	134	140	146	16613	142	149	155	31396	148	149	151	7