1.000000000000000000e+00;9.949999999999999956e-01;9.816666666666666874e-01;9.599999999999999645e-01;9.300000000000000488e-01;8.916666666666666075e-01;8.449999999999999734e-01;7.900000000000000355e-01;7.266666666666666829e-01;6.550000000000000266e-01;5.750000000000000666e-01;4.952380952380952550e-01;4.214285714285714857e-01;3.535714285714286476e-01;2.916666666666667407e-01;2.357142857142857650e-01;1.857142857142857206e-01;1.416666666666666075e-01;1.035714285714285365e-01;7.142857142857139685e-02;4.523809523809518840e-02;2.499999999999991118e-02;1.071428571428556520e-02;2.380952380952261471e-03;0.000000000000000000e+00;0.000000000000000000e+00;0.000000000000000000e+00;0.000000000000000000e+00;0.000000000000000000e+00;0.000000000000000000e+00;0.000000000000000000e+00;0.000000000000000000e+00;0.000000000000000000e+00;0.000000000000000000e+00;0.000000000000000000e+00;0.000000000000000000e+00;0.000000000000000000e+00;0.000000000000000000e+00;0.000000000000000000e+00;0.000000000000000000e+00;0.000000000000000000e+00;0.000000000000000000e+00;0.000000000000000000e+00;0.000000000000000000e+00;0.000000000000000000e+00;0.000000000000000000e+00;0.000000000000000000e+00;0.000000000000000000e+00;0.000000000000000000e+00;0.000000000000000000e+00;0.000000000000000000e+00;0.000000000000000000e+00;0.000000000000000000e+00;0.000000000000000000e+00;0.000000000000000000e+00;0.000000000000000000e+00;0.000000000000000000e+00;0.000000000000000000e+00;0.000000000000000000e+00;0.000000000000000000e+00;0.000000000000000000e+00;0.000000000000000000e+00;0.000000000000000000e+00;0.000000000000000000e+00;0.000000000000000000e+00;0.000000000000000000e+00;0.000000000000000000e+00;0.000000000000000000e+00;0.000000000000000000e+00;0.000000000000000000e+00;0.000000000000000000e+00;0.000000000000000000e+00;0.000000000000000000e+00;0.000000000000000000e+00;0.000000000000000000e+00;0.000000000000000000e+00;0.000000000000000000e+00;0.000000000000000000e+00;0.000000000000000000e+00;0.000000000000000000e+00;0.000000000000000000e+00;0.000000000000000000e+00;0.000000000000000000e+00;0.000000000000000000e+00;0.000000000000000000e+00;0.000000000000000000e+00;0.000000000000000000e+00;0.000000000000000000e+00;0.000000000000000000e+00;0.000000000000000000e+00;0.000000000000000000e+00;0.000000000000000000e+00;0.000000000000000000e+00;0.000000000000000000e+00;0.000000000000000000e+00;0.000000000000000000e+00
1.000000000000000000e+00;9.977777777777777635e-01;9.918518518518518734e-01;9.822222222222222188e-01;9.688888888888889106e-01;9.518518518518518379e-01;9.311111111111111116e-01;9.066666666666667318e-01;8.785185185185185874e-01;8.466666666666666785e-01;8.111111111111111160e-01;7.718518518518517890e-01;7.288888888888889195e-01;6.822222222222222854e-01;6.318518518518518867e-01;5.777777777777777235e-01;5.238095238095237249e-01;4.724867724867723995e-01;4.238095238095237471e-01;3.777777777777777679e-01;3.343915343915343508e-01;2.936507936507936067e-01;2.555555555555555358e-01;2.201058201058201380e-01;1.873015873015873023e-01;1.571428571428571397e-01;1.296296296296296502e-01;1.047619047619047228e-01;8.253968253968246849e-02;6.296296296296299833e-02;4.603174603174597923e-02;3.174603174603163325e-02;2.010582010582007140e-02;1.111111111111107164e-02;4.761904761904633965e-03;1.058201058200980427e-03;0.000000000000000000e+00;0.000000000000000000e+00;0.000000000000000000e+00;0.000000000000000000e+00;0.000000000000000000e+00;0.000000000000000000e+00;0.000000000000000000e+00;0.000000000000000000e+00;0.000000000000000000e+00;0.000000000000000000e+00;0.000000000000000000e+00;0.000000000000000000e+00;0.000000000000000000e+00;0.000000000000000000e+00;0.000000000000000000e+00;0.000000000000000000e+00;0.000000000000000000e+00;0.000000000000000000e+00;0.000000000000000000e+00;0.000000000000000000e+00;0.000000000000000000e+00;0.000000000000000000e+00;0.000000000000000000e+00;0.000000000000000000e+00;0.000000000000000000e+00;0.000000000000000000e+00;0.000000000000000000e+00;0.000000000000000000e+00;0.000000000000000000e+00;0.000000000000000000e+00;0.000000000000000000e+00;0.000000000000000000e+00;0.000000000000000000e+00;0.000000000000000000e+00;0.000000000000000000e+00;0.000000000000000000e+00;0.000000000000000000e+00;0.000000000000000000e+00;0.000000000000000000e+00;0.000000000000000000e+00;0.000000000000000000e+00;0.000000000000000000e+00;0.000000000000000000e+00;0.000000000000000000e+00;0.000000000000000000e+00;0.000000000000000000e+00;0.000000000000000000e+00;0.000000000000000000e+00;0.000000000000000000e+00;0.000000000000000000e+00;0.000000000000000000e+00;0.000000000000000000e+00;0.000000000000000000e+00;0.000000000000000000e+00;0.000000000000000000e+00;0.000000000000000000e+00;0.000000000000000000e+00;0.000000000000000000e+00;0.000000000000000000e+00;0.000000000000000000e+00
1.000000000000000000e+00;9.987500000000000266e-01;9.954166666666666163e-01;9.899999999999999911e-01;9.825000000000000400e-01;9.729166666666666519e-01;9.612500000000000488e-01;9.475000000000000089e-01;9.316666666666666430e-01;9.137500000000000622e-01;8.937500000000000444e-01;8.716666666666667007e-01;8.474999999999999201e-01;8.212500000000000355e-01;7.929166666666667140e-01;7.624999999999999556e-01;7.299999999999999822e-01;6.954166666666666829e-01;6.587499999999999467e-01;6.199999999999999956e-01;5.791666666666666075e-01;5.383928571428571175e-01;4.991071428571428603e-01;4.613095238095238360e-01;4.250000000000000444e-01;3.901785714285714857e-01;3.568452380952381597e-01;3.250000000000000666e-01;2.946428571428572063e-01;2.657738095238095788e-01;2.383928571428571841e-01;2.125000000000000222e-01;1.880952380952380931e-01;1.651785714285713969e-01;1.437499999999999334e-01;1.238095238095237027e-01;1.053571428571427049e-01;8.839285714285693984e-02;7.291666666666651864e-02;5.892857142857133024e-02;4.642857142857137465e-02;3.541666666666665186e-02;2.589285714285716189e-02;1.785714285714290472e-02;1.130952380952388037e-02;6.250000000000088818e-03;2.678571428571530078e-03;5.952380952382041457e-04;1.110223024625156540e-16;1.110223024625156540e-16;1.110223024625156540e-16;1.110223024625156540e-16;1.110223024625156540e-16;1.110223024625156540e-16;1.110223024625156540e-16;1.110223024625156540e-16;1.110223024625156540e-16;1.110223024625156540e-16;1.110223024625156540e-16;1.110223024625156540e-16;1.110223024625156540e-16;1.110223024625156540e-16;1.110223024625156540e-16;1.110223024625156540e-16;1.110223024625156540e-16;1.110223024625156540e-16;1.110223024625156540e-16;1.110223024625156540e-16;1.110223024625156540e-16;1.110223024625156540e-16;1.110223024625156540e-16;1.110223024625156540e-16;1.110223024625156540e-16;1.110223024625156540e-16;1.110223024625156540e-16;1.110223024625156540e-16;1.110223024625156540e-16;1.110223024625156540e-16;1.110223024625156540e-16;1.110223024625156540e-16;1.110223024625156540e-16;1.110223024625156540e-16;1.110223024625156540e-16;1.110223024625156540e-16;1.110223024625156540e-16;1.110223024625156540e-16;1.110223024625156540e-16;1.110223024625156540e-16;1.110223024625156540e-16;1.110223024625156540e-16;1.110223024625156540e-16;1.110223024625156540e-16;1.110223024625156540e-16;1.110223024625156540e-16;1.110223024625156540e-16;1.110223024625156540e-16
1.000000000000000000e+00;9.991999999999999771e-01;9.970666666666666567e-01;9.936000000000000387e-01;9.888000000000000123e-01;9.826666666666666883e-01;9.751999999999999558e-01;9.664000000000000368e-01;9.562666666666667092e-01;9.447999999999999732e-01;9.319999999999999396e-01;9.178666666666666085e-01;9.023999999999999799e-01;8.855999999999999428e-01;8.674666666666666082e-01;8.479999999999999760e-01;8.271999999999999353e-01;8.050666666666665972e-01;7.815999999999999615e-01;7.568000000000000282e-01;7.306666666666665755e-01;7.032000000000000473e-01;6.743999999999998884e-01;6.442666666666666542e-01;6.128000000000000114e-01;5.799999999999999600e-01;5.472380952380951902e-01;5.154285714285713471e-01;4.845714285714285419e-01;4.546666666666666634e-01;4.257142857142857117e-01;3.977142857142856869e-01;3.706666666666665888e-01;3.445714285714285285e-01;3.194285714285713951e-01;2.952380952380951884e-01;2.719999999999999085e-01;2.497142857142855554e-01;2.283809523809522402e-01;2.079999999999998517e-01;1.885714285714283900e-01;1.700952380952379661e-01;1.525714285714284690e-01;1.359999999999998987e-01;1.203809523809522553e-01;1.057142857142855386e-01;9.199999999999985967e-02;7.923809523809510758e-02;6.742857142857128228e-02;5.657142857142838377e-02;4.666666666666652308e-02;3.771428571428558918e-02;2.971428571428558207e-02;2.266666666666650176e-02;1.657142857142845926e-02;1.142857142857134356e-02;7.238095238095154649e-03;3.999999999999892530e-03;1.714285714285557205e-03;3.809523809522596949e-04;0.000000000000000000e+00;0.000000000000000000e+00;0.000000000000000000e+00;0.000000000000000000e+00;0.000000000000000000e+00;0.000000000000000000e+00;0.000000000000000000e+00;0.000000000000000000e+00;0.000000000000000000e+00;0.000000000000000000e+00;0.000000000000000000e+00;0.000000000000000000e+00;0.000000000000000000e+00;0.000000000000000000e+00;0.000000000000000000e+00;0.000000000000000000e+00;0.000000000000000000e+00;0.000000000000000000e+00;0.000000000000000000e+00;0.000000000000000000e+00;0.000000000000000000e+00;0.000000000000000000e+00;0.000000000000000000e+00;0.000000000000000000e+00;0.000000000000000000e+00;0.000000000000000000e+00;0.000000000000000000e+00;0.000000000000000000e+00;0.000000000000000000e+00;0.000000000000000000e+00;0.000000000000000000e+00;0.000000000000000000e+00;0.000000000000000000e+00;0.000000000000000000e+00;0.000000000000000000e+00;0.000000000000000000e+00
1.000000000000000000e+00;9.994444444444444686e-01;9.979629629629629406e-01;9.955555555555555269e-01;9.922222222222222276e-01;9.879629629629629317e-01;9.827777777777777501e-01;9.766666666666666829e-01;9.696296296296296191e-01;9.616666666666666696e-01;9.527777777777778345e-01;9.429629629629630028e-01;9.322222222222222854e-01;9.205555555555555713e-01;9.079629629629629717e-01;8.944444444444443754e-01;8.800000000000000044e-01;8.646296296296296369e-01;8.483333333333333837e-01;8.311111111111111338e-01;8.129629629629628873e-01;7.938888888888888662e-01;7.738888888888888484e-01;7.529629629629629450e-01;7.311111111111110450e-01;7.083333333333332593e-01;6.846296296296295880e-01;6.599999999999999201e-01;6.344444444444443665e-01;6.079629629629629273e-01;5.805555555555554914e-01;5.531746031746032077e-01;5.264550264550265091e-01;5.003968253968253954e-01;4.749999999999999778e-01;4.502645502645503672e-01;4.261904761904762307e-01;4.027777777777777901e-01;3.800264550264551566e-01;3.579365079365079971e-01;3.365079365079365337e-01;3.157407407407408773e-01;2.956349206349206948e-01;2.761904761904762085e-01;2.574074074074075291e-01;2.392857142857143238e-01;2.218253968253968145e-01;2.050264550264551122e-01;1.888888888888888840e-01;1.734126984126984627e-01;1.585978835978837376e-01;1.444444444444444864e-01;1.309523809523810423e-01;1.181216931216932942e-01;1.059523809523810201e-01;9.444444444444455300e-02;8.359788359788378198e-02;7.341269841269848495e-02;6.388888888888899498e-02;5.502645502645520104e-02;4.682539682539688108e-02;3.928571428571436819e-02;3.240740740740755133e-02;2.619047619047620845e-02;2.063492063492067263e-02;1.574074074074083285e-02;1.150793650793657807e-02;7.936507936508019334e-03;5.026455026455156627e-03;2.777777777777878931e-03;1.190476190476297269e-03;2.645502645504116401e-04;1.110223024625156540e-16;1.110223024625156540e-16;1.110223024625156540e-16;1.110223024625156540e-16;1.110223024625156540e-16;1.110223024625156540e-16;1.110223024625156540e-16;1.110223024625156540e-16;1.110223024625156540e-16;1.110223024625156540e-16;1.110223024625156540e-16;1.110223024625156540e-16;1.110223024625156540e-16;1.110223024625156540e-16;1.110223024625156540e-16;1.110223024625156540e-16;1.110223024625156540e-16;1.110223024625156540e-16;1.110223024625156540e-16;1.110223024625156540e-16;1.110223024625156540e-16;1.110223024625156540e-16;1.110223024625156540e-16;1.110223024625156540e-16
1.000000000000000000e+00;9.995918367346938727e-01;9.985034013605441627e-01;9.967346938775509813e-01;9.942857142857143282e-01;9.911564625850339816e-01;9.873469387755101634e-01;9.828571428571428736e-01;9.776870748299320013e-01;9.718367346938775464e-01;9.653061224489796199e-01;9.580952380952381109e-01;9.502040816326530193e-01;9.416326530612244561e-01;9.323809523809524213e-01;9.224489795918366930e-01;9.118367346938776041e-01;9.005442176870748217e-01;8.885714285714285676e-01;8.759183673469387310e-01;8.625850340136054228e-01;8.485714285714285321e-01;8.338775510204081698e-01;8.185034013605442249e-01;8.024489795918366974e-01;7.857142857142856984e-01;7.682993197278911168e-01;7.502040816326530637e-01;7.314285714285714279e-01;7.119727891156462096e-01;6.918367346938776308e-01;6.710204081632653583e-01;6.495238095238096143e-01;6.273469387755101767e-01;6.044897959183673786e-01;5.809523809523809978e-01;5.574344023323616337e-01;5.344023323615160193e-01;5.118561710398444875e-01;4.897959183673469274e-01;4.682215743440233391e-01;4.471331389698737224e-01;4.265306122448979664e-01;4.064139941690961821e-01;3.867832847424683695e-01;3.676384839650146397e-01;3.489795918367346594e-01;3.308066083576286509e-01;3.131195335276967251e-01;2.959183673469387710e-01;2.792031098153546775e-01;2.629737609329445558e-01;2.472303206997084057e-01;2.319727891156463384e-01;2.172011661807580207e-01;2.029154518950436747e-01;1.891156462585034115e-01;1.758017492711371199e-01;1.629737609329445780e-01;1.506316812439261188e-01;1.387755102040816313e-01;1.274052478134111155e-01;1.165208940719144604e-01;1.061224489795917769e-01;9.620991253644317620e-02;8.678328474246843616e-02;7.784256559766755679e-02;6.938775510204076014e-02;6.141885325558793518e-02;5.393586005830897090e-02;4.693877551020397831e-02;4.042759961127295743e-02;3.440233236151601925e-02;2.886297376093294176e-02;2.380952380952372494e-02;1.924198250728859083e-02;1.516034985422742842e-02;1.156462585034012669e-02;8.454810495626796651e-03;5.830903790087438310e-03;3.692905733722162687e-03;2.040816326530636715e-03;8.746355685130824398e-04;1.943634596696108829e-04;1.110223024625156540e-16;1.110223024625156540e-16;1.110223024625156540e-16;1.110223024625156540e-16;1.110223024625156540e-16;1.110223024625156540e-16;1.110223024625156540e-16;1.110223024625156540e-16;1.110223024625156540e-16;1.110223024625156540e-16;1.110223024625156540e-16;1.110223024625156540e-16
1.000000000000000000e+00;9.996874999999999512e-01;9.988541666666667096e-01;9.975000000000000533e-01;9.956249999999999822e-01;9.932291666666667185e-01;9.903125000000000400e-01;9.868749999999999467e-01;9.829166666666666607e-01;9.784374999999999600e-01;9.734374999999999556e-01;9.679166666666666474e-01;9.618750000000000355e-01;9.553125000000000089e-01;9.482291666666666785e-01;9.406250000000000444e-01;9.324999999999999956e-01;9.238541666666666430e-01;9.146874999999999867e-01;9.050000000000000266e-01;8.947916666666666519e-01;8.840624999999999734e-01;8.728124999999999911e-01;8.610416666666667052e-01;8.487500000000000044e-01;8.359375000000000000e-01;8.226041666666666918e-01;8.087500000000000799e-01;7.943750000000000533e-01;7.794791666666667229e-01;7.640625000000000888e-01;7.481250000000000400e-01;7.316666666666666874e-01;7.146875000000000311e-01;6.971875000000000711e-01;6.791666666666666963e-01;6.606250000000000178e-01;6.415625000000000355e-01;6.219791666666667496e-01;6.018750000000000488e-01;5.812500000000000444e-01;5.606398809523809312e-01;5.404017857142857650e-01;5.205357142857143238e-01;5.010416666666667185e-01;4.819196428571429491e-01;4.631696428571429047e-01;4.447916666666666963e-01;4.267857142857143238e-01;4.091517857142857872e-01;3.918898809523809756e-01;3.750000000000000000e-01;3.584821428571428603e-01;3.423363095238095566e-01;3.265624999999999778e-01;3.111607142857142350e-01;2.961309523809523281e-01;2.814732142857142572e-01;2.671874999999999112e-01;2.532738095238095122e-01;2.397321428571428381e-01;2.265625000000000000e-01;2.137648809523808868e-01;2.013392857142857206e-01;1.892857142857142794e-01;1.776041666666666741e-01;1.662946428571427937e-01;1.553571428571428603e-01;1.447916666666666519e-01;1.345982142857142794e-01;1.247767857142856318e-01;1.153273809523809312e-01;1.062499999999999556e-01;9.754464285714281591e-02;8.921130952380940116e-02;8.124999999999993339e-02;7.366071428571419055e-02;6.644345238095239470e-02;5.959821428571421276e-02;5.312499999999997780e-02;4.702380952380946777e-02;4.129464285714290472e-02;3.593749999999995559e-02;3.095238095238095344e-02;2.633928571428567622e-02;2.209821428571434598e-02;1.822916666666662966e-02;1.473214285714286031e-02;1.160714285714281591e-02;8.854166666666718477e-03;6.473214285714234961e-03;4.464285714285698425e-03;2.827380952380886825e-03;1.562500000000022204e-03;6.696428571427714971e-04;1.488095238094677697e-04
