%!PS-Adobe-3.0 EPSF-3.0
%%DocumentNeededResources: font Helvetica
%%+ font Helvetica-Bold
%%+ font Helvetica-Oblique
%%+ font Helvetica-BoldOblique
%%+ font Symbol
%%Title: R Graphics Output
%%Creator: R Software
%%Pages: (atend)
%%BoundingBox: 0 0 450 450
%%EndComments
%%BeginProlog
/bp  { gs sRGB gs } def
% begin .ps.prolog
/gs  { gsave } bind def
/gr  { grestore } bind def
/ep  { showpage gr gr } bind def
/m   { moveto } bind def
/l  { rlineto } bind def
/np  { newpath } bind def
/cp  { closepath } bind def
/f   { fill } bind def
/o   { stroke } bind def
/c   { newpath 0 360 arc } bind def
/r   { 4 2 roll moveto 1 copy 3 -1 roll exch 0 exch rlineto 0 rlineto -1 mul 0 exch rlineto closepath } bind def
/p1  { stroke } bind def
/p2  { gsave bg fill grestore newpath } bind def
/p3  { gsave bg fill grestore stroke } bind def
/p6  { gsave bg eofill grestore newpath } bind def
/p7  { gsave bg eofill grestore stroke } bind def
/t   { 5 -2 roll moveto gsave rotate
       1 index stringwidth pop
       mul neg 0 rmoveto show grestore } bind def
/ta  { 4 -2 roll moveto gsave rotate show } bind def
/tb  { 2 -1 roll 0 rmoveto show } bind def
/cl  { grestore gsave newpath 3 index 3 index moveto 1 index
       4 -1 roll lineto  exch 1 index lineto lineto
       closepath clip newpath } bind def
/rgb { setrgbcolor } bind def
/s   { scalefont setfont } bind def
% end   .ps.prolog
/sRGB { [ /CIEBasedABC
          << /DecodeLMN
               [ { dup 0.03928 le
                        {12.92321 div}
                        {0.055 add 1.055 div 2.4 exp }
                     ifelse
                 } bind dup dup
               ]
             /MatrixLMN [0.412457 0.212673 0.019334
                         0.357576 0.715152 0.119192
                         0.180437 0.072175 0.950301]
             /WhitePoint [0.9505 1.0 1.0890]
           >>
         ] setcolorspace } bind def
/srgb { setcolor } bind def
% begin encoding
/WinAnsiEncoding [
 /.notdef /.notdef /.notdef /.notdef /.notdef /.notdef /.notdef /.notdef
 /.notdef /.notdef /.notdef /.notdef /.notdef /.notdef /.notdef /.notdef
 /.notdef /.notdef /.notdef /.notdef /.notdef /.notdef /.notdef /.notdef
 /.notdef /.notdef /.notdef /.notdef /.notdef /.notdef /.notdef /.notdef
 /space /exclam /quotedbl /numbersign /dollar /percent /ampersand /quoteright
 /parenleft /parenright /asterisk /plus /comma /minus /period /slash
 /zero /one /two /three /four /five /six /seven
 /eight /nine /colon /semicolon /less /equal /greater /question
 /at /A /B /C /D /E /F /G
 /H /I /J /K /L /M /N /O
 /P /Q /R /S /T /U /V /W
 /X /Y /Z /bracketleft /backslash /bracketright /asciicircum /underscore
 /grave /a /b /c /d /e /f /g
 /h /i /j /k /l /m /n /o
 /p /q /r /s /t /u /v /w
 /x /y /z /braceleft /bar /braceright /asciitilde /.notdef
 /Euro /.notdef /quotesinglbase /florin /quotedblbase /ellipsis /dagger /daggerdbl
 /circumflex /perthousand /Scaron /guilsinglleft /OE /.notdef /Zcaron /.notdef
 /.notdef /quoteleft /quoteright /quotedblleft /quotedblright /bullet /endash /emdash
 /tilde /trademark /scaron /guilsinglright /oe /.notdef /zcaron /Ydieresis
 /space /exclamdown /cent /sterling /currency /yen /brokenbar /section
 /dieresis /copyright /ordfeminine /guillemotleft /logicalnot /hyphen /registered /macron
 /degree /plusminus /twosuperior /threesuperior /acute /mu /paragraph /periodcentered
 /cedilla /onesuperior /ordmasculine /guillemotright /onequarter /onehalf /threequarters /questiondown
 /Agrave /Aacute /Acircumflex /Atilde /Adieresis /Aring /AE /Ccedilla
 /Egrave /Eacute /Ecircumflex /Edieresis /Igrave /Iacute /Icircumflex /Idieresis
 /Eth /Ntilde /Ograve /Oacute /Ocircumflex /Otilde /Odieresis /multiply
 /Oslash /Ugrave /Uacute /Ucircumflex /Udieresis /Yacute /Thorn /germandbls
 /agrave /aacute /acircumflex /atilde /adieresis /aring /ae /ccedilla
 /egrave /eacute /ecircumflex /edieresis /igrave /iacute /icircumflex /idieresis
 /eth /ntilde /ograve /oacute /ocircumflex /otilde /odieresis /divide
 /oslash /ugrave /uacute /ucircumflex /udieresis /yacute /thorn /ydieresis
]
 def
% end encoding
%%IncludeResource: font Helvetica
/Helvetica findfont
dup length dict begin
  {1 index /FID ne {def} {pop pop} ifelse} forall
  /Encoding WinAnsiEncoding def
  currentdict
  end
/Font1 exch definefont pop
%%IncludeResource: font Helvetica-Bold
/Helvetica-Bold findfont
dup length dict begin
  {1 index /FID ne {def} {pop pop} ifelse} forall
  /Encoding WinAnsiEncoding def
  currentdict
  end
/Font2 exch definefont pop
%%IncludeResource: font Helvetica-Oblique
/Helvetica-Oblique findfont
dup length dict begin
  {1 index /FID ne {def} {pop pop} ifelse} forall
  /Encoding WinAnsiEncoding def
  currentdict
  end
/Font3 exch definefont pop
%%IncludeResource: font Helvetica-BoldOblique
/Helvetica-BoldOblique findfont
dup length dict begin
  {1 index /FID ne {def} {pop pop} ifelse} forall
  /Encoding WinAnsiEncoding def
  currentdict
  end
/Font4 exch definefont pop
%%IncludeResource: font Symbol
/Symbol findfont
dup length dict begin
  {1 index /FID ne {def} {pop pop} ifelse} forall
  currentdict
  end
/Font5 exch definefont pop
%%EndProlog
%%Page: 1 1
bp
/bg { 1 1 1 srgb } def
0.00 0.00 450.00 450.00 r p2
59.04 73.44 419.76 390.96 cl
1 0.6471 0 srgb
0.75 setlinewidth
[] 0 setdash
1 setlinecap
1 setlinejoin
10.00 setmiterlimit
np
72.40 85.20 m
11.52 7.59 l
11.51 10.80 l
11.52 11.47 l
11.52 11.56 l
11.52 11.36 l
11.51 10.97 l
11.52 10.46 l
11.52 9.84 l
11.52 9.17 l
11.51 8.45 l
11.52 7.70 l
11.52 6.97 l
11.51 6.26 l
11.52 5.58 l
11.52 4.95 l
11.52 4.38 l
11.51 3.87 l
11.52 3.41 l
11.52 3.01 l
11.51 2.66 l
11.52 2.34 l
11.52 2.08 l
11.52 1.85 l
11.51 1.65 l
11.52 1.47 l
11.52 1.31 l
11.52 1.19 l
11.51 1.06 l
11.52 0.97 l
o
0.00 0.00 450.00 450.00 cl
0 0 0 srgb
0.75 setlinewidth
[] 0 setdash
1 setlinecap
1 setlinejoin
10.00 setmiterlimit
np
72.40 73.44 m
296.89 0 l
o
np
72.40 73.44 m
0 -7.20 l
o
np
146.62 73.44 m
0 -7.20 l
o
np
220.84 73.44 m
0 -7.20 l
o
np
295.07 73.44 m
0 -7.20 l
o
np
369.29 73.44 m
0 -7.20 l
o
/Font1 findfont 12 s
72.40 47.52 (0) .5 0 t
146.62 47.52 (100) .5 0 t
220.84 47.52 (200) .5 0 t
295.07 47.52 (300) .5 0 t
369.29 47.52 (400) .5 0 t
np
59.04 85.20 m
0 245.00 l
o
np
59.04 85.20 m
-7.20 0 l
o
np
59.04 166.87 m
-7.20 0 l
o
np
59.04 248.53 m
-7.20 0 l
o
np
59.04 330.20 m
-7.20 0 l
o
41.76 85.20 (0) .5 90 t
41.76 166.87 (50) .5 90 t
41.76 248.53 (100) .5 90 t
41.76 330.20 (150) .5 90 t
np
 59.04 73.44 m
360.72 0 l
0 317.52 l
-360.72 0 l
cp p1
0.00 0.00 450.00 450.00 cl
/Font1 findfont 12 s
0 0 0 srgb
239.40 18.72 (Dose \(nM\)) .5 0 t
12.96 232.20 (Response \(nM\)) .5 90 t
59.04 73.44 419.76 390.96 cl
1 0.6471 0 srgb
0.75 setlinewidth
[] 0 setdash
1 setlinecap
1 setlinejoin
10.00 setmiterlimit
np
72.40 85.46 m
11.52 15.27 l
11.51 11.62 l
11.52 9.70 l
11.52 8.50 l
11.52 7.67 l
11.51 7.01 l
11.52 6.49 l
11.52 6.06 l
11.52 5.69 l
11.51 5.36 l
11.52 5.08 l
11.52 4.83 l
11.51 4.60 l
11.52 4.39 l
11.52 4.20 l
11.52 4.03 l
11.51 3.86 l
11.52 3.72 l
11.52 3.58 l
11.51 3.46 l
11.52 3.33 l
11.52 3.21 l
11.52 3.11 l
11.51 3.01 l
11.52 2.91 l
11.52 2.82 l
11.52 2.74 l
11.51 2.65 l
11.52 2.57 l
o
np
72.40 85.26 m
11.52 10.26 l
11.51 10.48 l
11.52 10.44 l
11.52 10.40 l
11.52 10.38 l
11.51 10.33 l
11.52 10.27 l
11.52 10.17 l
11.52 9.96 l
11.51 9.37 l
11.52 6.83 l
11.52 1.98 l
11.51 0.40 l
11.52 0.13 l
11.52 0.06 l
11.52 0.04 l
11.51 0.02 l
11.52 0.01 l
11.52 0.01 l
11.51 0.01 l
11.52 0 l
11.52 0.01 l
11.52 0 l
11.51 0.01 l
11.52 0 l
11.52 0 l
11.52 0 l
11.51 0 l
11.52 0 l
o
np
72.40 85.21 m
11.52 9.75 l
11.51 10.23 l
11.52 10.21 l
11.52 10.16 l
11.52 10.08 l
11.51 9.93 l
11.52 9.69 l
11.52 9.18 l
11.52 8.08 l
11.51 5.82 l
11.52 3.00 l
11.52 1.25 l
11.51 0.55 l
11.52 0.29 l
11.52 0.16 l
11.52 0.11 l
11.51 0.07 l
11.52 0.05 l
11.52 0.04 l
11.51 0.03 l
11.52 0.02 l
11.52 0.02 l
11.52 0.01 l
11.51 0.02 l
11.52 0.01 l
11.52 0.01 l
11.52 0 l
11.51 0.01 l
11.52 0.01 l
o
np
72.40 88.56 m
11.52 9.58 l
11.51 11.26 l
11.52 11.53 l
11.52 11.58 l
11.52 11.56 l
11.51 11.51 l
11.52 11.40 l
11.52 11.22 l
11.52 10.91 l
11.51 10.34 l
11.52 9.12 l
11.52 6.64 l
11.51 3.42 l
11.52 1.43 l
11.52 0.64 l
11.52 0.34 l
11.51 0.20 l
11.52 0.12 l
11.52 0.09 l
11.51 0.06 l
11.52 0.04 l
11.52 0.04 l
11.52 0.03 l
11.51 0.02 l
11.52 0.02 l
11.52 0.01 l
11.52 0.01 l
11.51 0.01 l
11.52 0.01 l
o
np
72.40 85.23 m
11.52 8.37 l
11.51 8.81 l
11.52 8.81 l
11.52 8.81 l
11.52 8.80 l
11.51 8.80 l
11.52 8.79 l
11.52 8.77 l
11.52 8.77 l
11.51 8.74 l
11.52 8.73 l
11.52 8.70 l
11.51 8.66 l
11.52 8.63 l
11.52 8.57 l
11.52 8.51 l
11.51 8.42 l
11.52 8.28 l
11.52 8.10 l
11.51 7.79 l
11.52 7.30 l
11.52 6.40 l
11.52 4.82 l
11.51 3.01 l
11.52 1.76 l
11.52 1.08 l
11.52 0.68 l
11.51 0.46 l
11.52 0.32 l
o
np
72.40 86.04 m
11.52 10.17 l
11.51 9.66 l
11.52 9.49 l
11.52 9.40 l
11.52 9.33 l
11.51 9.28 l
11.52 9.24 l
11.52 9.19 l
11.52 9.15 l
11.51 9.12 l
11.52 9.07 l
11.52 9.02 l
11.51 8.95 l
11.52 8.86 l
11.52 8.56 l
11.52 7.18 l
11.51 4.07 l
11.52 1.34 l
11.52 0.24 l
11.51 0.03 l
11.52 0.01 l
11.52 0 l
11.52 0.01 l
11.51 0 l
11.52 0 l
11.52 0 l
11.52 0 l
11.51 0 l
11.52 0 l
o
np
72.40 85.54 m
11.52 13.40 l
11.51 11.68 l
11.52 10.36 l
11.52 9.45 l
11.52 8.75 l
11.51 8.19 l
11.52 7.73 l
11.52 7.32 l
11.52 6.97 l
11.51 6.65 l
11.52 6.37 l
11.52 6.12 l
11.51 5.88 l
11.52 5.67 l
11.52 5.46 l
11.52 5.29 l
11.51 5.11 l
11.52 4.94 l
11.52 4.80 l
11.51 4.65 l
11.52 4.51 l
11.52 4.39 l
11.52 4.26 l
11.51 4.15 l
11.52 4.03 l
11.52 3.93 l
11.52 3.83 l
11.51 3.73 l
11.52 3.63 l
o
np
72.40 85.79 m
11.52 11.67 l
11.51 11.27 l
11.52 11.09 l
11.52 10.95 l
11.52 10.83 l
11.51 10.67 l
11.52 10.28 l
11.52 5.93 l
11.52 0.23 l
11.51 0.02 l
11.52 0.01 l
11.52 0 l
11.51 0.01 l
11.52 0 l
11.52 0 l
11.52 0 l
11.51 0 l
11.52 0 l
11.52 0 l
11.51 0 l
11.52 0 l
11.52 0 l
11.52 0 l
11.51 0 l
11.52 0 l
11.52 0 l
11.52 0 l
11.51 0 l
11.52 0 l
o
np
72.40 85.64 m
11.52 12.78 l
11.51 12.92 l
11.52 12.36 l
11.52 11.81 l
11.52 11.24 l
11.51 10.69 l
11.52 10.09 l
11.52 9.48 l
11.52 8.84 l
11.51 8.18 l
11.52 7.51 l
11.52 6.82 l
11.51 6.15 l
11.52 5.49 l
11.52 4.87 l
11.52 4.28 l
11.51 3.74 l
11.52 3.26 l
11.52 2.83 l
11.51 2.46 l
11.52 2.14 l
11.52 1.85 l
11.52 1.61 l
11.51 1.41 l
11.52 1.24 l
11.52 1.08 l
11.52 0.96 l
11.51 0.84 l
11.52 0.76 l
o
np
72.40 85.66 m
11.52 9.06 l
11.51 8.75 l
11.52 8.62 l
11.52 8.54 l
11.52 8.48 l
11.51 8.42 l
11.52 8.36 l
11.52 8.29 l
11.52 8.15 l
11.51 7.74 l
11.52 3.77 l
11.52 0.19 l
11.51 0.02 l
11.52 0.01 l
11.52 0.01 l
11.52 0 l
11.51 0 l
11.52 0 l
11.52 0 l
11.51 0 l
11.52 0 l
11.52 0 l
11.52 0 l
11.51 0 l
11.52 0 l
11.52 0 l
11.52 0 l
11.51 0 l
11.52 0.01 l
o
np
72.40 85.67 m
11.52 14.40 l
11.51 13.22 l
11.52 11.84 l
11.52 10.79 l
11.52 9.91 l
11.51 9.14 l
11.52 8.48 l
11.52 7.88 l
11.52 7.34 l
11.51 6.83 l
11.52 6.37 l
11.52 5.95 l
11.51 5.56 l
11.52 5.20 l
11.52 4.85 l
11.52 4.55 l
11.51 4.24 l
11.52 3.98 l
11.52 3.72 l
11.51 3.49 l
11.52 3.27 l
11.52 3.06 l
11.52 2.88 l
11.51 2.69 l
11.52 2.53 l
11.52 2.38 l
11.52 2.23 l
11.51 2.10 l
11.52 1.98 l
o
np
72.40 86.42 m
11.52 11.70 l
11.51 12.70 l
11.52 12.24 l
11.52 11.54 l
11.52 10.47 l
11.51 8.82 l
11.52 6.56 l
11.52 4.15 l
11.52 2.39 l
11.51 1.35 l
11.52 0.81 l
11.52 0.51 l
11.51 0.34 l
11.52 0.25 l
11.52 0.17 l
11.52 0.14 l
11.51 0.10 l
11.52 0.08 l
11.52 0.07 l
11.51 0.05 l
11.52 0.05 l
11.52 0.04 l
11.52 0.03 l
11.51 0.03 l
11.52 0.02 l
11.52 0.02 l
11.52 0.02 l
11.51 0.02 l
11.52 0.01 l
o
np
72.40 85.20 m
11.52 6.08 l
11.51 10.76 l
11.52 12.23 l
11.52 12.38 l
11.52 11.86 l
11.51 11.02 l
11.52 10.01 l
11.52 9.00 l
11.52 8.02 l
11.51 7.13 l
11.52 6.30 l
11.52 5.59 l
11.51 4.95 l
11.52 4.38 l
11.52 3.91 l
11.52 3.48 l
11.51 3.11 l
11.52 2.78 l
11.52 2.51 l
11.51 2.26 l
11.52 2.04 l
11.52 1.85 l
11.52 1.68 l
11.51 1.54 l
11.52 1.40 l
11.52 1.29 l
11.52 1.18 l
11.51 1.08 l
11.52 1.01 l
o
np
72.40 85.20 m
11.52 4.84 l
11.51 8.69 l
11.52 10.20 l
11.52 10.79 l
11.52 10.84 l
11.51 10.56 l
11.52 10.09 l
11.52 9.50 l
11.52 8.85 l
11.51 8.19 l
11.52 7.53 l
11.52 6.90 l
11.51 6.31 l
11.52 5.76 l
11.52 5.25 l
11.52 4.78 l
11.51 4.36 l
11.52 3.98 l
11.52 3.63 l
11.51 3.32 l
11.52 3.04 l
11.52 2.79 l
11.52 2.56 l
11.51 2.35 l
11.52 2.17 l
11.52 2.00 l
11.52 1.85 l
11.51 1.72 l
11.52 1.58 l
o
np
72.40 85.27 m
11.52 10.52 l
11.51 10.72 l
11.52 10.68 l
11.52 10.63 l
11.52 10.59 l
11.51 10.53 l
11.52 10.42 l
11.52 10.19 l
11.52 9.44 l
11.51 5.74 l
11.52 1.07 l
11.52 0.22 l
11.51 0.08 l
11.52 0.03 l
11.52 0.03 l
11.52 0.01 l
11.51 0.01 l
11.52 0 l
11.52 0.01 l
11.51 0 l
11.52 0.01 l
11.52 0 l
11.52 0 l
11.51 0 l
11.52 0 l
11.52 0 l
11.52 0.01 l
11.51 0 l
11.52 0 l
o
np
72.40 86.69 m
11.52 11.17 l
11.51 12.25 l
11.52 12.14 l
11.52 11.86 l
11.52 11.39 l
11.51 10.53 l
11.52 8.93 l
11.52 6.20 l
11.52 3.27 l
11.51 1.52 l
11.52 0.75 l
11.52 0.42 l
11.51 0.25 l
11.52 0.16 l
11.52 0.12 l
11.52 0.08 l
11.51 0.06 l
11.52 0.05 l
11.52 0.03 l
11.51 0.04 l
11.52 0.02 l
11.52 0.02 l
11.52 0.02 l
11.51 0.01 l
11.52 0.02 l
11.52 0.01 l
11.52 0.01 l
11.51 0 l
11.52 0.01 l
o
np
72.40 93.48 m
11.52 6.50 l
11.51 7.90 l
11.52 8.54 l
11.52 8.85 l
11.52 9.01 l
11.51 9.11 l
11.52 9.15 l
11.52 9.17 l
11.52 9.16 l
11.51 9.09 l
11.52 8.89 l
11.52 7.98 l
11.51 3.52 l
11.52 0.44 l
11.52 0.11 l
11.52 0.03 l
11.51 0.02 l
11.52 0.02 l
11.52 0 l
11.51 0.01 l
11.52 0 l
11.52 0.01 l
11.52 0 l
11.51 0 l
11.52 0 l
11.52 0 l
11.52 0 l
11.51 0 l
11.52 0 l
o
np
72.40 88.64 m
11.52 7.65 l
11.51 9.37 l
11.52 9.68 l
11.52 9.76 l
11.52 9.74 l
11.51 9.68 l
11.52 9.55 l
11.52 9.27 l
11.52 8.57 l
11.51 6.56 l
11.52 2.93 l
11.52 0.87 l
11.51 0.32 l
11.52 0.15 l
11.52 0.08 l
11.52 0.05 l
11.51 0.03 l
11.52 0.03 l
11.52 0.01 l
11.51 0.02 l
11.52 0.01 l
11.52 0 l
11.52 0.01 l
11.51 0.01 l
11.52 0 l
11.52 0 l
11.52 0.01 l
11.51 0 l
11.52 0 l
o
np
72.40 85.20 m
11.52 4.53 l
11.51 8.45 l
11.52 10.40 l
11.52 11.57 l
11.52 12.28 l
11.51 12.66 l
11.52 12.82 l
11.52 12.80 l
11.52 12.64 l
11.51 12.40 l
11.52 12.07 l
11.52 11.70 l
11.51 11.29 l
11.52 10.84 l
11.52 10.40 l
11.52 9.94 l
11.51 9.48 l
11.52 9.02 l
11.52 8.58 l
11.51 8.15 l
11.52 7.73 l
11.52 7.33 l
11.52 6.94 l
11.51 6.57 l
11.52 6.23 l
11.52 5.89 l
11.52 5.58 l
11.51 5.29 l
11.52 5.00 l
o
np
72.40 85.20 m
11.52 9.92 l
11.51 15.07 l
11.52 14.99 l
11.52 13.45 l
11.52 11.50 l
11.51 9.57 l
11.52 7.85 l
11.52 6.41 l
11.52 5.25 l
11.51 4.31 l
11.52 3.56 l
11.52 2.96 l
11.51 2.49 l
11.52 2.11 l
11.52 1.79 l
11.52 1.54 l
11.51 1.33 l
11.52 1.16 l
11.52 1.02 l
11.51 0.89 l
11.52 0.79 l
11.52 0.70 l
11.52 0.63 l
11.51 0.57 l
11.52 0.50 l
11.52 0.46 l
11.52 0.42 l
11.51 0.38 l
11.52 0.35 l
o
np
72.40 85.20 m
11.52 4.92 l
11.51 8.30 l
11.52 9.51 l
11.52 9.99 l
11.52 10.08 l
11.51 9.94 l
11.52 9.63 l
11.52 9.23 l
11.52 8.75 l
11.51 8.23 l
11.52 7.70 l
11.52 7.16 l
11.51 6.63 l
11.52 6.13 l
11.52 5.63 l
11.52 5.18 l
11.51 4.75 l
11.52 4.36 l
11.52 3.99 l
11.51 3.66 l
11.52 3.35 l
11.52 3.08 l
11.52 2.82 l
11.51 2.60 l
11.52 2.39 l
11.52 2.20 l
11.52 2.02 l
11.51 1.88 l
11.52 1.73 l
o
np
72.40 88.07 m
11.52 9.39 l
11.51 11.09 l
11.52 11.27 l
11.52 11.28 l
11.52 11.26 l
11.51 11.19 l
11.52 11.11 l
11.52 11.00 l
11.52 10.84 l
11.51 10.65 l
11.52 10.35 l
11.52 9.92 l
11.51 9.26 l
11.52 8.25 l
11.52 6.74 l
11.52 4.86 l
11.51 3.11 l
11.52 1.88 l
11.52 1.14 l
11.51 0.72 l
11.52 0.48 l
11.52 0.34 l
11.52 0.24 l
11.51 0.19 l
11.52 0.14 l
11.52 0.11 l
11.52 0.09 l
11.51 0.07 l
11.52 0.06 l
o
np
72.40 85.20 m
11.52 6.16 l
11.51 10.73 l
11.52 12.32 l
11.52 12.76 l
11.52 12.61 l
11.51 12.10 l
11.52 11.37 l
11.52 10.56 l
11.52 9.69 l
11.51 8.84 l
11.52 8.03 l
11.52 7.26 l
11.51 6.55 l
11.52 5.90 l
11.52 5.33 l
11.52 4.80 l
11.51 4.33 l
11.52 3.92 l
11.52 3.54 l
11.51 3.22 l
11.52 2.92 l
11.52 2.66 l
11.52 2.42 l
11.51 2.22 l
11.52 2.03 l
11.52 1.87 l
11.52 1.72 l
11.51 1.58 l
11.52 1.46 l
o
np
72.40 85.24 m
11.52 15.69 l
11.51 12.70 l
11.52 10.98 l
11.52 9.86 l
11.52 9.03 l
11.51 8.37 l
11.52 7.83 l
11.52 7.38 l
11.52 6.98 l
11.51 6.63 l
11.52 6.33 l
11.52 6.05 l
11.51 5.80 l
11.52 5.56 l
11.52 5.36 l
11.52 5.16 l
11.51 4.98 l
11.52 4.81 l
11.52 4.65 l
11.51 4.50 l
11.52 4.36 l
11.52 4.22 l
11.52 4.11 l
11.51 3.98 l
11.52 3.87 l
11.52 3.76 l
11.52 3.66 l
11.51 3.56 l
11.52 3.47 l
o
np
72.40 85.73 m
11.52 12.65 l
11.51 12.26 l
11.52 11.35 l
11.52 10.58 l
11.52 9.92 l
11.51 9.31 l
11.52 8.76 l
11.52 8.24 l
11.52 7.75 l
11.51 7.30 l
11.52 6.86 l
11.52 6.44 l
11.51 6.06 l
11.52 5.68 l
11.52 5.32 l
11.52 4.99 l
11.51 4.68 l
11.52 4.37 l
11.52 4.10 l
11.51 3.82 l
11.52 3.58 l
11.52 3.34 l
11.52 3.13 l
11.51 2.91 l
11.52 2.73 l
11.52 2.55 l
11.52 2.38 l
11.51 2.23 l
11.52 2.08 l
o
np
72.40 85.86 m
11.52 13.36 l
11.51 13.18 l
11.52 11.75 l
11.52 10.20 l
11.52 8.57 l
11.51 6.91 l
11.52 5.33 l
11.52 4.00 l
11.52 2.94 l
11.51 2.15 l
11.52 1.60 l
11.52 1.20 l
11.51 0.91 l
11.52 0.71 l
11.52 0.56 l
11.52 0.45 l
11.51 0.37 l
11.52 0.30 l
11.52 0.25 l
11.51 0.21 l
11.52 0.18 l
11.52 0.16 l
11.52 0.14 l
11.51 0.11 l
11.52 0.11 l
11.52 0.09 l
11.52 0.08 l
11.51 0.07 l
11.52 0.07 l
o
np
72.40 86.38 m
11.52 9.73 l
11.51 10.68 l
11.52 10.46 l
11.52 10.11 l
11.52 9.64 l
11.51 8.95 l
11.52 7.94 l
11.52 6.53 l
11.52 4.81 l
11.51 3.16 l
11.52 1.94 l
11.52 1.21 l
11.51 0.76 l
11.52 0.51 l
11.52 0.36 l
11.52 0.25 l
11.51 0.19 l
11.52 0.15 l
11.52 0.12 l
11.51 0.09 l
11.52 0.07 l
11.52 0.07 l
11.52 0.05 l
11.51 0.04 l
11.52 0.04 l
11.52 0.03 l
11.52 0.03 l
11.51 0.03 l
11.52 0.02 l
o
np
72.40 85.63 m
11.52 13.34 l
11.51 11.97 l
11.52 10.41 l
11.52 9.12 l
11.52 8.01 l
11.51 7.03 l
11.52 6.16 l
11.52 5.37 l
11.52 4.68 l
11.51 4.07 l
11.52 3.54 l
11.52 3.08 l
11.51 2.67 l
11.52 2.33 l
11.52 2.03 l
11.52 1.77 l
11.51 1.56 l
11.52 1.37 l
11.52 1.20 l
11.51 1.07 l
11.52 0.95 l
11.52 0.85 l
11.52 0.76 l
11.51 0.68 l
11.52 0.61 l
11.52 0.55 l
11.52 0.50 l
11.51 0.45 l
11.52 0.42 l
o
np
72.40 89.63 m
11.52 7.53 l
11.51 9.08 l
11.52 9.49 l
11.52 9.60 l
11.52 9.61 l
11.51 9.49 l
11.52 8.93 l
11.52 5.48 l
11.52 0.81 l
11.51 0.14 l
11.52 0.05 l
11.52 0.02 l
11.51 0.02 l
11.52 0 l
11.52 0.01 l
11.52 0 l
11.51 0.01 l
11.52 0 l
11.52 0 l
11.51 0 l
11.52 0 l
11.52 0 l
11.52 0 l
11.51 0 l
11.52 0 l
11.52 0.01 l
11.52 0 l
11.51 0 l
11.52 0 l
o
np
72.40 85.21 m
11.52 10.11 l
11.51 10.63 l
11.52 10.66 l
11.52 10.65 l
11.52 10.65 l
11.51 10.65 l
11.52 10.63 l
11.52 10.62 l
11.52 10.61 l
11.51 10.57 l
11.52 10.55 l
11.52 10.51 l
11.51 10.47 l
11.52 10.41 l
11.52 10.33 l
11.52 10.24 l
11.51 10.10 l
11.52 9.92 l
11.52 9.64 l
11.51 9.23 l
11.52 8.57 l
11.52 7.51 l
11.52 5.89 l
11.51 4.03 l
11.52 2.52 l
11.52 1.57 l
11.52 1.00 l
11.51 0.66 l
11.52 0.46 l
o
np
72.40 85.29 m
11.52 8.79 l
11.51 8.88 l
11.52 8.84 l
11.52 8.82 l
11.52 8.78 l
11.51 8.75 l
11.52 8.71 l
11.52 8.65 l
11.52 8.55 l
11.51 8.28 l
11.52 7.16 l
11.52 2.83 l
11.51 0.40 l
11.52 0.11 l
11.52 0.04 l
11.52 0.02 l
11.51 0.02 l
11.52 0 l
11.52 0.01 l
11.51 0 l
11.52 0.01 l
11.52 0 l
11.52 0 l
11.51 0 l
11.52 0 l
11.52 0.01 l
11.52 0 l
11.51 0 l
11.52 0 l
o
np
72.40 87.44 m
11.52 10.04 l
11.51 11.63 l
11.52 11.67 l
11.52 11.54 l
11.52 11.29 l
11.51 10.84 l
11.52 9.94 l
11.52 8.04 l
11.52 4.87 l
11.51 2.15 l
11.52 0.92 l
11.52 0.44 l
11.51 0.25 l
11.52 0.15 l
11.52 0.10 l
11.52 0.07 l
11.51 0.06 l
11.52 0.04 l
11.52 0.03 l
11.51 0.02 l
11.52 0.02 l
11.52 0.02 l
11.52 0.01 l
11.51 0.01 l
11.52 0.01 l
11.52 0.01 l
11.52 0 l
11.51 0.01 l
11.52 0.01 l
o
np
72.40 89.87 m
11.52 7.94 l
11.51 9.72 l
11.52 10.14 l
11.52 10.28 l
11.52 10.30 l
11.51 10.27 l
11.52 10.15 l
11.52 9.83 l
11.52 8.72 l
11.51 4.69 l
11.52 1.01 l
11.52 0.25 l
11.51 0.10 l
11.52 0.06 l
11.52 0.02 l
11.52 0.02 l
11.51 0.02 l
11.52 0.01 l
11.52 0 l
11.51 0.01 l
11.52 0 l
11.52 0.01 l
11.52 0 l
11.51 0 l
11.52 0 l
11.52 0 l
11.52 0 l
11.51 0.01 l
11.52 0 l
o
np
72.40 86.08 m
11.52 9.04 l
11.51 9.77 l
11.52 9.60 l
11.52 9.40 l
11.52 9.21 l
11.51 9.00 l
11.52 8.81 l
11.52 8.59 l
11.52 8.37 l
11.51 8.14 l
11.52 7.90 l
11.52 7.65 l
11.51 7.37 l
11.52 7.08 l
11.52 6.79 l
11.52 6.47 l
11.51 6.15 l
11.52 5.81 l
11.52 5.46 l
11.51 5.10 l
11.52 4.76 l
11.52 4.40 l
11.52 4.06 l
11.51 3.73 l
11.52 3.40 l
11.52 3.10 l
11.52 2.82 l
11.51 2.55 l
11.52 2.31 l
o
np
72.40 96.09 m
11.52 7.02 l
11.51 8.16 l
11.52 8.82 l
11.52 9.20 l
11.52 9.42 l
11.51 9.56 l
11.52 9.64 l
11.52 9.66 l
11.52 9.63 l
11.51 9.40 l
11.52 7.20 l
11.52 0.90 l
11.51 0.08 l
11.52 0.02 l
11.52 0.01 l
11.52 0 l
11.51 0.01 l
11.52 0 l
11.52 0 l
11.51 0 l
11.52 0 l
11.52 0 l
11.52 0 l
11.51 0 l
11.52 0.01 l
11.52 0 l
11.52 0 l
11.51 0 l
11.52 0 l
o
np
72.40 85.26 m
11.52 9.19 l
11.51 9.32 l
11.52 9.27 l
11.52 9.24 l
11.52 9.21 l
11.51 9.18 l
11.52 9.15 l
11.52 9.11 l
11.52 9.09 l
11.51 9.04 l
11.52 8.99 l
11.52 8.94 l
11.51 8.87 l
11.52 8.79 l
11.52 8.70 l
11.52 8.56 l
11.51 8.41 l
11.52 8.21 l
11.52 7.93 l
11.51 7.56 l
11.52 7.07 l
11.52 6.38 l
11.52 5.52 l
11.51 4.48 l
11.52 3.41 l
11.52 2.47 l
11.52 1.74 l
11.51 1.23 l
11.52 0.88 l
o
np
72.40 85.21 m
11.52 9.92 l
11.51 10.37 l
11.52 10.36 l
11.52 10.31 l
11.52 10.22 l
11.51 10.07 l
11.52 9.79 l
11.52 9.23 l
11.52 7.86 l
11.51 5.02 l
11.52 2.11 l
11.52 0.81 l
11.51 0.37 l
11.52 0.20 l
11.52 0.12 l
11.52 0.07 l
11.51 0.06 l
11.52 0.04 l
11.52 0.02 l
11.51 0.03 l
11.52 0.01 l
11.52 0.02 l
11.52 0.01 l
11.51 0.01 l
11.52 0.01 l
11.52 0 l
11.52 0.01 l
11.51 0.01 l
11.52 0 l
o
np
72.40 85.73 m
11.52 10.65 l
11.51 10.63 l
11.52 9.97 l
11.52 9.42 l
11.52 8.91 l
11.51 8.45 l
11.52 8.00 l
11.52 7.58 l
11.52 7.18 l
11.51 6.78 l
11.52 6.40 l
11.52 6.04 l
11.51 5.68 l
11.52 5.33 l
11.52 5.01 l
11.52 4.69 l
11.51 4.39 l
11.52 4.10 l
11.52 3.83 l
11.51 3.56 l
11.52 3.32 l
11.52 3.09 l
11.52 2.87 l
11.51 2.67 l
11.52 2.48 l
11.52 2.30 l
11.52 2.14 l
11.51 1.98 l
11.52 1.85 l
o
np
72.40 85.69 m
11.52 14.47 l
11.51 13.72 l
11.52 12.38 l
11.52 11.36 l
11.52 10.53 l
11.51 9.82 l
11.52 9.19 l
11.52 8.62 l
11.52 8.11 l
11.51 7.65 l
11.52 7.21 l
11.52 6.82 l
11.51 6.44 l
11.52 6.10 l
11.52 5.77 l
11.52 5.46 l
11.51 5.18 l
11.52 4.91 l
11.52 4.66 l
11.51 4.42 l
11.52 4.19 l
11.52 3.98 l
11.52 3.78 l
11.51 3.59 l
11.52 3.41 l
11.52 3.24 l
11.52 3.08 l
11.51 2.94 l
11.52 2.78 l
o
np
72.40 85.77 m
11.52 9.76 l
11.51 10.03 l
11.52 9.58 l
11.52 9.19 l
11.52 8.84 l
11.51 8.50 l
11.52 8.20 l
11.52 7.90 l
11.52 7.62 l
11.51 7.34 l
11.52 7.07 l
11.52 6.81 l
11.51 6.56 l
11.52 6.30 l
11.52 6.06 l
11.52 5.82 l
11.51 5.58 l
11.52 5.36 l
11.52 5.13 l
11.51 4.91 l
11.52 4.69 l
11.52 4.48 l
11.52 4.29 l
11.51 4.08 l
11.52 3.90 l
11.52 3.71 l
11.52 3.53 l
11.51 3.36 l
11.52 3.19 l
o
np
72.40 86.34 m
11.52 9.09 l
11.51 10.01 l
11.52 9.82 l
11.52 9.51 l
11.52 9.08 l
11.51 8.47 l
11.52 7.55 l
11.52 6.23 l
11.52 4.58 l
11.51 2.99 l
11.52 1.82 l
11.52 1.10 l
11.51 0.70 l
11.52 0.46 l
11.52 0.32 l
11.52 0.23 l
11.51 0.17 l
11.52 0.13 l
11.52 0.11 l
11.51 0.08 l
11.52 0.07 l
11.52 0.05 l
11.52 0.05 l
11.51 0.04 l
11.52 0.03 l
11.52 0.03 l
11.52 0.02 l
11.51 0.03 l
11.52 0.01 l
o
np
72.40 85.58 m
11.52 11.60 l
11.51 11.06 l
11.52 10.12 l
11.52 9.29 l
11.52 8.53 l
11.51 7.82 l
11.52 7.15 l
11.52 6.51 l
11.52 5.91 l
11.51 5.33 l
11.52 4.81 l
11.52 4.31 l
11.51 3.86 l
11.52 3.44 l
11.52 3.07 l
11.52 2.73 l
11.51 2.42 l
11.52 2.16 l
11.52 1.93 l
11.51 1.71 l
11.52 1.54 l
11.52 1.37 l
11.52 1.22 l
11.51 1.11 l
11.52 0.99 l
11.52 0.89 l
11.52 0.81 l
11.51 0.74 l
11.52 0.67 l
o
np
72.40 85.31 m
11.52 10.53 l
11.51 10.63 l
11.52 10.57 l
11.52 10.53 l
11.52 10.49 l
11.51 10.44 l
11.52 10.39 l
11.52 10.30 l
11.52 10.12 l
11.51 9.70 l
11.52 7.91 l
11.52 3.00 l
11.51 0.55 l
11.52 0.16 l
11.52 0.07 l
11.52 0.04 l
11.51 0.02 l
11.52 0.01 l
11.52 0.01 l
11.51 0.01 l
11.52 0 l
11.52 0.01 l
11.52 0 l
11.51 0 l
11.52 0.01 l
11.52 0 l
11.52 0 l
11.51 0 l
11.52 0 l
o
np
72.40 85.46 m
11.52 14.57 l
11.51 11.23 l
11.52 9.53 l
11.52 8.47 l
11.52 7.71 l
11.51 7.13 l
11.52 6.65 l
11.52 6.27 l
11.52 5.93 l
11.51 5.63 l
11.52 5.38 l
11.52 5.15 l
11.51 4.95 l
11.52 4.75 l
11.52 4.59 l
11.52 4.42 l
11.51 4.28 l
11.52 4.14 l
11.52 4.02 l
11.51 3.90 l
11.52 3.78 l
11.52 3.68 l
11.52 3.58 l
11.51 3.49 l
11.52 3.40 l
11.52 3.31 l
11.52 3.23 l
11.51 3.16 l
11.52 3.08 l
o
np
72.40 85.20 m
11.52 4.89 l
11.51 9.38 l
11.52 11.51 l
11.52 12.59 l
11.52 12.96 l
11.51 12.89 l
11.52 12.53 l
11.52 11.97 l
11.52 11.31 l
11.51 10.60 l
11.52 9.88 l
11.52 9.17 l
11.51 8.48 l
11.52 7.84 l
11.52 7.23 l
11.52 6.66 l
11.51 6.15 l
11.52 5.68 l
11.52 5.24 l
11.51 4.84 l
11.52 4.47 l
11.52 4.15 l
11.52 3.84 l
11.51 3.57 l
11.52 3.32 l
11.52 3.08 l
11.52 2.88 l
11.51 2.68 l
11.52 2.51 l
o
np
72.40 85.99 m
11.52 9.32 l
11.51 9.94 l
11.52 9.70 l
11.52 9.46 l
11.52 9.23 l
11.51 9.01 l
11.52 8.79 l
11.52 8.57 l
11.52 8.34 l
11.51 8.12 l
11.52 7.89 l
11.52 7.66 l
11.51 7.42 l
11.52 7.18 l
11.52 6.93 l
11.52 6.67 l
11.51 6.42 l
11.52 6.15 l
11.52 5.89 l
11.51 5.62 l
11.52 5.35 l
11.52 5.09 l
11.52 4.81 l
11.51 4.55 l
11.52 4.28 l
11.52 4.03 l
11.52 3.78 l
11.51 3.54 l
11.52 3.31 l
o
np
72.40 88.08 m
11.52 9.12 l
11.51 10.81 l
11.52 10.97 l
11.52 10.94 l
11.52 10.77 l
11.51 10.36 l
11.52 9.20 l
11.52 6.46 l
11.52 3.13 l
11.51 1.17 l
11.52 0.44 l
11.52 0.19 l
11.51 0.10 l
11.52 0.06 l
11.52 0.03 l
11.52 0.03 l
11.51 0.02 l
11.52 0.01 l
11.52 0.01 l
11.51 0.01 l
11.52 0.01 l
11.52 0 l
11.52 0.01 l
11.51 0 l
11.52 0.01 l
11.52 0 l
11.52 0 l
11.51 0.01 l
11.52 0 l
o
np
72.40 101.97 m
11.52 6.94 l
11.51 7.59 l
11.52 8.12 l
11.52 8.50 l
11.52 8.77 l
11.51 8.94 l
11.52 9.02 l
11.52 8.93 l
11.52 7.13 l
11.51 0.33 l
11.52 0.01 l
11.52 0.01 l
11.51 0 l
11.52 0 l
11.52 0 l
11.52 0 l
11.51 0 l
11.52 0 l
11.52 0 l
11.51 0 l
11.52 0 l
11.52 0 l
11.52 0 l
11.51 0 l
11.52 0 l
11.52 0 l
11.52 0 l
11.51 0 l
11.52 0 l
o
np
72.40 85.20 m
11.52 8.12 l
11.51 9.59 l
11.52 9.71 l
11.52 9.64 l
11.52 9.45 l
11.51 9.16 l
11.52 8.77 l
11.52 8.26 l
11.52 7.66 l
11.51 6.92 l
11.52 6.11 l
11.52 5.24 l
11.51 4.38 l
11.52 3.58 l
11.52 2.87 l
11.52 2.30 l
11.51 1.84 l
11.52 1.46 l
11.52 1.18 l
11.51 0.96 l
11.52 0.79 l
11.52 0.65 l
11.52 0.55 l
11.51 0.46 l
11.52 0.39 l
11.52 0.34 l
11.52 0.29 l
11.51 0.25 l
11.52 0.23 l
o
0.9882 0.3059 0.1647 srgb
np
72.40 88.55 m
11.52 8.74 l
11.51 10.59 l
11.52 10.86 l
11.52 10.92 l
11.52 10.92 l
11.51 10.90 l
11.52 10.86 l
11.52 10.80 l
11.52 10.73 l
11.51 10.62 l
11.52 10.49 l
11.52 10.31 l
11.51 10.04 l
11.52 9.67 l
11.52 9.08 l
11.52 8.17 l
11.51 6.80 l
11.52 5.02 l
11.52 3.26 l
11.51 1.98 l
11.52 1.19 l
11.52 0.76 l
11.52 0.49 l
11.51 0.35 l
11.52 0.25 l
11.52 0.18 l
11.52 0.14 l
11.51 0.11 l
11.52 0.09 l
o
np
72.40 85.20 m
11.52 4.61 l
11.51 8.86 l
11.52 10.96 l
11.52 12.06 l
11.52 12.51 l
11.51 12.53 l
11.52 12.27 l
11.52 11.81 l
11.52 11.24 l
11.51 10.60 l
11.52 9.94 l
11.52 9.27 l
11.51 8.63 l
11.52 8.02 l
11.52 7.43 l
11.52 6.88 l
11.51 6.37 l
11.52 5.91 l
11.52 5.47 l
11.51 5.07 l
11.52 4.70 l
11.52 4.37 l
11.52 4.06 l
11.51 3.78 l
11.52 3.52 l
11.52 3.28 l
11.52 3.07 l
11.51 2.86 l
11.52 2.68 l
o
np
72.40 95.67 m
11.52 7.24 l
11.51 8.73 l
11.52 9.47 l
11.52 9.86 l
11.52 10.06 l
11.51 10.19 l
11.52 10.27 l
11.52 10.32 l
11.52 10.35 l
11.51 10.37 l
11.52 10.36 l
11.52 10.34 l
11.51 10.29 l
11.52 10.19 l
11.52 9.93 l
11.52 9.16 l
11.51 5.95 l
11.52 1.49 l
11.52 0.33 l
11.51 0.12 l
11.52 0.06 l
11.52 0.03 l
11.52 0.02 l
11.51 0.02 l
11.52 0.01 l
11.52 0 l
11.52 0.01 l
11.51 0 l
11.52 0.01 l
o
np
72.40 85.21 m
11.52 9.56 l
11.51 10.09 l
11.52 10.11 l
11.52 10.12 l
11.52 10.12 l
11.51 10.10 l
11.52 10.09 l
11.52 10.07 l
11.52 10.04 l
11.51 10.00 l
11.52 9.96 l
11.52 9.90 l
11.51 9.83 l
11.52 9.73 l
11.52 9.59 l
11.52 9.41 l
11.51 9.13 l
11.52 8.72 l
11.52 8.10 l
11.51 7.14 l
11.52 5.79 l
11.52 4.23 l
11.52 2.78 l
11.51 1.75 l
11.52 1.11 l
11.52 0.72 l
11.52 0.49 l
11.51 0.34 l
11.52 0.26 l
o
np
72.40 85.20 m
11.52 3.28 l
11.51 6.49 l
11.52 8.34 l
11.52 9.63 l
11.52 10.53 l
11.51 11.16 l
11.52 11.56 l
11.52 11.78 l
11.52 11.88 l
11.51 11.86 l
11.52 11.74 l
11.52 11.57 l
11.51 11.33 l
11.52 11.06 l
11.52 10.75 l
11.52 10.43 l
11.51 10.08 l
11.52 9.73 l
11.52 9.37 l
11.51 9.02 l
11.52 8.67 l
11.52 8.33 l
11.52 7.98 l
11.51 7.66 l
11.52 7.33 l
11.52 7.03 l
11.52 6.72 l
11.51 6.45 l
11.52 6.16 l
o
np
72.40 85.20 m
11.52 3.54 l
11.51 7.02 l
11.52 9.02 l
11.52 10.35 l
11.52 11.22 l
11.51 11.77 l
11.52 12.04 l
11.52 12.13 l
11.52 12.05 l
11.51 11.87 l
11.52 11.58 l
11.52 11.25 l
11.51 10.87 l
11.52 10.45 l
11.52 10.03 l
11.52 9.59 l
11.51 9.16 l
11.52 8.72 l
11.52 8.31 l
11.51 7.91 l
11.52 7.51 l
11.52 7.14 l
11.52 6.78 l
11.51 6.43 l
11.52 6.11 l
11.52 5.81 l
11.52 5.51 l
11.51 5.23 l
11.52 4.98 l
o
np
72.40 85.20 m
11.52 3.66 l
11.51 7.21 l
11.52 9.21 l
11.52 10.48 l
11.52 11.31 l
11.51 11.78 l
11.52 11.99 l
11.52 12.01 l
11.52 11.86 l
11.51 11.63 l
11.52 11.29 l
11.52 10.91 l
11.51 10.50 l
11.52 10.05 l
11.52 9.60 l
11.52 9.14 l
11.51 8.70 l
11.52 8.26 l
11.52 7.84 l
11.51 7.43 l
11.52 7.03 l
11.52 6.66 l
11.52 6.31 l
11.51 5.98 l
11.52 5.65 l
11.52 5.36 l
11.52 5.07 l
11.51 4.81 l
11.52 4.56 l
o
np
72.40 85.21 m
11.52 9.46 l
11.51 9.85 l
11.52 9.85 l
11.52 9.85 l
11.52 9.84 l
11.51 9.83 l
11.52 9.81 l
11.52 9.80 l
11.52 9.76 l
11.51 9.74 l
11.52 9.69 l
11.52 9.62 l
11.51 9.55 l
11.52 9.42 l
11.52 9.22 l
11.52 8.90 l
11.51 8.31 l
11.52 7.19 l
11.52 5.26 l
11.51 3.02 l
11.52 1.51 l
11.52 0.77 l
11.52 0.43 l
11.51 0.26 l
11.52 0.17 l
11.52 0.12 l
11.52 0.09 l
11.51 0.07 l
11.52 0.05 l
o
np
72.40 86.78 m
11.52 9.09 l
11.51 9.47 l
11.52 9.62 l
11.52 9.67 l
11.52 9.66 l
11.51 9.65 l
11.52 9.63 l
11.52 9.59 l
11.52 9.54 l
11.51 9.49 l
11.52 9.42 l
11.52 9.33 l
11.51 9.24 l
11.52 9.10 l
11.52 8.93 l
11.52 8.69 l
11.51 8.38 l
11.52 7.94 l
11.52 7.32 l
11.51 6.45 l
11.52 5.35 l
11.52 4.11 l
11.52 2.93 l
11.51 2.00 l
11.52 1.35 l
11.52 0.93 l
11.52 0.66 l
11.51 0.47 l
11.52 0.36 l
o
np
72.40 85.22 m
11.52 9.67 l
11.51 10.13 l
11.52 10.13 l
11.52 10.12 l
11.52 10.12 l
11.51 10.11 l
11.52 10.10 l
11.52 10.09 l
11.52 10.06 l
11.51 10.04 l
11.52 10.01 l
11.52 9.97 l
11.51 9.92 l
11.52 9.85 l
11.52 9.75 l
11.52 9.62 l
11.51 9.42 l
11.52 9.08 l
11.52 8.51 l
11.51 7.45 l
11.52 5.61 l
11.52 3.40 l
11.52 1.85 l
11.51 1.02 l
11.52 0.61 l
11.52 0.38 l
11.52 0.25 l
11.51 0.18 l
11.52 0.13 l
o
np
72.40 85.20 m
11.52 3.89 l
11.51 7.58 l
11.52 9.58 l
11.52 10.79 l
11.52 11.51 l
11.51 11.85 l
11.52 11.93 l
11.52 11.81 l
11.52 11.55 l
11.51 11.18 l
11.52 10.76 l
11.52 10.29 l
11.51 9.80 l
11.52 9.30 l
11.52 8.80 l
11.52 8.31 l
11.51 7.84 l
11.52 7.39 l
11.52 6.96 l
11.51 6.55 l
11.52 6.16 l
11.52 5.79 l
11.52 5.46 l
11.51 5.14 l
11.52 4.83 l
11.52 4.56 l
11.52 4.29 l
11.51 4.05 l
11.52 3.83 l
o
np
72.40 85.20 m
11.52 5.42 l
11.51 10.23 l
11.52 12.40 l
11.52 13.36 l
11.52 13.58 l
11.51 13.35 l
11.52 12.88 l
11.52 12.25 l
11.52 11.58 l
11.51 10.89 l
11.52 10.22 l
11.52 9.57 l
11.51 8.96 l
11.52 8.39 l
11.52 7.87 l
11.52 7.37 l
11.51 6.91 l
11.52 6.49 l
11.52 6.10 l
11.51 5.73 l
11.52 5.41 l
11.52 5.09 l
11.52 4.80 l
11.51 4.54 l
11.52 4.29 l
11.52 4.06 l
11.52 3.84 l
11.51 3.65 l
11.52 3.45 l
o
np
72.40 91.77 m
11.52 6.68 l
11.51 8.16 l
11.52 8.70 l
11.52 8.95 l
11.52 9.07 l
11.51 9.13 l
11.52 9.17 l
11.52 9.20 l
11.52 9.20 l
11.51 9.21 l
11.52 9.21 l
11.52 9.21 l
11.51 9.18 l
11.52 9.17 l
11.52 9.15 l
11.52 9.10 l
11.51 9.05 l
11.52 8.97 l
11.52 8.85 l
11.51 8.66 l
11.52 8.32 l
11.52 7.69 l
11.52 6.42 l
11.51 4.27 l
11.52 2.15 l
11.52 0.99 l
11.52 0.50 l
11.51 0.28 l
11.52 0.17 l
o
np
72.40 87.48 m
11.52 8.92 l
11.51 10.39 l
11.52 10.53 l
11.52 10.54 l
11.52 10.51 l
11.51 10.47 l
11.52 10.41 l
11.52 10.34 l
11.52 10.26 l
11.51 10.17 l
11.52 10.07 l
11.52 9.94 l
11.51 9.80 l
11.52 9.61 l
11.52 9.39 l
11.52 9.11 l
11.51 8.77 l
11.52 8.33 l
11.52 7.78 l
11.51 7.10 l
11.52 6.27 l
11.52 5.33 l
11.52 4.36 l
11.51 3.44 l
11.52 2.64 l
11.52 2.00 l
11.52 1.52 l
11.51 1.15 l
11.52 0.90 l
o
np
72.40 85.30 m
11.52 10.96 l
11.51 11.10 l
11.52 11.05 l
11.52 11.04 l
11.52 11.01 l
11.51 11.00 l
11.52 10.99 l
11.52 10.97 l
11.52 10.97 l
11.51 10.94 l
11.52 10.94 l
11.52 10.92 l
11.51 10.90 l
11.52 10.88 l
11.52 10.86 l
11.52 10.82 l
11.51 10.78 l
11.52 10.72 l
11.52 10.62 l
11.51 10.48 l
11.52 10.18 l
11.52 9.58 l
11.52 8.03 l
11.51 4.75 l
11.52 1.78 l
11.52 0.66 l
11.52 0.29 l
11.51 0.16 l
11.52 0.10 l
o
np
72.40 85.20 m
11.52 4.12 l
11.51 7.76 l
11.52 9.61 l
11.52 10.76 l
11.52 11.46 l
11.51 11.86 l
11.52 12.03 l
11.52 12.05 l
11.52 11.94 l
11.51 11.73 l
11.52 11.45 l
11.52 11.12 l
11.51 10.75 l
11.52 10.35 l
11.52 9.93 l
11.52 9.52 l
11.51 9.10 l
11.52 8.67 l
11.52 8.27 l
11.51 7.86 l
11.52 7.47 l
11.52 7.09 l
11.52 6.73 l
11.51 6.39 l
11.52 6.06 l
11.52 5.74 l
11.52 5.44 l
11.51 5.17 l
11.52 4.89 l
o
np
72.40 85.20 m
11.52 8.24 l
11.51 10.46 l
11.52 10.88 l
11.52 11.01 l
11.52 10.98 l
11.51 10.87 l
11.52 10.71 l
11.52 10.47 l
11.52 10.20 l
11.51 9.86 l
11.52 9.49 l
11.52 9.06 l
11.51 8.60 l
11.52 8.09 l
11.52 7.55 l
11.52 7.00 l
11.51 6.43 l
11.52 5.86 l
11.52 5.30 l
11.51 4.76 l
11.52 4.25 l
11.52 3.79 l
11.52 3.36 l
11.51 2.98 l
11.52 2.63 l
11.52 2.32 l
11.52 2.06 l
11.51 1.83 l
11.52 1.62 l
o
np
72.40 85.20 m
11.52 3.59 l
11.51 6.92 l
11.52 8.73 l
11.52 9.91 l
11.52 10.70 l
11.51 11.20 l
11.52 11.49 l
11.52 11.61 l
11.52 11.60 l
11.51 11.50 l
11.52 11.31 l
11.52 11.07 l
11.51 10.79 l
11.52 10.46 l
11.52 10.12 l
11.52 9.76 l
11.51 9.39 l
11.52 9.02 l
11.52 8.65 l
11.51 8.28 l
11.52 7.92 l
11.52 7.57 l
11.52 7.22 l
11.51 6.90 l
11.52 6.58 l
11.52 6.28 l
11.52 5.98 l
11.51 5.70 l
11.52 5.44 l
o
np
72.40 85.21 m
11.52 9.77 l
11.51 10.24 l
11.52 10.26 l
11.52 10.25 l
11.52 10.26 l
11.51 10.24 l
11.52 10.24 l
11.52 10.21 l
11.52 10.20 l
11.51 10.17 l
11.52 10.14 l
11.52 10.10 l
11.51 10.04 l
11.52 9.97 l
11.52 9.89 l
11.52 9.75 l
11.51 9.56 l
11.52 9.29 l
11.52 8.84 l
11.51 8.12 l
11.52 6.94 l
11.52 5.21 l
11.52 3.37 l
11.51 1.99 l
11.52 1.18 l
11.52 0.72 l
11.52 0.47 l
11.51 0.32 l
11.52 0.23 l
o
np
72.40 87.91 m
11.52 8.87 l
11.51 10.49 l
11.52 10.67 l
11.52 10.69 l
11.52 10.66 l
11.51 10.60 l
11.52 10.53 l
11.52 10.44 l
11.52 10.32 l
11.51 10.15 l
11.52 9.94 l
11.52 9.63 l
11.51 9.19 l
11.52 8.55 l
11.52 7.57 l
11.52 6.21 l
11.51 4.58 l
11.52 3.05 l
11.52 1.92 l
11.51 1.22 l
11.52 0.79 l
11.52 0.54 l
11.52 0.38 l
11.51 0.28 l
11.52 0.21 l
11.52 0.17 l
11.52 0.12 l
11.51 0.11 l
11.52 0.08 l
o
np
72.40 85.22 m
11.52 10.19 l
11.51 10.60 l
11.52 10.59 l
11.52 10.59 l
11.52 10.58 l
11.51 10.57 l
11.52 10.54 l
11.52 10.53 l
11.52 10.49 l
11.51 10.46 l
11.52 10.41 l
11.52 10.33 l
11.51 10.24 l
11.52 10.08 l
11.52 9.83 l
11.52 9.37 l
11.51 8.48 l
11.52 6.70 l
11.52 4.02 l
11.51 1.95 l
11.52 0.94 l
11.52 0.50 l
11.52 0.29 l
11.51 0.19 l
11.52 0.13 l
11.52 0.09 l
11.52 0.07 l
11.51 0.05 l
11.52 0.04 l
o
np
72.40 85.79 m
11.52 10.16 l
11.51 9.80 l
11.52 9.67 l
11.52 9.60 l
11.52 9.56 l
11.51 9.52 l
11.52 9.49 l
11.52 9.47 l
11.52 9.44 l
11.51 9.43 l
11.52 9.40 l
11.52 9.39 l
11.51 9.36 l
11.52 9.35 l
11.52 9.33 l
11.52 9.30 l
11.51 9.27 l
11.52 9.24 l
11.52 9.19 l
11.51 9.13 l
11.52 9.01 l
11.52 8.73 l
11.52 7.49 l
11.51 2.54 l
11.52 0.30 l
11.52 0.07 l
11.52 0.03 l
11.51 0.02 l
11.52 0.01 l
o
np
72.40 85.22 m
11.52 10.50 l
11.51 10.90 l
11.52 10.89 l
11.52 10.89 l
11.52 10.87 l
11.51 10.86 l
11.52 10.85 l
11.52 10.81 l
11.52 10.79 l
11.51 10.75 l
11.52 10.70 l
11.52 10.62 l
11.51 10.51 l
11.52 10.34 l
11.52 10.04 l
11.52 9.48 l
11.51 8.29 l
11.52 5.96 l
11.52 3.13 l
11.51 1.38 l
11.52 0.66 l
11.52 0.35 l
11.52 0.21 l
11.51 0.14 l
11.52 0.09 l
11.52 0.07 l
11.52 0.05 l
11.51 0.04 l
11.52 0.03 l
o
np
72.40 87.33 m
11.52 11.23 l
11.51 10.28 l
11.52 9.95 l
11.52 9.79 l
11.52 9.67 l
11.51 9.60 l
11.52 9.55 l
11.52 9.51 l
11.52 9.48 l
11.51 9.47 l
11.52 9.45 l
11.52 9.43 l
11.51 9.41 l
11.52 9.38 l
11.52 9.35 l
11.52 9.29 l
11.51 9.14 l
11.52 8.64 l
11.52 4.99 l
11.51 0.49 l
11.52 0.08 l
11.52 0.03 l
11.52 0.01 l
11.51 0.01 l
11.52 0 l
11.52 0.01 l
11.52 0 l
11.51 0 l
11.52 0 l
o
np
72.40 85.20 m
11.52 3.66 l
11.51 7.23 l
11.52 9.21 l
11.52 10.47 l
11.52 11.25 l
11.51 11.67 l
11.52 11.83 l
11.52 11.79 l
11.52 11.59 l
11.51 11.30 l
11.52 10.93 l
11.52 10.51 l
11.51 10.05 l
11.52 9.59 l
11.52 9.12 l
11.52 8.65 l
11.51 8.20 l
11.52 7.75 l
11.52 7.33 l
11.51 6.93 l
11.52 6.54 l
11.52 6.17 l
11.52 5.83 l
11.51 5.50 l
11.52 5.20 l
11.52 4.91 l
11.52 4.65 l
11.51 4.39 l
11.52 4.15 l
o
np
72.40 85.20 m
11.52 3.25 l
11.51 6.50 l
11.52 8.41 l
11.52 9.74 l
11.52 10.67 l
11.51 11.30 l
11.52 11.71 l
11.52 11.91 l
11.52 11.98 l
11.51 11.92 l
11.52 11.77 l
11.52 11.55 l
11.51 11.28 l
11.52 10.96 l
11.52 10.61 l
11.52 10.25 l
11.51 9.88 l
11.52 9.51 l
11.52 9.12 l
11.51 8.74 l
11.52 8.38 l
11.52 8.02 l
11.52 7.67 l
11.51 7.34 l
11.52 7.01 l
11.52 6.69 l
11.52 6.40 l
11.51 6.12 l
11.52 5.84 l
o
np
72.40 85.28 m
11.52 10.90 l
11.51 11.08 l
11.52 11.05 l
11.52 11.03 l
11.52 11.01 l
11.51 11.00 l
11.52 10.99 l
11.52 10.97 l
11.52 10.96 l
11.51 10.94 l
11.52 10.93 l
11.52 10.90 l
11.51 10.88 l
11.52 10.84 l
11.52 10.80 l
11.52 10.72 l
11.51 10.61 l
11.52 10.40 l
11.52 9.94 l
11.51 8.74 l
11.52 5.55 l
11.52 1.95 l
11.52 0.63 l
11.51 0.26 l
11.52 0.14 l
11.52 0.07 l
11.52 0.05 l
11.51 0.04 l
11.52 0.02 l
o
np
72.40 85.20 m
11.52 9.91 l
11.51 10.82 l
11.52 10.92 l
11.52 10.93 l
11.52 10.93 l
11.51 10.90 l
11.52 10.85 l
11.52 10.79 l
11.52 10.71 l
11.51 10.60 l
11.52 10.46 l
11.52 10.30 l
11.51 10.07 l
11.52 9.81 l
11.52 9.44 l
11.52 8.97 l
11.51 8.38 l
11.52 7.62 l
11.52 6.72 l
11.51 5.68 l
11.52 4.61 l
11.52 3.61 l
11.52 2.76 l
11.51 2.09 l
11.52 1.59 l
11.52 1.21 l
11.52 0.94 l
11.51 0.74 l
11.52 0.59 l
o
np
72.40 85.20 m
11.52 3.46 l
11.51 6.81 l
11.52 8.73 l
11.52 10.05 l
11.52 10.97 l
11.51 11.58 l
11.52 11.96 l
11.52 12.17 l
11.52 12.23 l
11.51 12.18 l
11.52 12.03 l
11.52 11.82 l
11.51 11.55 l
11.52 11.25 l
11.52 10.91 l
11.52 10.55 l
11.51 10.18 l
11.52 9.81 l
11.52 9.43 l
11.51 9.05 l
11.52 8.69 l
11.52 8.32 l
11.52 7.97 l
11.51 7.63 l
11.52 7.29 l
11.52 6.98 l
11.52 6.66 l
11.51 6.38 l
11.52 6.09 l
o
np
72.40 85.22 m
11.52 9.89 l
11.51 10.33 l
11.52 10.34 l
11.52 10.33 l
11.52 10.32 l
11.51 10.30 l
11.52 10.28 l
11.52 10.25 l
11.52 10.21 l
11.51 10.16 l
11.52 10.10 l
11.52 10.00 l
11.51 9.86 l
11.52 9.64 l
11.52 9.26 l
11.52 8.54 l
11.51 7.09 l
11.52 4.59 l
11.52 2.38 l
11.51 1.21 l
11.52 0.66 l
11.52 0.39 l
11.52 0.25 l
11.51 0.17 l
11.52 0.12 l
11.52 0.09 l
11.52 0.07 l
11.51 0.05 l
11.52 0.04 l
o
np
72.40 85.20 m
11.52 4.33 l
11.51 8.34 l
11.52 10.43 l
11.52 11.68 l
11.52 12.41 l
11.51 12.75 l
11.52 12.82 l
11.52 12.70 l
11.52 12.42 l
11.51 12.04 l
11.52 11.59 l
11.52 11.11 l
11.51 10.58 l
11.52 10.06 l
11.52 9.53 l
11.52 9.01 l
11.51 8.51 l
11.52 8.02 l
11.52 7.56 l
11.51 7.12 l
11.52 6.69 l
11.52 6.31 l
11.52 5.93 l
11.51 5.58 l
11.52 5.26 l
11.52 4.95 l
11.52 4.66 l
11.51 4.40 l
11.52 4.15 l
o
np
72.40 85.20 m
11.52 10.17 l
11.51 11.02 l
11.52 11.08 l
11.52 11.09 l
11.52 11.07 l
11.51 11.03 l
11.52 10.96 l
11.52 10.88 l
11.52 10.77 l
11.51 10.62 l
11.52 10.43 l
11.52 10.16 l
11.51 9.82 l
11.52 9.33 l
11.52 8.68 l
11.52 7.79 l
11.51 6.66 l
11.52 5.36 l
11.52 4.07 l
11.51 2.95 l
11.52 2.10 l
11.52 1.49 l
11.52 1.09 l
11.51 0.80 l
11.52 0.60 l
11.52 0.47 l
11.52 0.37 l
11.51 0.29 l
11.52 0.24 l
o
np
72.40 85.20 m
11.52 4.46 l
11.51 7.91 l
11.52 9.52 l
11.52 10.48 l
11.52 11.10 l
11.51 11.48 l
11.52 11.69 l
11.52 11.79 l
11.52 11.79 l
11.51 11.72 l
11.52 11.58 l
11.52 11.41 l
11.51 11.18 l
11.52 10.93 l
11.52 10.66 l
11.52 10.36 l
11.51 10.05 l
11.52 9.72 l
11.52 9.40 l
11.51 9.07 l
11.52 8.73 l
11.52 8.40 l
11.52 8.06 l
11.51 7.74 l
11.52 7.42 l
11.52 7.10 l
11.52 6.79 l
11.51 6.50 l
11.52 6.22 l
o
np
72.40 85.29 m
11.52 9.38 l
11.51 9.51 l
11.52 9.47 l
11.52 9.45 l
11.52 9.44 l
11.51 9.42 l
11.52 9.41 l
11.52 9.40 l
11.52 9.39 l
11.51 9.38 l
11.52 9.36 l
11.52 9.35 l
11.51 9.33 l
11.52 9.30 l
11.52 9.28 l
11.52 9.22 l
11.51 9.17 l
11.52 9.05 l
11.52 8.84 l
11.51 8.35 l
11.52 6.89 l
11.52 3.51 l
11.52 1.05 l
11.51 0.36 l
11.52 0.16 l
11.52 0.08 l
11.52 0.05 l
11.51 0.03 l
11.52 0.03 l
o
np
72.40 85.20 m
11.52 10.43 l
11.51 11.56 l
11.52 11.68 l
11.52 11.69 l
11.52 11.68 l
11.51 11.62 l
11.52 11.55 l
11.52 11.43 l
11.52 11.29 l
11.51 11.11 l
11.52 10.87 l
11.52 10.58 l
11.51 10.21 l
11.52 9.73 l
11.52 9.12 l
11.52 8.39 l
11.51 7.48 l
11.52 6.48 l
11.52 5.40 l
11.51 4.37 l
11.52 3.44 l
11.52 2.67 l
11.52 2.07 l
11.51 1.60 l
11.52 1.26 l
11.52 1.00 l
11.52 0.80 l
11.51 0.65 l
11.52 0.53 l
o
np
72.40 85.20 m
11.52 6.57 l
11.51 9.50 l
11.52 10.40 l
11.52 10.87 l
11.52 11.13 l
11.51 11.29 l
11.52 11.36 l
11.52 11.38 l
11.52 11.36 l
11.51 11.31 l
11.52 11.22 l
11.52 11.11 l
11.51 10.99 l
11.52 10.83 l
11.52 10.66 l
11.52 10.47 l
11.51 10.27 l
11.52 10.05 l
11.52 9.82 l
11.51 9.57 l
11.52 9.31 l
11.52 9.04 l
11.52 8.76 l
11.51 8.48 l
11.52 8.18 l
11.52 7.88 l
11.52 7.57 l
11.51 7.27 l
11.52 6.97 l
o
np
72.40 85.20 m
11.52 5.28 l
11.51 9.44 l
11.52 11.24 l
11.52 12.18 l
11.52 12.60 l
11.51 12.72 l
11.52 12.60 l
11.52 12.32 l
11.52 11.94 l
11.51 11.48 l
11.52 10.96 l
11.52 10.43 l
11.51 9.86 l
11.52 9.30 l
11.52 8.75 l
11.52 8.21 l
11.51 7.69 l
11.52 7.20 l
11.52 6.72 l
11.51 6.27 l
11.52 5.86 l
11.52 5.46 l
11.52 5.10 l
11.51 4.76 l
11.52 4.44 l
11.52 4.14 l
11.52 3.88 l
11.51 3.62 l
11.52 3.39 l
o
np
72.40 86.12 m
11.52 10.20 l
11.51 9.69 l
11.52 9.52 l
11.52 9.43 l
11.52 9.36 l
11.51 9.32 l
11.52 9.28 l
11.52 9.24 l
11.52 9.21 l
11.51 9.18 l
11.52 9.16 l
11.52 9.12 l
11.51 9.09 l
11.52 9.07 l
11.52 9.02 l
11.52 8.98 l
11.51 8.92 l
11.52 8.84 l
11.52 8.66 l
11.51 8.14 l
11.52 4.33 l
11.52 0.37 l
11.52 0.06 l
11.51 0.02 l
11.52 0.01 l
11.52 0.01 l
11.52 0 l
11.51 0.01 l
11.52 0 l
o
np
72.40 86.63 m
11.52 10.56 l
11.51 11.75 l
11.52 11.66 l
11.52 11.51 l
11.52 11.36 l
11.51 11.19 l
11.52 11.02 l
11.52 10.82 l
11.52 10.63 l
11.51 10.40 l
11.52 10.16 l
11.52 9.90 l
11.51 9.60 l
11.52 9.28 l
11.52 8.93 l
11.52 8.53 l
11.51 8.11 l
11.52 7.64 l
11.52 7.14 l
11.51 6.61 l
11.52 6.06 l
11.52 5.49 l
11.52 4.93 l
11.51 4.38 l
11.52 3.86 l
11.52 3.38 l
11.52 2.95 l
11.51 2.55 l
11.52 2.22 l
o
np
72.40 85.20 m
11.52 5.55 l
11.51 10.06 l
11.52 11.93 l
11.52 12.71 l
11.52 12.89 l
11.51 12.67 l
11.52 12.19 l
11.52 11.58 l
11.52 10.87 l
11.51 10.13 l
11.52 9.39 l
11.52 8.66 l
11.51 7.97 l
11.52 7.32 l
11.52 6.71 l
11.52 6.15 l
11.51 5.64 l
11.52 5.16 l
11.52 4.74 l
11.51 4.35 l
11.52 4.00 l
11.52 3.68 l
11.52 3.38 l
11.51 3.13 l
11.52 2.89 l
11.52 2.67 l
11.52 2.47 l
11.51 2.30 l
11.52 2.14 l
o
np
72.40 86.72 m
11.52 9.38 l
11.51 10.57 l
11.52 10.55 l
11.52 10.46 l
11.52 10.36 l
11.51 10.24 l
11.52 10.12 l
11.52 9.97 l
11.52 9.81 l
11.51 9.64 l
11.52 9.44 l
11.52 9.21 l
11.51 8.96 l
11.52 8.66 l
11.52 8.31 l
11.52 7.93 l
11.51 7.47 l
11.52 6.96 l
11.52 6.40 l
11.51 5.78 l
11.52 5.13 l
11.52 4.48 l
11.52 3.85 l
11.51 3.25 l
11.52 2.73 l
11.52 2.27 l
11.52 1.89 l
11.51 1.57 l
11.52 1.31 l
o
np
72.40 85.20 m
11.52 4.43 l
11.51 8.56 l
11.52 10.69 l
11.52 11.93 l
11.52 12.60 l
11.51 12.87 l
11.52 12.85 l
11.52 12.61 l
11.52 12.25 l
11.51 11.79 l
11.52 11.26 l
11.52 10.69 l
11.51 10.13 l
11.52 9.55 l
11.52 8.98 l
11.52 8.45 l
11.51 7.92 l
11.52 7.43 l
11.52 6.96 l
11.51 6.52 l
11.52 6.11 l
11.52 5.73 l
11.52 5.36 l
11.51 5.04 l
11.52 4.72 l
11.52 4.43 l
11.52 4.16 l
11.51 3.92 l
11.52 3.68 l
o
np
72.40 85.20 m
11.52 4.28 l
11.51 8.38 l
11.52 10.55 l
11.52 11.84 l
11.52 12.54 l
11.51 12.83 l
11.52 12.80 l
11.52 12.57 l
11.52 12.18 l
11.51 11.71 l
11.52 11.16 l
11.52 10.60 l
11.51 10.01 l
11.52 9.43 l
11.52 8.86 l
11.52 8.32 l
11.51 7.80 l
11.52 7.30 l
11.52 6.84 l
11.51 6.41 l
11.52 6.00 l
11.52 5.62 l
11.52 5.27 l
11.51 4.94 l
11.52 4.63 l
11.52 4.36 l
11.52 4.09 l
11.51 3.85 l
11.52 3.62 l
o
np
72.40 85.25 m
11.52 11.10 l
11.51 11.31 l
11.52 11.23 l
11.52 11.16 l
11.52 11.09 l
11.51 11.01 l
11.52 10.90 l
11.52 10.77 l
11.52 10.62 l
11.51 10.42 l
11.52 10.14 l
11.52 9.78 l
11.51 9.25 l
11.52 8.53 l
11.52 7.50 l
11.52 6.16 l
11.51 4.66 l
11.52 3.25 l
11.52 2.18 l
11.51 1.45 l
11.52 0.98 l
11.52 0.69 l
11.52 0.50 l
11.51 0.37 l
11.52 0.28 l
11.52 0.22 l
11.52 0.18 l
11.51 0.14 l
11.52 0.12 l
o
np
72.40 85.20 m
11.52 5.26 l
11.51 8.90 l
11.52 10.33 l
11.52 11.07 l
11.52 11.43 l
11.51 11.55 l
11.52 11.52 l
11.52 11.36 l
11.52 11.12 l
11.51 10.81 l
11.52 10.45 l
11.52 10.06 l
11.51 9.63 l
11.52 9.20 l
11.52 8.75 l
11.52 8.29 l
11.51 7.86 l
11.52 7.41 l
11.52 6.98 l
11.51 6.57 l
11.52 6.17 l
11.52 5.79 l
11.52 5.42 l
11.51 5.09 l
11.52 4.76 l
11.52 4.46 l
11.52 4.17 l
11.51 3.90 l
11.52 3.66 l
o
np
72.40 85.20 m
11.52 7.03 l
11.51 10.68 l
11.52 11.78 l
11.52 12.25 l
11.52 12.41 l
11.51 12.40 l
11.52 12.23 l
11.52 11.98 l
11.52 11.65 l
11.51 11.26 l
11.52 10.82 l
11.52 10.35 l
11.51 9.85 l
11.52 9.32 l
11.52 8.80 l
11.52 8.26 l
11.51 7.73 l
11.52 7.21 l
11.52 6.70 l
11.51 6.22 l
11.52 5.75 l
11.52 5.31 l
11.52 4.91 l
11.51 4.52 l
11.52 4.16 l
11.52 3.83 l
11.52 3.53 l
11.51 3.25 l
11.52 3.00 l
o
np
72.40 85.20 m
11.52 6.02 l
11.51 10.50 l
11.52 12.18 l
11.52 12.81 l
11.52 12.87 l
11.51 12.57 l
11.52 12.06 l
11.52 11.41 l
11.52 10.69 l
11.51 9.94 l
11.52 9.17 l
11.52 8.44 l
11.51 7.74 l
11.52 7.08 l
11.52 6.46 l
11.52 5.90 l
11.51 5.38 l
11.52 4.91 l
11.52 4.48 l
11.51 4.09 l
11.52 3.74 l
11.52 3.43 l
11.52 3.15 l
11.51 2.89 l
11.52 2.65 l
11.52 2.45 l
11.52 2.26 l
11.51 2.09 l
11.52 1.93 l
o
np
72.40 85.20 m
11.52 7.25 l
11.51 10.58 l
11.52 11.46 l
11.52 11.80 l
11.52 11.87 l
11.51 11.76 l
11.52 11.54 l
11.52 11.22 l
11.52 10.85 l
11.51 10.42 l
11.52 9.93 l
11.52 9.41 l
11.51 8.87 l
11.52 8.31 l
11.52 7.75 l
11.52 7.18 l
11.51 6.64 l
11.52 6.11 l
11.52 5.60 l
11.51 5.12 l
11.52 4.67 l
11.52 4.26 l
11.52 3.87 l
11.51 3.53 l
11.52 3.21 l
11.52 2.92 l
11.52 2.65 l
11.51 2.43 l
11.52 2.21 l
o
np
72.40 86.76 m
11.52 9.93 l
11.51 10.95 l
11.52 10.99 l
11.52 10.95 l
11.52 10.87 l
11.51 10.77 l
11.52 10.66 l
11.52 10.54 l
11.52 10.37 l
11.51 10.20 l
11.52 9.97 l
11.52 9.70 l
11.51 9.35 l
11.52 8.92 l
11.52 8.38 l
11.52 7.70 l
11.51 6.87 l
11.52 5.92 l
11.52 4.88 l
11.51 3.88 l
11.52 2.99 l
11.52 2.26 l
11.52 1.70 l
11.51 1.30 l
11.52 0.99 l
11.52 0.77 l
11.52 0.60 l
11.51 0.49 l
11.52 0.40 l
o
np
72.40 85.20 m
11.52 4.45 l
11.51 8.54 l
11.52 10.58 l
11.52 11.66 l
11.52 12.12 l
11.51 12.17 l
11.52 11.94 l
11.52 11.52 l
11.52 11.00 l
11.51 10.39 l
11.52 9.77 l
11.52 9.14 l
11.51 8.52 l
11.52 7.92 l
11.52 7.36 l
11.52 6.83 l
11.51 6.33 l
11.52 5.88 l
11.52 5.45 l
11.51 5.06 l
11.52 4.69 l
11.52 4.37 l
11.52 4.06 l
11.51 3.78 l
11.52 3.53 l
11.52 3.29 l
11.52 3.07 l
11.51 2.88 l
11.52 2.69 l
o
0.5333 0.2549 0.6157 srgb
np
72.40 85.20 m
11.52 3.99 l
11.51 7.68 l
11.52 9.65 l
11.52 10.95 l
11.52 11.78 l
11.51 12.31 l
11.52 12.60 l
11.52 12.71 l
11.52 12.67 l
11.51 12.54 l
11.52 12.31 l
11.52 12.03 l
11.51 11.69 l
11.52 11.32 l
11.52 10.93 l
11.52 10.52 l
11.51 10.11 l
11.52 9.69 l
11.52 9.28 l
11.51 8.87 l
11.52 8.47 l
11.52 8.08 l
11.52 7.71 l
11.51 7.34 l
11.52 7.00 l
11.52 6.66 l
11.52 6.35 l
11.51 6.04 l
11.52 5.75 l
o
np
72.40 85.20 m
11.52 4.21 l
11.51 7.80 l
11.52 9.59 l
11.52 10.73 l
11.52 11.46 l
11.51 11.90 l
11.52 12.17 l
11.52 12.27 l
11.52 12.27 l
11.51 12.16 l
11.52 11.99 l
11.52 11.77 l
11.51 11.49 l
11.52 11.18 l
11.52 10.86 l
11.52 10.50 l
11.51 10.14 l
11.52 9.78 l
11.52 9.40 l
11.51 9.02 l
11.52 8.66 l
11.52 8.30 l
11.52 7.93 l
11.51 7.59 l
11.52 7.26 l
11.52 6.92 l
11.52 6.62 l
11.51 6.30 l
11.52 6.02 l
o
np
72.40 85.20 m
11.52 3.65 l
11.51 7.11 l
11.52 9.04 l
11.52 10.31 l
11.52 11.19 l
11.51 11.74 l
11.52 12.08 l
11.52 12.24 l
11.52 12.26 l
11.51 12.16 l
11.52 11.98 l
11.52 11.74 l
11.51 11.45 l
11.52 11.11 l
11.52 10.76 l
11.52 10.39 l
11.51 10.00 l
11.52 9.61 l
11.52 9.23 l
11.51 8.84 l
11.52 8.46 l
11.52 8.10 l
11.52 7.73 l
11.51 7.39 l
11.52 7.06 l
11.52 6.74 l
11.52 6.42 l
11.51 6.14 l
11.52 5.85 l
o
np
72.40 85.20 m
11.52 5.96 l
11.51 9.01 l
11.52 10.02 l
11.52 10.57 l
11.52 10.88 l
11.51 11.06 l
11.52 11.14 l
11.52 11.17 l
11.52 11.14 l
11.51 11.07 l
11.52 10.98 l
11.52 10.84 l
11.51 10.70 l
11.52 10.51 l
11.52 10.32 l
11.52 10.11 l
11.51 9.87 l
11.52 9.63 l
11.52 9.38 l
11.51 9.10 l
11.52 8.82 l
11.52 8.54 l
11.52 8.25 l
11.51 7.94 l
11.52 7.64 l
11.52 7.34 l
11.52 7.04 l
11.51 6.73 l
11.52 6.43 l
o
np
72.40 85.20 m
11.52 9.01 l
11.51 10.88 l
11.52 11.25 l
11.52 11.40 l
11.52 11.46 l
11.51 11.49 l
11.52 11.47 l
11.52 11.43 l
11.52 11.37 l
11.51 11.29 l
11.52 11.18 l
11.52 11.06 l
11.51 10.91 l
11.52 10.76 l
11.52 10.56 l
11.52 10.36 l
11.51 10.12 l
11.52 9.85 l
11.52 9.57 l
11.51 9.23 l
11.52 8.89 l
11.52 8.49 l
11.52 8.09 l
11.51 7.64 l
11.52 7.17 l
11.52 6.69 l
11.52 6.21 l
11.51 5.71 l
11.52 5.22 l
o
np
72.40 85.20 m
11.52 9.48 l
11.51 10.99 l
11.52 11.24 l
11.52 11.33 l
11.52 11.38 l
11.51 11.37 l
11.52 11.36 l
11.52 11.32 l
11.52 11.27 l
11.51 11.18 l
11.52 11.10 l
11.52 10.99 l
11.51 10.86 l
11.52 10.72 l
11.52 10.54 l
11.52 10.34 l
11.51 10.12 l
11.52 9.85 l
11.52 9.55 l
11.51 9.22 l
11.52 8.83 l
11.52 8.40 l
11.52 7.93 l
11.51 7.41 l
11.52 6.86 l
11.52 6.27 l
11.52 5.69 l
11.51 5.10 l
11.52 4.53 l
o
np
72.40 85.20 m
11.52 7.61 l
11.51 10.23 l
11.52 10.92 l
11.52 11.24 l
11.52 11.42 l
11.51 11.51 l
11.52 11.54 l
11.52 11.52 l
11.52 11.48 l
11.51 11.41 l
11.52 11.30 l
11.52 11.19 l
11.51 11.04 l
11.52 10.88 l
11.52 10.70 l
11.52 10.50 l
11.51 10.29 l
11.52 10.04 l
11.52 9.80 l
11.51 9.52 l
11.52 9.24 l
11.52 8.93 l
11.52 8.62 l
11.51 8.30 l
11.52 7.95 l
11.52 7.61 l
11.52 7.25 l
11.51 6.90 l
11.52 6.54 l
o
np
72.40 85.20 m
11.52 3.43 l
11.51 6.81 l
11.52 8.81 l
11.52 10.16 l
11.52 11.12 l
11.51 11.75 l
11.52 12.14 l
11.52 12.33 l
11.52 12.37 l
11.51 12.29 l
11.52 12.11 l
11.52 11.87 l
11.51 11.57 l
11.52 11.22 l
11.52 10.86 l
11.52 10.48 l
11.51 10.07 l
11.52 9.68 l
11.52 9.28 l
11.51 8.89 l
11.52 8.51 l
11.52 8.13 l
11.52 7.77 l
11.51 7.41 l
11.52 7.09 l
11.52 6.76 l
11.52 6.45 l
11.51 6.16 l
11.52 5.88 l
o
np
72.40 85.20 m
11.52 4.72 l
11.51 8.33 l
11.52 9.95 l
11.52 10.91 l
11.52 11.52 l
11.51 11.87 l
11.52 12.07 l
11.52 12.14 l
11.52 12.11 l
11.51 12.00 l
11.52 11.85 l
11.52 11.63 l
11.51 11.38 l
11.52 11.11 l
11.52 10.80 l
11.52 10.47 l
11.51 10.14 l
11.52 9.80 l
11.52 9.44 l
11.51 9.08 l
11.52 8.73 l
11.52 8.38 l
11.52 8.03 l
11.51 7.68 l
11.52 7.35 l
11.52 7.03 l
11.52 6.70 l
11.51 6.40 l
11.52 6.11 l
o
np
72.40 85.20 m
11.52 7.22 l
11.51 10.00 l
11.52 10.76 l
11.52 11.13 l
11.52 11.32 l
11.51 11.41 l
11.52 11.43 l
11.52 11.40 l
11.52 11.34 l
11.51 11.23 l
11.52 11.10 l
11.52 10.95 l
11.51 10.76 l
11.52 10.57 l
11.52 10.33 l
11.52 10.10 l
11.51 9.82 l
11.52 9.55 l
11.52 9.24 l
11.51 8.94 l
11.52 8.60 l
11.52 8.26 l
11.52 7.91 l
11.51 7.56 l
11.52 7.19 l
11.52 6.83 l
11.52 6.46 l
11.51 6.11 l
11.52 5.75 l
o
np
72.40 85.20 m
11.52 5.82 l
11.51 9.10 l
11.52 10.27 l
11.52 10.88 l
11.52 11.24 l
11.51 11.43 l
11.52 11.51 l
11.52 11.52 l
11.52 11.46 l
11.51 11.36 l
11.52 11.21 l
11.52 11.04 l
11.51 10.82 l
11.52 10.59 l
11.52 10.34 l
11.52 10.06 l
11.51 9.77 l
11.52 9.47 l
11.52 9.15 l
11.51 8.83 l
11.52 8.50 l
11.52 8.17 l
11.52 7.83 l
11.51 7.50 l
11.52 7.16 l
11.52 6.84 l
11.52 6.51 l
11.51 6.19 l
11.52 5.89 l
o
np
72.40 85.20 m
11.52 7.04 l
11.51 9.93 l
11.52 10.75 l
11.52 11.16 l
11.52 11.38 l
11.51 11.49 l
11.52 11.53 l
11.52 11.51 l
11.52 11.46 l
11.51 11.38 l
11.52 11.26 l
11.52 11.11 l
11.51 10.94 l
11.52 10.76 l
11.52 10.55 l
11.52 10.31 l
11.51 10.07 l
11.52 9.81 l
11.52 9.52 l
11.51 9.23 l
11.52 8.92 l
11.52 8.61 l
11.52 8.27 l
11.51 7.93 l
11.52 7.59 l
11.52 7.25 l
11.52 6.90 l
11.51 6.55 l
11.52 6.21 l
o
np
72.40 85.20 m
11.52 7.33 l
11.51 9.97 l
11.52 10.66 l
11.52 11.01 l
11.52 11.19 l
11.51 11.28 l
11.52 11.32 l
11.52 11.30 l
11.52 11.26 l
11.51 11.19 l
11.52 11.08 l
11.52 10.97 l
11.51 10.83 l
11.52 10.66 l
11.52 10.49 l
11.52 10.29 l
11.51 10.07 l
11.52 9.84 l
11.52 9.58 l
11.51 9.33 l
11.52 9.04 l
11.52 8.74 l
11.52 8.44 l
11.51 8.12 l
11.52 7.79 l
11.52 7.45 l
11.52 7.12 l
11.51 6.76 l
11.52 6.42 l
o
np
72.40 85.20 m
11.52 5.74 l
11.51 9.10 l
11.52 10.32 l
11.52 10.99 l
11.52 11.38 l
11.51 11.61 l
11.52 11.72 l
11.52 11.74 l
11.52 11.71 l
11.51 11.63 l
11.52 11.50 l
11.52 11.34 l
11.51 11.17 l
11.52 10.95 l
11.52 10.72 l
11.52 10.47 l
11.51 10.21 l
11.52 9.94 l
11.52 9.65 l
11.51 9.36 l
11.52 9.06 l
11.52 8.75 l
11.52 8.45 l
11.51 8.14 l
11.52 7.84 l
11.52 7.53 l
11.52 7.23 l
11.51 6.93 l
11.52 6.63 l
o
np
72.40 85.20 m
11.52 6.51 l
11.51 9.52 l
11.52 10.43 l
11.52 10.91 l
11.52 11.17 l
11.51 11.30 l
11.52 11.37 l
11.52 11.36 l
11.52 11.30 l
11.51 11.23 l
11.52 11.10 l
11.52 10.95 l
11.51 10.79 l
11.52 10.59 l
11.52 10.37 l
11.52 10.14 l
11.51 9.89 l
11.52 9.62 l
11.52 9.34 l
11.51 9.05 l
11.52 8.74 l
11.52 8.43 l
11.52 8.11 l
11.51 7.78 l
11.52 7.45 l
11.52 7.12 l
11.52 6.79 l
11.51 6.47 l
11.52 6.14 l
o
np
72.40 85.20 m
11.52 6.87 l
11.51 9.97 l
11.52 10.89 l
11.52 11.36 l
11.52 11.60 l
11.51 11.71 l
11.52 11.75 l
11.52 11.71 l
11.52 11.63 l
11.51 11.50 l
11.52 11.35 l
11.52 11.17 l
11.51 10.96 l
11.52 10.73 l
11.52 10.47 l
11.52 10.20 l
11.51 9.92 l
11.52 9.61 l
11.52 9.30 l
11.51 8.97 l
11.52 8.64 l
11.52 8.30 l
11.52 7.95 l
11.51 7.61 l
11.52 7.26 l
11.52 6.92 l
11.52 6.57 l
11.51 6.24 l
11.52 5.91 l
o
np
72.40 85.20 m
11.52 4.97 l
11.51 8.44 l
11.52 9.90 l
11.52 10.74 l
11.52 11.27 l
11.51 11.58 l
11.52 11.75 l
11.52 11.82 l
11.52 11.81 l
11.51 11.73 l
11.52 11.61 l
11.52 11.44 l
11.51 11.23 l
11.52 10.99 l
11.52 10.75 l
11.52 10.46 l
11.51 10.17 l
11.52 9.87 l
11.52 9.55 l
11.51 9.23 l
11.52 8.90 l
11.52 8.58 l
11.52 8.25 l
11.51 7.93 l
11.52 7.60 l
11.52 7.28 l
11.52 6.98 l
11.51 6.67 l
11.52 6.37 l
o
np
72.40 85.20 m
11.52 3.88 l
11.51 7.52 l
11.52 9.51 l
11.52 10.80 l
11.52 11.67 l
11.51 12.21 l
11.52 12.51 l
11.52 12.64 l
11.52 12.61 l
11.51 12.47 l
11.52 12.26 l
11.52 11.97 l
11.51 11.64 l
11.52 11.27 l
11.52 10.88 l
11.52 10.47 l
11.51 10.07 l
11.52 9.64 l
11.52 9.23 l
11.51 8.83 l
11.52 8.43 l
11.52 8.05 l
11.52 7.67 l
11.51 7.31 l
11.52 6.97 l
11.52 6.63 l
11.52 6.32 l
11.51 6.02 l
11.52 5.74 l
o
np
72.40 85.20 m
11.52 6.45 l
11.51 9.33 l
11.52 10.19 l
11.52 10.63 l
11.52 10.89 l
11.51 11.03 l
11.52 11.10 l
11.52 11.10 l
11.52 11.07 l
11.51 11.01 l
11.52 10.91 l
11.52 10.80 l
11.51 10.65 l
11.52 10.50 l
11.52 10.32 l
11.52 10.12 l
11.51 9.91 l
11.52 9.69 l
11.52 9.45 l
11.51 9.20 l
11.52 8.94 l
11.52 8.66 l
11.52 8.39 l
11.51 8.10 l
11.52 7.81 l
11.52 7.51 l
11.52 7.21 l
11.51 6.91 l
11.52 6.61 l
o
np
72.40 85.20 m
11.52 5.74 l
11.51 8.96 l
11.52 10.08 l
11.52 10.69 l
11.52 11.02 l
11.51 11.20 l
11.52 11.27 l
11.52 11.27 l
11.52 11.20 l
11.51 11.11 l
11.52 10.95 l
11.52 10.79 l
11.51 10.59 l
11.52 10.38 l
11.52 10.15 l
11.52 9.90 l
11.51 9.64 l
11.52 9.38 l
11.52 9.10 l
11.51 8.83 l
11.52 8.55 l
11.52 8.27 l
11.52 7.98 l
11.51 7.70 l
11.52 7.42 l
11.52 7.14 l
11.52 6.87 l
11.51 6.60 l
11.52 6.33 l
o
np
72.40 85.20 m
11.52 7.00 l
11.51 10.03 l
11.52 10.91 l
11.52 11.35 l
11.52 11.57 l
11.51 11.68 l
11.52 11.70 l
11.52 11.67 l
11.52 11.59 l
11.51 11.46 l
11.52 11.31 l
11.52 11.13 l
11.51 10.92 l
11.52 10.68 l
11.52 10.43 l
11.52 10.15 l
11.51 9.85 l
11.52 9.53 l
11.52 9.21 l
11.51 8.87 l
11.52 8.51 l
11.52 8.15 l
11.52 7.79 l
11.51 7.41 l
11.52 7.04 l
11.52 6.68 l
11.52 6.32 l
11.51 5.95 l
11.52 5.61 l
o
np
72.40 85.20 m
11.52 6.45 l
11.51 9.47 l
11.52 10.43 l
11.52 10.92 l
11.52 11.20 l
11.51 11.37 l
11.52 11.44 l
11.52 11.45 l
11.52 11.42 l
11.51 11.35 l
11.52 11.26 l
11.52 11.12 l
11.51 10.97 l
11.52 10.80 l
11.52 10.61 l
11.52 10.39 l
11.51 10.16 l
11.52 9.92 l
11.52 9.66 l
11.51 9.39 l
11.52 9.10 l
11.52 8.82 l
11.52 8.51 l
11.51 8.20 l
11.52 7.89 l
11.52 7.57 l
11.52 7.26 l
11.51 6.94 l
11.52 6.62 l
o
np
72.40 85.20 m
11.52 4.44 l
11.51 7.93 l
11.52 9.57 l
11.52 10.56 l
11.52 11.20 l
11.51 11.60 l
11.52 11.84 l
11.52 11.95 l
11.52 11.97 l
11.51 11.90 l
11.52 11.78 l
11.52 11.61 l
11.51 11.40 l
11.52 11.15 l
11.52 10.88 l
11.52 10.59 l
11.51 10.29 l
11.52 9.96 l
11.52 9.64 l
11.51 9.31 l
11.52 8.97 l
11.52 8.65 l
11.52 8.30 l
11.51 7.99 l
11.52 7.65 l
11.52 7.35 l
11.52 7.03 l
11.51 6.74 l
11.52 6.44 l
o
np
72.40 85.20 m
11.52 6.26 l
11.51 9.38 l
11.52 10.40 l
11.52 10.91 l
11.52 11.19 l
11.51 11.35 l
11.52 11.41 l
11.52 11.40 l
11.52 11.33 l
11.51 11.24 l
11.52 11.10 l
11.52 10.93 l
11.51 10.73 l
11.52 10.52 l
11.52 10.28 l
11.52 10.01 l
11.51 9.75 l
11.52 9.45 l
11.52 9.15 l
11.51 8.84 l
11.52 8.52 l
11.52 8.19 l
11.52 7.86 l
11.51 7.52 l
11.52 7.19 l
11.52 6.85 l
11.52 6.53 l
11.51 6.20 l
11.52 5.88 l
o
np
72.40 85.20 m
11.52 5.96 l
11.51 8.98 l
11.52 9.99 l
11.52 10.54 l
11.52 10.87 l
11.51 11.06 l
11.52 11.16 l
11.52 11.22 l
11.52 11.22 l
11.51 11.18 l
11.52 11.11 l
11.52 11.01 l
11.51 10.90 l
11.52 10.75 l
11.52 10.60 l
11.52 10.42 l
11.51 10.23 l
11.52 10.02 l
11.52 9.81 l
11.51 9.57 l
11.52 9.34 l
11.52 9.08 l
11.52 8.82 l
11.51 8.56 l
11.52 8.28 l
11.52 8.01 l
11.52 7.73 l
11.51 7.44 l
11.52 7.16 l
o
np
72.40 85.20 m
11.52 3.79 l
11.51 7.11 l
11.52 8.83 l
11.52 9.95 l
11.52 10.69 l
11.51 11.19 l
11.52 11.50 l
11.52 11.65 l
11.52 11.71 l
11.51 11.67 l
11.52 11.56 l
11.52 11.39 l
11.51 11.18 l
11.52 10.94 l
11.52 10.66 l
11.52 10.36 l
11.51 10.05 l
11.52 9.73 l
11.52 9.40 l
11.51 9.07 l
11.52 8.74 l
11.52 8.41 l
11.52 8.08 l
11.51 7.76 l
11.52 7.45 l
11.52 7.14 l
11.52 6.85 l
11.51 6.56 l
11.52 6.28 l
o
np
72.40 85.20 m
11.52 8.03 l
11.51 10.37 l
11.52 10.90 l
11.52 11.15 l
11.52 11.27 l
11.51 11.31 l
11.52 11.31 l
11.52 11.27 l
11.52 11.20 l
11.51 11.09 l
11.52 10.98 l
11.52 10.83 l
11.51 10.66 l
11.52 10.47 l
11.52 10.26 l
11.52 10.03 l
11.51 9.77 l
11.52 9.49 l
11.52 9.19 l
11.51 8.86 l
11.52 8.53 l
11.52 8.16 l
11.52 7.78 l
11.51 7.39 l
11.52 7.00 l
11.52 6.58 l
11.52 6.18 l
11.51 5.76 l
11.52 5.37 l
o
np
72.40 85.20 m
11.52 8.39 l
11.51 10.63 l
11.52 11.11 l
11.52 11.34 l
11.52 11.45 l
11.51 11.49 l
11.52 11.49 l
11.52 11.45 l
11.52 11.40 l
11.51 11.31 l
11.52 11.21 l
11.52 11.08 l
11.51 10.93 l
11.52 10.77 l
11.52 10.57 l
11.52 10.37 l
11.51 10.14 l
11.52 9.88 l
11.52 9.61 l
11.51 9.31 l
11.52 8.98 l
11.52 8.65 l
11.52 8.28 l
11.51 7.89 l
11.52 7.50 l
11.52 7.09 l
11.52 6.68 l
11.51 6.25 l
11.52 5.83 l
o
np
72.40 85.20 m
11.52 4.34 l
11.51 8.12 l
11.52 10.03 l
11.52 11.21 l
11.52 11.96 l
11.51 12.39 l
11.52 12.62 l
11.52 12.67 l
11.52 12.60 l
11.51 12.43 l
11.52 12.18 l
11.52 11.90 l
11.51 11.55 l
11.52 11.20 l
11.52 10.81 l
11.52 10.41 l
11.51 10.02 l
11.52 9.61 l
11.52 9.22 l
11.51 8.83 l
11.52 8.44 l
11.52 8.07 l
11.52 7.71 l
11.51 7.37 l
11.52 7.03 l
11.52 6.70 l
11.52 6.40 l
11.51 6.11 l
11.52 5.82 l
o
np
72.40 85.20 m
11.52 5.64 l
11.51 9.17 l
11.52 10.49 l
11.52 11.21 l
11.52 11.60 l
11.51 11.81 l
11.52 11.87 l
11.52 11.86 l
11.52 11.75 l
11.51 11.60 l
11.52 11.40 l
11.52 11.16 l
11.51 10.89 l
11.52 10.59 l
11.52 10.29 l
11.52 9.96 l
11.51 9.61 l
11.52 9.27 l
11.52 8.92 l
11.51 8.56 l
11.52 8.21 l
11.52 7.85 l
11.52 7.51 l
11.51 7.16 l
11.52 6.83 l
11.52 6.51 l
11.52 6.18 l
11.51 5.88 l
11.52 5.59 l
o
np
72.40 85.20 m
11.52 8.09 l
11.51 10.36 l
11.52 10.86 l
11.52 11.10 l
11.52 11.20 l
11.51 11.25 l
11.52 11.25 l
11.52 11.20 l
11.52 11.15 l
11.51 11.05 l
11.52 10.93 l
11.52 10.80 l
11.51 10.64 l
11.52 10.47 l
11.52 10.26 l
11.52 10.04 l
11.51 9.80 l
11.52 9.53 l
11.52 9.25 l
11.51 8.93 l
11.52 8.60 l
11.52 8.25 l
11.52 7.88 l
11.51 7.49 l
11.52 7.10 l
11.52 6.69 l
11.52 6.29 l
11.51 5.87 l
11.52 5.47 l
o
np
72.40 85.20 m
11.52 3.44 l
11.51 6.86 l
11.52 8.86 l
11.52 10.24 l
11.52 11.20 l
11.51 11.83 l
11.52 12.22 l
11.52 12.42 l
11.52 12.44 l
11.51 12.36 l
11.52 12.18 l
11.52 11.93 l
11.51 11.61 l
11.52 11.27 l
11.52 10.89 l
11.52 10.49 l
11.51 10.10 l
11.52 9.69 l
11.52 9.29 l
11.51 8.89 l
11.52 8.50 l
11.52 8.13 l
11.52 7.76 l
11.51 7.40 l
11.52 7.08 l
11.52 6.74 l
11.52 6.44 l
11.51 6.14 l
11.52 5.87 l
o
np
72.40 85.20 m
11.52 3.76 l
11.51 7.38 l
11.52 9.43 l
11.52 10.79 l
11.52 11.72 l
11.51 12.31 l
11.52 12.66 l
11.52 12.80 l
11.52 12.80 l
11.51 12.69 l
11.52 12.46 l
11.52 12.19 l
11.51 11.85 l
11.52 11.48 l
11.52 11.08 l
11.52 10.67 l
11.51 10.25 l
11.52 9.83 l
11.52 9.41 l
11.51 9.00 l
11.52 8.60 l
11.52 8.20 l
11.52 7.83 l
11.51 7.46 l
11.52 7.12 l
11.52 6.78 l
11.52 6.46 l
11.51 6.16 l
11.52 5.87 l
o
np
72.40 85.20 m
11.52 4.90 l
11.51 8.45 l
11.52 9.97 l
11.52 10.84 l
11.52 11.37 l
11.51 11.67 l
11.52 11.82 l
11.52 11.86 l
11.52 11.80 l
11.51 11.69 l
11.52 11.50 l
11.52 11.29 l
11.51 11.03 l
11.52 10.74 l
11.52 10.44 l
11.52 10.11 l
11.51 9.77 l
11.52 9.43 l
11.52 9.07 l
11.51 8.71 l
11.52 8.36 l
11.52 8.01 l
11.52 7.66 l
11.51 7.31 l
11.52 6.98 l
11.52 6.66 l
11.52 6.34 l
11.51 6.03 l
11.52 5.74 l
o
np
72.40 85.20 m
11.52 7.86 l
11.51 10.30 l
11.52 10.87 l
11.52 11.15 l
11.52 11.29 l
11.51 11.34 l
11.52 11.36 l
11.52 11.32 l
11.52 11.26 l
11.51 11.18 l
11.52 11.06 l
11.52 10.94 l
11.51 10.77 l
11.52 10.60 l
11.52 10.41 l
11.52 10.18 l
11.51 9.96 l
11.52 9.69 l
11.52 9.42 l
11.51 9.12 l
11.52 8.80 l
11.52 8.47 l
11.52 8.13 l
11.51 7.76 l
11.52 7.39 l
11.52 7.02 l
11.52 6.62 l
11.51 6.24 l
11.52 5.86 l
o
np
72.40 85.20 m
11.52 3.76 l
11.51 7.24 l
11.52 9.12 l
11.52 10.35 l
11.52 11.18 l
11.51 11.72 l
11.52 12.03 l
11.52 12.17 l
11.52 12.19 l
11.51 12.09 l
11.52 11.92 l
11.52 11.69 l
11.51 11.40 l
11.52 11.08 l
11.52 10.74 l
11.52 10.37 l
11.51 10.00 l
11.52 9.61 l
11.52 9.24 l
11.51 8.86 l
11.52 8.49 l
11.52 8.12 l
11.52 7.76 l
11.51 7.43 l
11.52 7.09 l
11.52 6.77 l
11.52 6.46 l
11.51 6.16 l
11.52 5.89 l
o
np
72.40 85.20 m
11.52 5.86 l
11.51 9.05 l
11.52 10.14 l
11.52 10.74 l
11.52 11.09 l
11.51 11.28 l
11.52 11.39 l
11.52 11.41 l
11.52 11.40 l
11.51 11.32 l
11.52 11.22 l
11.52 11.08 l
11.51 10.92 l
11.52 10.74 l
11.52 10.52 l
11.52 10.31 l
11.51 10.06 l
11.52 9.80 l
11.52 9.53 l
11.51 9.26 l
11.52 8.96 l
11.52 8.67 l
11.52 8.37 l
11.51 8.06 l
11.52 7.75 l
11.52 7.45 l
11.52 7.13 l
11.51 6.84 l
11.52 6.52 l
o
np
72.40 85.20 m
11.52 3.54 l
11.51 6.99 l
11.52 8.99 l
11.52 10.34 l
11.52 11.28 l
11.51 11.91 l
11.52 12.28 l
11.52 12.46 l
11.52 12.51 l
11.51 12.43 l
11.52 12.25 l
11.52 12.00 l
11.51 11.71 l
11.52 11.37 l
11.52 11.00 l
11.52 10.62 l
11.51 10.22 l
11.52 9.83 l
11.52 9.42 l
11.51 9.03 l
11.52 8.65 l
11.52 8.27 l
11.52 7.90 l
11.51 7.55 l
11.52 7.21 l
11.52 6.89 l
11.52 6.57 l
11.51 6.27 l
11.52 5.99 l
o
np
72.40 85.20 m
11.52 7.49 l
11.51 10.23 l
11.52 10.94 l
11.52 11.29 l
11.52 11.45 l
11.51 11.52 l
11.52 11.52 l
11.52 11.47 l
11.52 11.39 l
11.51 11.26 l
11.52 11.12 l
11.52 10.94 l
11.51 10.73 l
11.52 10.51 l
11.52 10.26 l
11.52 9.99 l
11.51 9.69 l
11.52 9.39 l
11.52 9.05 l
11.51 8.70 l
11.52 8.35 l
11.52 7.97 l
11.52 7.59 l
11.51 7.21 l
11.52 6.82 l
11.52 6.43 l
11.52 6.05 l
11.51 5.67 l
11.52 5.30 l
o
np
72.40 85.20 m
11.52 4.26 l
11.51 7.78 l
11.52 9.52 l
11.52 10.58 l
11.52 11.27 l
11.51 11.70 l
11.52 11.95 l
11.52 12.04 l
11.52 12.05 l
11.51 11.95 l
11.52 11.79 l
11.52 11.58 l
11.51 11.33 l
11.52 11.04 l
11.52 10.73 l
11.52 10.40 l
11.51 10.06 l
11.52 9.70 l
11.52 9.35 l
11.51 8.99 l
11.52 8.63 l
11.52 8.28 l
11.52 7.93 l
11.51 7.60 l
11.52 7.26 l
11.52 6.94 l
11.52 6.63 l
11.51 6.33 l
11.52 6.04 l
o
np
72.40 85.20 m
11.52 8.77 l
11.51 10.80 l
11.52 11.20 l
11.52 11.38 l
11.52 11.46 l
11.51 11.49 l
11.52 11.47 l
11.52 11.44 l
11.52 11.36 l
11.51 11.28 l
11.52 11.17 l
11.52 11.04 l
11.51 10.89 l
11.52 10.72 l
11.52 10.52 l
11.52 10.30 l
11.51 10.06 l
11.52 9.79 l
11.52 9.49 l
11.51 9.17 l
11.52 8.82 l
11.52 8.43 l
11.52 8.03 l
11.51 7.61 l
11.52 7.16 l
11.52 6.70 l
11.52 6.23 l
11.51 5.77 l
11.52 5.31 l
o
np
72.40 85.20 m
11.52 6.70 l
11.51 9.79 l
11.52 10.73 l
11.52 11.20 l
11.52 11.46 l
11.51 11.58 l
11.52 11.62 l
11.52 11.60 l
11.52 11.52 l
11.51 11.41 l
11.52 11.26 l
11.52 11.09 l
11.51 10.88 l
11.52 10.66 l
11.52 10.41 l
11.52 10.14 l
11.51 9.85 l
11.52 9.56 l
11.52 9.24 l
11.51 8.91 l
11.52 8.58 l
11.52 8.24 l
11.52 7.88 l
11.51 7.54 l
11.52 7.19 l
11.52 6.84 l
11.52 6.50 l
11.51 6.15 l
11.52 5.83 l
o
np
72.40 85.20 m
11.52 3.58 l
11.51 7.14 l
11.52 9.21 l
11.52 10.64 l
11.52 11.61 l
11.51 12.27 l
11.52 12.64 l
11.52 12.83 l
11.52 12.86 l
11.51 12.74 l
11.52 12.54 l
11.52 12.27 l
11.51 11.93 l
11.52 11.56 l
11.52 11.16 l
11.52 10.75 l
11.51 10.33 l
11.52 9.90 l
11.52 9.48 l
11.51 9.07 l
11.52 8.67 l
11.52 8.27 l
11.52 7.89 l
11.51 7.53 l
11.52 7.18 l
11.52 6.85 l
11.52 6.53 l
11.51 6.23 l
11.52 5.93 l
o
np
72.40 85.20 m
11.52 3.65 l
11.51 7.13 l
11.52 9.09 l
11.52 10.40 l
11.52 11.28 l
11.51 11.87 l
11.52 12.20 l
11.52 12.36 l
11.52 12.37 l
11.51 12.28 l
11.52 12.08 l
11.52 11.83 l
11.51 11.53 l
11.52 11.18 l
11.52 10.81 l
11.52 10.43 l
11.51 10.04 l
11.52 9.64 l
11.52 9.24 l
11.51 8.85 l
11.52 8.46 l
11.52 8.09 l
11.52 7.73 l
11.51 7.37 l
11.52 7.04 l
11.52 6.72 l
11.52 6.41 l
11.51 6.11 l
11.52 5.83 l
o
np
72.40 85.20 m
11.52 3.62 l
11.51 7.15 l
11.52 9.20 l
11.52 10.56 l
11.52 11.49 l
11.51 12.08 l
11.52 12.41 l
11.52 12.55 l
11.52 12.52 l
11.51 12.38 l
11.52 12.14 l
11.52 11.84 l
11.51 11.49 l
11.52 11.11 l
11.52 10.69 l
11.52 10.27 l
11.51 9.84 l
11.52 9.42 l
11.52 8.99 l
11.51 8.59 l
11.52 8.18 l
11.52 7.81 l
11.52 7.42 l
11.51 7.08 l
11.52 6.73 l
11.52 6.41 l
11.52 6.10 l
11.51 5.81 l
11.52 5.53 l
o
np
72.40 85.20 m
11.52 3.91 l
11.51 7.57 l
11.52 9.56 l
11.52 10.85 l
11.52 11.71 l
11.51 12.25 l
11.52 12.54 l
11.52 12.66 l
11.52 12.62 l
11.51 12.48 l
11.52 12.25 l
11.52 11.97 l
11.51 11.62 l
11.52 11.26 l
11.52 10.85 l
11.52 10.45 l
11.51 10.03 l
11.52 9.61 l
11.52 9.20 l
11.51 8.78 l
11.52 8.39 l
11.52 8.01 l
11.52 7.62 l
11.51 7.27 l
11.52 6.92 l
11.52 6.59 l
11.52 6.28 l
11.51 5.97 l
11.52 5.69 l
o
np
72.40 85.20 m
11.52 3.92 l
11.51 7.42 l
11.52 9.27 l
11.52 10.46 l
11.52 11.26 l
11.51 11.78 l
11.52 12.08 l
11.52 12.24 l
11.52 12.25 l
11.51 12.19 l
11.52 12.03 l
11.52 11.83 l
11.51 11.56 l
11.52 11.27 l
11.52 10.95 l
11.52 10.61 l
11.51 10.25 l
11.52 9.89 l
11.52 9.53 l
11.51 9.15 l
11.52 8.80 l
11.52 8.43 l
11.52 8.08 l
11.51 7.74 l
11.52 7.41 l
11.52 7.08 l
11.52 6.77 l
11.51 6.47 l
11.52 6.19 l
o
np
72.40 85.20 m
11.52 4.95 l
11.51 8.43 l
11.52 9.91 l
11.52 10.79 l
11.52 11.32 l
11.51 11.65 l
11.52 11.84 l
11.52 11.92 l
11.52 11.92 l
11.51 11.86 l
11.52 11.75 l
11.52 11.58 l
11.51 11.40 l
11.52 11.17 l
11.52 10.92 l
11.52 10.66 l
11.51 10.37 l
11.52 10.08 l
11.52 9.77 l
11.51 9.45 l
11.52 9.13 l
11.52 8.82 l
11.52 8.48 l
11.51 8.17 l
11.52 7.85 l
11.52 7.53 l
11.52 7.22 l
11.51 6.91 l
11.52 6.62 l
o
np
72.40 85.20 m
11.52 6.14 l
11.51 9.30 l
11.52 10.33 l
11.52 10.86 l
11.52 11.17 l
11.51 11.33 l
11.52 11.39 l
11.52 11.38 l
11.52 11.32 l
11.51 11.21 l
11.52 11.08 l
11.52 10.90 l
11.51 10.71 l
11.52 10.48 l
11.52 10.24 l
11.52 9.98 l
11.51 9.69 l
11.52 9.40 l
11.52 9.10 l
11.51 8.77 l
11.52 8.46 l
11.52 8.12 l
11.52 7.79 l
11.51 7.45 l
11.52 7.11 l
11.52 6.79 l
11.52 6.45 l
11.51 6.13 l
11.52 5.82 l
o
np
72.40 85.20 m
11.52 6.29 l
11.51 9.73 l
11.52 10.89 l
11.52 11.50 l
11.52 11.84 l
11.51 12.00 l
11.52 12.06 l
11.52 12.03 l
11.52 11.95 l
11.51 11.83 l
11.52 11.66 l
11.52 11.46 l
11.51 11.25 l
11.52 11.00 l
11.52 10.74 l
11.52 10.48 l
11.51 10.19 l
11.52 9.91 l
11.52 9.61 l
11.51 9.31 l
11.52 9.00 l
11.52 8.70 l
11.52 8.39 l
11.51 8.09 l
11.52 7.79 l
11.52 7.50 l
11.52 7.20 l
11.51 6.91 l
11.52 6.63 l
o
0 0 0 srgb
1.50 setlinewidth
[] 0 setdash
np
72.40 85.20 m
11.52 10.14 l
11.51 10.14 l
11.52 10.13 l
11.52 10.14 l
11.52 10.14 l
11.51 10.14 l
11.52 10.14 l
11.52 10.13 l
11.52 10.14 l
11.51 10.14 l
11.52 10.14 l
11.52 10.14 l
11.51 10.13 l
11.52 10.14 l
11.52 10.14 l
11.52 10.14 l
11.51 10.13 l
11.52 10.14 l
11.52 10.14 l
11.51 10.14 l
11.52 10.14 l
11.52 10.13 l
11.52 10.14 l
11.51 10.14 l
11.52 10.14 l
11.52 10.14 l
11.52 10.13 l
11.51 10.14 l
11.52 10.14 l
o
1 0.6471 0 srgb
np
183.73 85.20 m
0 98.00 l
o
np
72.40 183.20 m
111.33 0 l
o
0.9882 0.3059 0.1647 srgb
np
295.07 85.20 m
0 196.00 l
o
np
72.40 281.20 m
222.67 0 l
o
0.5333 0.2549 0.6157 srgb
np
406.40 85.20 m
0 294.00 l
o
np
72.40 379.20 m
334.00 0 l
o
ep
%%Trailer
%%Pages: 1
%%EOF
