ACALD,-18.48014999999998,0.0
ACALDt,-18.48014999999998,0.0
ACKr,-18.48014999999998,0.0
ACONTa,0.1078899999999976,18.58804
ACONTb,0.10788999999999999,18.588039999999978
ACt2r,-18.48014999999998,0.0
ADK1,0.0,156.17183999999997
AKGDH,0.0,18.480150000000002
AKGt2r,-9.240075000000001,0.0
ALCD2x,-18.480150000000002,0.0
ATPM,0.0,0.0
ATPS4r,-31.55332,138.4786325
BIOMASS_Ecoli_core_w_GAM,0.1,0.1
CO2t,-55.74445000000003,10.498325454545455
CS,0.10788999999999999,18.58804
CYTBD,0.0,111.25768
D_LACt2,-18.48014999999998,0.0
ENO,1.1044200000000046,19.584569999999985
ETOHt2r,-18.48014999999998,0.0
EX_ac_e,0.0,18.480150000000002
EX_acald_e,0.0,18.480150000000002
EX_akg_e,0.0,9.240075000000001
EX_co2_e,-10.498325454545466,55.744449999999915
EX_etoh_e,0.0,18.480150000000002
EX_for_e,0.0,37.44297
EX_fru_e,0.0,0.0
EX_fum_e,0.0,0.0
EX_glc__D_e,-10.0,-1.0909319444444439
EX_gln__L_e,0.0,0.0
EX_glu__L_e,0.0,9.240075000000006
EX_h2o_e,-8.637360000000005,56.47289000000001
EX_h_e,2.0059999999997444,39.44896999999992
EX_lac__D_e,0.0,18.48015000000001
EX_mal__L_e,0.0,0.0
EX_nh4_e,-9.785354999999981,-0.54528
EX_o2_e,-55.628839999999975,0.0
EX_pi_e,-0.3678699999999999,-0.3678699999999999
EX_pyr_e,0.0,18.480150000000002
EX_succ_e,0.0,15.253398749999974
FBA,-8.579619999999977,9.900530000000003
FBP,0.0,156.17183999999992
FORt,-624.6873599999997,0.0
FORt2,0.0,624.6873599999997
FRD7,0.0,1000.0
FRUpts2,0.0,0.0
FUM,-14.152868857142835,18.48014999999998
FUMt2_2,0.0,0.0
G6PDH2r,0.0,55.440450000000055
GAPD,1.2540199999999992,19.73416999999995
GLCpts,1.0909319444444443,10.0
GLNS,0.02557,156.1974099999998
GLNabc,0.0,0.0
GLUDy,-9.759784999999965,155.65212999999972
GLUN,0.0,156.17183999999992
GLUSy,0.0,156.1718399999998
GLUt2r,-9.240075000000001,0.0
GND,0.0,55.44045000000007
H2Ot,-56.472890000000035,8.637359999999944
ICDHyr,0.10788999999999999,18.58804
ICL,0.0,18.480150000000002
LDH_D,-18.480150000000002,0.0
MALS,0.0,18.48014999999998
MALt2_2,0.0,0.0
MDH,-64.22882000000004,36.96030000000019
ME1,0.0,91.52039250000001
ME2,0.0,91.94904500000001
NADH16,0.0,111.25768000000014
NADTRHD,0.0,352.8382449999996
NH4t,0.54528,9.785355000000001
O2t,0.0,55.628839999999855
PDH,0.0,37.44297000000001
PFK,0.0,166.07237
PFL,0.0,37.44297
PGI,-45.460950000000025,9.97950000000003
PGK,-19.73417,-1.2540199999999686
PGL,0.0,55.44045000000007
PGM,-19.584569999999985,-1.1044200000000046
PIt2r,0.3678699999999999,0.3678699999999999
PPC,0.0,156.45839999999998
PPCK,0.0,156.17184
PPS,0.0,156.17183999999997
PTAr,0.0,18.480150000000002
PYK,0.0,165.70449999999994
PYRt2,-18.48014999999998,0.0
RPE,-0.07188000000000001,36.888419999999996
RPI,-18.55203000000001,-0.07187999999996464
SUCCt2_2,0.0,208.22911999999997
SUCCt3,0.0,208.22911999999997
SUCDi,0.0,1000.0
SUCOAS,-18.48014999999998,0.0
TALA,-0.017889999999965767,18.462260000000015
THD2,0.0,312.34367999999984
TKT1,-0.017890000000000007,18.462260000000015
TKT2,-0.05398999999999887,18.42616
TPI,-8.579619999999998,9.900530000000003
