mps,mcs,mp_size,subset_size,network_size,dt
1,0,21,3185,33272,4.5599470138549805
2,2,19,3185,33272,7.655425071716309
3,10,21,3185,33272,15.05929708480835
4,14,19,3185,33272,21.556011199951172
5,14,19,19,33272,25.264586210250854
6,14,19,19,33272,32.67642116546631
7,14,19,3185,33272,42.109126329422
8,14,21,3185,33272,45.35897135734558
9,14,21,21,33272,48.05128812789917
10,14,21,21,33272,59.81305432319641
11,14,21,21,33272,72.30093216896057
12,14,21,21,33272,77.48571801185608
13,14,21,21,33272,89.77771615982056
14,14,21,21,33272,95.44964623451233
15,15,21,3185,33272,105.57741332054138
16,15,19,3185,33272,111.05254912376404
17,15,19,19,33272,113.91131234169006
18,15,21,3185,33272,120.80753111839294
19,15,21,21,33272,124.2835431098938
20,15,19,19,33272,136.93378520011902
21,16,19,3185,33272,153.56400108337402
22,16,21,21,33272,156.87710738182068
23,17,19,3185,33272,165.7017810344696
24,17,19,19,33272,168.3000841140747
25,17,19,19,33272,180.4635283946991
26,18,21,3185,33272,191.18695330619812
27,18,21,21,33272,195.3860001564026
28,18,19,3185,33272,203.98420405387878
29,18,19,19,33272,208.20964217185974
30,18,19,19,33272,215.91280007362366
31,18,19,19,33272,223.50156116485596
32,18,19,19,33272,228.46202611923218
33,18,19,19,33272,237.56844639778137
34,18,19,19,33272,245.6582522392273
35,20,20,3185,33272,252.87649512290955
36,21,21,3185,33272,255.51785016059875
37,21,21,21,33272,258.59646224975586
38,21,21,21,33272,272.75191926956177
39,21,21,21,33272,283.34796118736267
40,21,21,21,33272,299.747052192688
41,21,21,21,33272,315.31069016456604
42,21,19,3185,33272,326.96695613861084
43,21,19,19,33272,330.550733089447
44,21,19,19,33272,341.0183780193329
45,21,19,19,33272,348.7750232219696
46,21,19,19,33272,358.962767124176
47,21,19,3185,33272,371.59733724594116
48,21,21,3185,33272,376.1562352180481
49,21,21,21,33272,379.03794717788696
50,21,21,21,33272,385.08632707595825
51,21,21,21,33272,394.7389540672302
52,21,21,21,33272,406.0046181678772
53,21,21,21,33272,415.3817160129547
54,21,21,21,33272,424.9174792766571
55,21,21,21,33272,430.3432562351227
56,21,21,21,33272,437.30663323402405
57,21,19,3185,33272,445.5700840950012
58,21,21,21,33272,449.7241311073303
59,21,19,19,33272,460.85026001930237
60,21,21,21,33272,475.989871263504
61,21,19,3185,33272,486.1608943939209
62,21,19,19,33272,489.613085269928
63,21,19,19,33272,495.5917532444
64,21,19,19,33272,501.33196806907654
65,21,19,19,33272,510.90963220596313
66,21,19,19,33272,519.2569301128387
67,21,19,19,33272,529.1320860385895
68,21,19,19,33272,539.0855350494385
69,21,19,19,33272,546.7369432449341
70,21,19,19,33272,562.9197959899902
71,21,19,3185,33272,578.873199224472
72,21,19,19,33272,583.3923933506012
73,21,19,19,33272,590.8397843837738
74,21,19,19,33272,598.0946862697601
75,21,19,19,33272,611.6947021484375
76,21,19,19,33272,620.60351729393
77,21,19,3185,33272,627.1692631244659
78,21,19,3185,33272,631.5360140800476
79,21,19,19,33272,632.5757210254669
80,21,19,19,33272,648.3710281848907
81,21,19,19,33272,662.408046245575
82,21,19,19,33272,670.52663230896
83,21,19,19,33272,677.9421513080597
84,21,19,19,33272,685.111887216568
85,21,19,19,33272,695.7448613643646
86,21,19,3185,33272,708.173014163971
87,21,19,19,33272,712.2070732116699
88,21,19,19,33272,720.6707620620728
89,21,19,19,33272,729.4335641860962
90,21,19,19,33272,737.836911201477
91,23,20,3185,33272,745.2522733211517
92,23,20,20,33272,747.9452040195465
93,23,20,20,33272,755.0177352428436
94,23,21,3185,33272,760.4062740802765
95,23,19,3185,33272,764.9304671287537
96,23,21,21,33272,768.6559662818909
97,23,19,19,33272,778.301381111145
98,23,21,21,33272,785.1653971672058
99,23,19,3185,33272,790.2692160606384
100,23,19,19,33272,794.3701541423798
101,23,19,19,33272,801.0400562286377
102,23,19,19,33272,812.5596952438354
103,23,19,19,33272,822.3582620620728
104,23,19,19,33272,836.7964510917664
105,25,19,3185,33272,844.3569991588593
106,26,20,3185,33272,846.742026090622
107,26,20,20,33272,849.6166291236877
108,26,19,3185,33272,857.324508190155
109,26,19,19,33272,858.794899225235
110,26,19,19,33272,868.6491231918335
111,26,21,3185,33272,877.2169489860535
112,26,21,21,33272,879.8377101421356
113,26,21,21,33272,884.6687350273132
114,26,21,3185,33272,893.6005702018738
115,26,21,21,33272,896.1495091915131
116,26,21,3185,33272,909.2510023117065
117,26,21,21,33272,911.8557751178741
118,26,21,21,33272,918.9086482524872
119,26,21,21,33272,927.0363321304321
120,26,21,21,33272,936.6834502220154
121,26,21,21,33272,951.1270272731781
122,26,21,21,33272,959.7371063232422
123,26,21,21,33272,978.6886053085327
124,26,19,3185,33272,986.136292219162
125,26,19,19,33272,987.9844791889191
126,26,19,19,33272,996.1849522590637
127,26,19,19,33272,1008.4231381416321
128,26,21,3185,33272,1015.9361710548401
129,26,21,21,33272,1020.3329541683197
130,26,21,21,33272,1027.3444211483002
131,26,21,21,33272,1039.2839951515198
132,26,21,21,33272,1045.9455380439758
133,26,21,21,33272,1054.630627155304
134,26,21,3185,33272,1063.4798121452332
135,26,21,21,33272,1066.7328712940216
136,26,21,21,33272,1073.1682560443878
137,26,21,21,33272,1081.8680901527405
138,26,21,21,33272,1090.6040263175964
139,26,21,21,33272,1097.8462352752686
140,29,20,3185,33272,1105.4788553714752
141,29,20,20,33272,1109.9779603481293
142,29,20,20,33272,1116.681838274002
143,34,19,3185,33272,1128.7378251552582
144,34,19,19,33272,1131.3304271697998
145,34,19,19,33272,1137.6247820854187
146,34,19,19,33272,1145.9894752502441
147,34,19,19,33272,1152.8101732730865
148,34,19,19,33272,1162.3740501403809
149,34,19,19,33272,1172.8354971408844
150,34,19,19,33272,1180.9098272323608
151,34,19,3185,33272,1187.6113421916962
152,34,19,19,33272,1191.5797381401062
153,34,19,19,33272,1198.6727800369263
154,34,19,19,33272,1209.2164602279663
155,34,19,19,33272,1217.2212631702423
156,34,19,19,33272,1223.0632162094116
157,34,19,19,33272,1233.7584261894226
158,34,21,3185,33272,1244.5742893218994
159,34,21,21,33272,1247.198809146881
160,34,21,21,33272,1265.5651383399963
161,34,21,21,33272,1273.6324281692505
162,34,21,21,33272,1277.9893040657043
163,34,21,21,33272,1286.417307138443
164,34,19,3185,33272,1296.302651166916
165,34,19,19,33272,1298.553287267685
166,34,19,19,33272,1311.8212711811066
167,34,19,19,33272,1320.232432126999
168,34,21,3185,33272,1328.8925960063934
169,34,21,21,33272,1332.1907420158386
170,34,21,21,33272,1345.4354350566864
171,34,21,21,33272,1351.9699263572693
172,34,21,21,33272,1358.5014412403107
173,34,21,21,33272,1368.1552913188934
174,34,19,3185,33272,1377.4820442199707
175,34,19,19,33272,1379.3111872673035
176,34,19,19,33272,1386.7632839679718
177,34,19,19,33272,1392.9040372371674
178,34,19,19,33272,1397.6195011138916
179,34,19,19,33272,1406.9854032993317
180,34,19,19,33272,1413.6169941425323
181,34,19,19,33272,1422.8357481956482
182,34,19,19,33272,1432.0841653347015
183,34,19,19,33272,1435.7623801231384
184,34,19,19,33272,1444.2510950565338
185,34,19,19,33272,1455.8147382736206
186,34,21,3185,33272,1466.4017553329468
187,34,21,21,33272,1469.1061429977417
188,34,21,21,33272,1477.8036360740662
189,34,21,21,33272,1486.253207206726
190,34,21,21,33272,1494.7924580574036
191,34,21,21,33272,1504.6715421676636
192,35,20,3185,33272,1521.3755781650543
193,35,20,20,33272,1525.63170003891
194,35,20,20,33272,1533.9086141586304
195,35,19,3185,33272,1538.4500312805176
196,35,19,19,33272,1540.7741560935974
197,35,19,19,33272,1544.6409993171692
198,35,19,19,33272,1552.2229990959167
199,35,19,19,33272,1564.1261093616486
200,35,19,19,33272,1570.5647962093353
201,41,21,3185,33272,1578.2512950897217
202,41,21,21,33272,1582.6147892475128
203,41,21,21,33272,1590.734431028366
204,41,21,21,33272,1597.143347978592
205,41,21,21,33272,1600.7566502094269
206,41,21,21,33272,1609.2371373176575
207,41,19,3185,33272,1616.5026721954346
208,41,19,19,33272,1620.4194371700287
209,41,19,19,33272,1633.5106780529022
210,41,19,19,33272,1642.385982990265
211,41,19,19,33272,1650.8370742797852
212,41,19,19,33272,1660.202786207199
213,41,19,3185,33272,1672.1973872184753
214,41,19,19,33272,1676.1165552139282
215,41,19,19,33272,1685.4892802238464
216,41,19,19,33272,1697.1219263076782
217,41,21,3185,33272,1709.691640138626
218,41,21,21,33272,1713.7624492645264
219,41,21,21,33272,1723.3431723117828
220,41,21,21,33272,1730.519168138504
221,41,21,21,33272,1738.4870002269745
222,41,21,21,33272,1749.7669332027435
223,41,21,3185,33272,1760.0987792015076
224,41,21,21,33272,1763.8043673038483
225,41,21,21,33272,1776.5086600780487
226,41,21,21,33272,1784.0775151252747
227,41,21,21,33272,1792.0682842731476
228,41,21,21,33272,1798.2958352565765
229,41,19,3185,33272,1808.796691417694
230,41,19,19,33272,1810.5703461170197
231,41,19,19,33272,1816.7294793128967
232,41,19,19,33272,1827.0097131729126
233,41,19,19,33272,1836.718834400177
234,41,19,19,33272,1846.0104341506958
235,41,19,3185,33272,1857.8191771507263
236,41,19,19,33272,1861.5518682003021
237,41,19,19,33272,1867.9517743587494
238,41,19,19,33272,1876.2831454277039
239,41,19,19,33272,1884.282436132431
240,41,19,19,33272,1894.3043582439423
241,41,19,3185,33272,1902.6192073822021
242,41,19,19,33272,1906.1273682117462
243,41,19,19,33272,1911.0511281490326
244,41,19,19,33272,1927.4426681995392
245,41,19,19,33272,1935.3891611099243
246,41,19,19,33272,1942.1804354190826
247,42,19,3185,33272,1949.3110811710358
248,42,19,19,33272,1952.2123761177063
249,42,19,19,33272,1960.652467250824
250,42,19,19,33272,1968.9449701309204
251,42,19,19,33272,1975.8992943763733
252,42,19,19,33272,1982.427886247635
