0.00000,14038.864
0.13342,14320.061
0.26684,16736.270
0.40027,18959.209
0.53369,20658.637
0.66711,20342.615
0.80053,19615.256
0.93395,19816.467
1.06737,20019.248
1.20080,19916.289
1.33422,19620.430
1.46764,18382.990
1.60106,17061.574
1.73448,15263.630
1.86791,13989.873
2.00133,13640.102
