X,Y
0.00000,39648.359
0.13342,40733.137
0.26684,40455.938
0.40027,41284.078
0.53369,41094.312
0.66711,41979.629
0.80053,41630.605
0.93395,41935.180
1.06737,40588.582
1.20080,41787.391
1.33422,40540.520
1.46764,40949.855
1.60106,41037.062
1.73448,41198.816
1.86791,44396.453
2.00133,44027.316
2.13475,41744.332
2.26817,44185.906
2.40159,50586.957
2.53502,66675.875
2.66844,88332.172
2.80186,88117.953
2.93528,64844.715
3.06870,50307.938
