x	Y_20180514_15338_c1_12_1g	Y_20180514_15338_c1_4_2g
0	11674.798	9418.28
0.1334	11880.572	9246.253
0.2668	11654.623	9252.006
0.4003	11382.779	9163.549
0.5337	11411.21	9150.857
0.6671	11724.296	9523.426
0.8005	14864.288	9932.854
0.934	20895.816	10273.694
1.0674	25279.66	12244.902
1.2008	24222.543	13054.226
1.3342	21470.033	13629.376
1.4676	19252.729	13680.79
1.6011	18093.938	13914.708
1.7345	17079.684	14040.175
1.8679	16588.914	15391.034
2.0013	17059.924	15209.631
2.1348	18063.977	15077.847
2.2682	18716.229	14508.857
2.4016	16966.381	14683.708
2.535	17214.91	14459.794
2.6684	17068.102	14042.561
2.8019	17804.803	13358.087
2.9353	18109.775	13783.97
3.0687	18587.281	12920.855
3.2021	17166.754	13376.576
3.3356	15082.316	13016.304
3.469	14990.945	13172.089
3.6024	14550.068	13222.392
3.7358	14208.493	13930.851
3.8692	13731.322	13110.537
4.0027	13131.588	12341.831
4.1361	13092.665	12160.331
4.2695	NaN	12461.595
4.4029	NaN	11684.391
4.5363	NaN	11310.758
4.6698	NaN	11650.342
4.8032	NaN	11096.042
4.9366	NaN	10695.105
5.07	NaN	10583.294
5.2035	NaN	NaN
5.3369	NaN	NaN
5.4703	NaN	NaN
