0.00000,15194.797
0.13342,14834.265
0.26684,15279.833
0.40027,18954.270
0.53369,24715.912
0.66711,26371.432
0.80053,25041.113
0.93395,25757.311
1.06737,23206.586
1.20080,20825.369
1.33422,19858.336
1.46764,21130.004
1.60106,22571.270
1.73448,21489.926
1.86791,19639.260
2.00133,16129.893
2.13475,14447.163
2.26817,13593.030
2.40159,13098.635
2.53502,12613.494
