X,Y
0.00000,10858.298
0.13342,11280.792
0.26684,12306.217
0.40027,12575.130
0.53369,13972.028
0.66711,15769.982
0.80053,14515.082
0.93395,13695.767
1.06737,13784.438
1.20080,13421.518
1.33422,12840.407
1.46764,12957.123
1.60106,13578.101
1.73448,15311.696
1.86791,16013.224
2.00133,16072.672
2.13475,17077.096
2.26817,17480.283
2.40159,17837.248
2.53502,15973.197
2.66844,14209.815
2.80186,14349.217
2.93528,13567.138
3.06870,14291.951
3.20212,14157.053
3.33555,13470.689
