X,Y
0.00000,13523.777
0.13342,14237.018
0.26684,14528.837
0.40027,15580.407
0.53369,16932.393
0.66711,16409.232
0.80053,15637.180
0.93395,15958.701
1.06737,15004.100
1.20080,15038.096
1.33422,14211.097
1.46764,13081.841
1.60106,12452.201
1.73448,12525.782
1.86791,12944.683
2.00133,13079.936
2.13475,13235.735
2.26817,12466.582
2.40159,12528.197
2.53502,12085.914
2.66844,12760.731
2.80186,12464.023
2.93528,12413.048
3.06870,12463.052
3.20212,12539.977
