0.0000	32029.3613
0.1334	31057.8809
0.2668	31307.5352
0.4003	31208.3125
0.5337	32656.0586
0.6671	31417.9844
0.8005	32098.4941
0.9340	30306.2969
1.0674	31587.9980
1.2008	32299.3066
1.3342	33874.3516
1.4676	39562.3672
1.6011	50465.3047
1.7345	73191.8594
1.8679	90754.3594
2.0013	76330.0547
2.1347	52366.4766
2.2682	39378.3867
2.4016	33950.3047
2.5350	32954.5898
2.6684	34524.6992
