X,Y
0.00000,14461.821
0.13342,15616.844
0.26684,17472.740
0.40027,20099.902
0.53369,22571.453
0.66711,20258.369
0.80053,17899.141
0.93395,16509.416
1.06737,17025.949
1.20080,15984.814
1.33422,15609.621
1.46764,14694.724
1.60106,14341.352
1.73448,13818.280
1.86791,13246.616
2.00133,12873.732
2.13475,12790.702
2.26817,12772.359
2.40159,11593.132
2.53502,12211.308
2.66844,12505.979
2.80186,12340.497
2.93528,12049.947
3.06870,11782.385
3.20212,12247.573
