0.00000,10641.521
0.13342,11582.562
0.26684,12378.540
0.40027,15261.562
0.53369,21165.707
0.66711,22898.691
0.80053,22746.676
0.93395,20579.234
1.06737,20042.131
1.20080,18915.598
1.33422,16522.797
1.46764,15534.518
1.60106,16277.120
1.73448,15662.776
1.86791,16071.107
2.00133,15938.987
2.13475,16754.705
2.26817,16370.522
2.40159,15491.608
2.53502,16510.762
2.66844,16435.494
2.80186,15930.828
2.93528,15046.786
3.06870,14931.092
3.20212,15190.720
3.33555,15465.404
3.46897,14493.304
3.60239,13809.785
3.73581,14053.870
3.86923,13922.103
4.00266,13611.315
4.13608,12864.887
4.26950,12544.398
4.40292,11980.682
4.53634,12663.383
