x	Y_20180514_15100b_12_3g	Y_20180514_15100b_19_5g	Y_20180514_15100b_21_7g	Y_20180514_15100b_22_2g	Y_20180514_15100b_23_3g	Y_20180514_15100b_9_5g	Y_20180514_15100b_9_6g
0	11763.22	11602.876	12850.535	13878.902	15729.583	15789.926	14358.314
0.1334	11789.484	11584.202	13341.982	14019.035	15927.114	16096.407	15224.988
0.2668	13230.368	12231.551	13015.34	14743.188	16411.514	15812.727	15192.492
0.4003	13323.887	12390.469	12649.958	14771.146	16703.197	16179.423	15875.245
0.5337	13581.549	12002.68	13621.368	14677.854	17763.195	16418.732	18666.844
0.6671	15448.265	13319.673	14348.728	15240.518	21915.332	16246.25	22949.93
0.8005	18849.463	15587.361	14838.019	15550.84	24350.828	16954.412	22683.984
0.934	23051.934	15908.853	17366.859	16170.183	20583.092	17643.482	20599.414
1.0674	23665.336	16533.934	19586.105	16480.455	18772.791	18237.516	19051.645
1.2008	22184.674	15829.864	19224.803	18614.027	17402.635	17109.836	17296.465
1.3342	21064.844	15435.82	19757.027	18011.701	16484.586	14906.686	17123.709
1.4676	20067.926	16384.846	18772.424	16847.258	17634.736	13829.812	17885.709
1.6011	18771.328	15220.572	16548.396	16040.938	17717.039	13681.902	17018.451
1.7345	19019.139	16363.417	15843.485	14608.081	17308.037	14161.859	16317.609
1.8679	18919.723	16860.617	14769.74	13452.035	16614.285	13958.238	15714.354
2.0013	17867.816	15959.475	14575.297	12913.349	15765.21	NaN	15327.475
2.1348	17339.252	15100.482	NaN	13171.674	16212.558	NaN	14456.021
2.2682	16290.779	14289.123	NaN	13315.845	15248.565	NaN	14244.829
2.4016	15647.391	13867.658	NaN	NaN	16065.96	NaN	NaN
2.535	14946.414	13982.435	NaN	NaN	15631.391	NaN	NaN
2.6684	14254.861	14022.97	NaN	NaN	15003.548	NaN	NaN
2.8019	13837.335	14449.565	NaN	NaN	13652.776	NaN	NaN
2.9353	13380.025	NaN	NaN	NaN	NaN	NaN	NaN
3.0687	12952.276	NaN	NaN	NaN	NaN	NaN	NaN
3.2021	NaN	NaN	NaN	NaN	NaN	NaN	NaN
3.3356	NaN	NaN	NaN	NaN	NaN	NaN	NaN
3.469	NaN	NaN	NaN	NaN	NaN	NaN	NaN
3.6024	NaN	NaN	NaN	NaN	NaN	NaN	NaN
3.7358	NaN	NaN	NaN	NaN	NaN	NaN	NaN
3.8692	NaN	NaN	NaN	NaN	NaN	NaN	NaN
4.0027	NaN	NaN	NaN	NaN	NaN	NaN	NaN
4.1361	NaN	NaN	NaN	NaN	NaN	NaN	NaN
4.2695	NaN	NaN	NaN	NaN	NaN	NaN	NaN
4.4029	NaN	NaN	NaN	NaN	NaN	NaN	NaN
4.5363	NaN	NaN	NaN	NaN	NaN	NaN	NaN
4.6698	NaN	NaN	NaN	NaN	NaN	NaN	NaN
