x	Y_20180514_15100_11_13g	Y_20180514_15100_18_1g	Y_20180514_15100_23_7g	Y_20180514_15100_3_8g	Y_20180514_15100_5_5g
0	12743.9531	12077.4531	15955.2861	13883.7295	11806.1191
0.1334	14548.0469	14358.8242	16356.9189	14731.1953	12152.1865
0.2668	15992.1455	17657.6816	17151.4297	16677.3008	13547.0723
0.4003	19131.6543	21109.7188	18748.6035	21821.9531	14510.9854
0.5337	24213.2324	21239.2754	22133.6406	23476.6621	14958.9453
0.6671	25372.9258	20019.1641	28420.6582	24158.9746	15522.0674
0.8005	22989.8457	17884.9668	32520.5918	22219.623	16483.2305
0.934	19888.125	17526.4551	27686.1523	20289.9766	17121.043
1.0674	17524.1445	17201.4844	23197.7227	18053.375	15590.0742
1.2008	17576.8926	16554.5371	21676.1973	17527.6992	15672.7979
1.3342	18054.3477	15832.7295	21281.1914	16889.5859	15588.3594
1.4676	19461.2422	15681.9746	21645.752	16900.1016	16095.1992
1.6011	20316.9785	16181.3672	21788.457	16138.4639	15775.0469
1.7345	21641.5371	15601.2725	22969.5625	15329.6338	15425.9346
1.8679	21113.0977	14647.0527	23850.8945	13664.248	15717.5938
2.0013	19601.8652	14584.1953	22434.6445	13972.0645	15444.4609
2.1347	17280.7832	14265.4229	21429.9863	13168.7803	16449.7773
2.2682	15264.2314	14295.0859	20880.1445	12778.4238	16578.1094
2.4016	16398.0293	13074.791	19852.6855	13622.7598	15542.4531
2.535	16610.375	12274.1758	18939.6562	14500.8203	15938.3613
2.6684	16589.3711	12443.9307	17120.0801	16606.2891	16030.0498
2.8019	16705.668	12262.6973	15661.667	17660.4492	15995.8867
2.9353	15769.8984	12398.2988	14475.1396	16535.5195	15959.2598
3.0687	15525.3447	12725.7686	14632.4209	15678.6475	16075.4072
3.2021	14981.2168	13211.4502	13826.9365	15307.4727	15722.5459
3.3355	15002.7666	13101.2373	14135.0664	14000.5293	15713.3789
3.469	15240.2607	12703.0801	13560.4561	14062.1992	15792.4424
3.6024	14179.6973	12127.2373	13380.7656	14361.4209	14945.3359
3.7358	14450.7881	11822.4785	13316.3682	14172.626	14174.4141
3.8692	14605.2646	12428.8174	14021.5742	14711.6465	13532.9629
4.0027	13893.1631	NaN	13655.502	NaN	13719.7031
4.1361	13982.4375	NaN	NaN	NaN	13496.5938
4.2695	13423.3232	NaN	NaN	NaN	14047.708
4.4029	13855.0479	NaN	NaN	NaN	NaN
4.5363	NaN	NaN	NaN	NaN	NaN
4.6698	NaN	NaN	NaN	NaN	NaN
4.8032	NaN	NaN	NaN	NaN	NaN
4.9366	NaN	NaN	NaN	NaN	NaN
5.07	NaN	NaN	NaN	NaN	NaN
