0.00000,14797.955
0.13342,14882.245
0.26684,14913.695
0.40027,15729.641
0.53369,18497.564
0.66711,20228.766
0.80053,21171.811
0.93395,20119.406
1.06737,19910.787
1.20080,22691.723
1.33422,22868.801
1.46764,22725.574
1.60106,22151.965
1.73448,20601.287
1.86791,19007.400
2.00133,17133.609
2.13475,16324.582
2.26817,14885.401
2.40159,14019.963
2.53502,13102.650
2.66844,12753.900
2.80186,12900.377
2.93528,12657.259
3.06870,12480.341
