0.00000,38887.996
0.13342,36663.336
0.26684,37885.863
0.40027,38873.938
0.53369,37683.695
0.66711,38594.809
0.80053,39160.234
0.93395,37980.809
1.06737,38233.672
1.20080,37839.699
1.33422,37956.406
1.46764,39180.312
1.60106,40522.211
1.73448,42766.543
1.86791,52025.660
2.00133,79478.656
2.13475,107202.438
2.26817,103036.766
2.40159,72378.789
2.53502,50235.629
2.66844,44470.629
