X,Y
0.00000,33196.262
0.13342,35316.383
0.26684,34376.023
0.40027,33731.828
0.53369,34988.727
0.66711,34627.844
0.80053,33848.750
0.93395,33612.152
1.06737,36052.398
1.20080,33665.875
1.33422,33838.832
1.46764,35983.035
1.60106,37109.496
1.73448,45436.434
1.86791,65157.336
2.00133,99563.227
2.13475,118314.695
2.26817,86008.469
2.40159,54319.227
2.53502,41409.652
