x	Y_20180514_15100_10_3g	Y_20180514_15100_10_4g	Y_20180514_15100_11_6g	Y_20180514_15100_12_5g	Y_20180514_15100_13_3g	Y_20180514_15100_14_2g	Y_20180514_15100_15_1g	Y_20180514_15100_15_2g	Y_20180514_15100_17_1g	Y_20180514_15100_17_5g	Y_20180514_15100_19_1g	Y_20180514_15100_21_3g	Y_20180514_15100_22_1g	Y_20180514_15100_23_2g	Y_20180514_15100_25_3g	Y_20180514_15100_27_7g	Y_20180514_15100_30_1g	Y_20180514_15100_31_4g	Y_20180514_15100_5_2g	Y_20180514_15100_6_2g	Y_20180514_15100_6_3g	Y_20180514_15100_7_1g	Y_20180514_15100_7_3g	Y_20180514_15100_8_3g	Y_20180514_15100_8_5g
0	32175.918	30098.051	28103.955	26737.697	33001.703	33175.914	35209.727	28072.859	34296.859	26503.766	32563.059	29360.738	30791.537	29639.594	30442.207	33063.184	32222.23	35587.422	33644.547	34693.152	35031.281	32359.09	33238.688	28424.066	31362.65
0.1334	33606.688	28949.463	28279	27829.07	31079.131	35285.824	35693.191	29377.74	34448.695	27648.721	32685.732	29777.055	31010.869	29010.41	29603.176	30507.402	31073.998	34658.191	33737.438	35954.348	34998.348	32477.012	33795.441	28392.633	31459.219
0.2668	33744.125	29608.881	28858.932	28394.594	32218.158	35675.684	35563.371	28839.129	35600.652	26231.955	31913.266	29207.986	30729.189	28070.973	29209.203	30777.766	30359.154	35403.902	34100.332	34800.574	35029.102	33624.695	33660.164	28955.771	30337.24
0.4003	31460.152	29525.555	29143.268	28197.629	33173.172	35457.121	35138.867	28717.465	36811.777	26859.975	31384.986	30072.578	32317.961	28977.631	29631.506	31690.764	30852.734	35693.418	33452.352	34646.281	35836.148	32158.018	31955.398	29910.938	29990.639
0.5337	30366.396	29653.148	28946.232	26836.594	34004.598	34213.762	35103.992	28728.641	37031.148	27335.865	32005.26	31650.973	31408.885	29341.086	31871.58	32396.928	29976.496	35935.621	33422.449	33679.598	36351.738	30788.584	32234.08	26629.078	31137.217
0.6671	30793.303	29744.418	28587.615	27566.549	32902.277	33421.309	33885.059	29629.482	37571.852	26927.453	34780.242	30408.49	31869.176	29747.436	30895.777	31428.859	29896.561	37367.672	34367.824	34964.254	35271.664	32333.346	33748.461	30425.137	29839.799
0.8005	33589.219	27687.74	29338.814	28175.053	33127.695	33866.875	34165.129	28747.09	37087.688	27447.637	31980.234	30639.762	32647.137	29999.855	31206.826	30596.541	31316.475	37164.465	33531.461	34418.199	34193.059	32349.41	35779.609	28478.881	30926.264
0.934	33693.516	29567.729	29709.4	28390.67	33670.727	33892.207	34555.078	29478.877	37294.047	26145.348	31120.514	31600.07	32884.113	29076.311	31659.236	30948.379	32340.592	36201.59	34063.66	35369.715	34746.832	32726.004	37586.773	29047.023	31556.713
1.0674	35444.062	29832.061	29187.434	27872.506	34977.777	34946.117	35781.91	30050.447	37921.688	26520.508	31913.852	31667.18	32565.664	29673.055	32116.582	31565.963	29633.125	35704.16	34711.934	35111.316	35845.113	32402.996	33567.191	29333.967	30923.537
1.2008	34633.836	29647.703	29544.77	28579.354	33381.707	35631.844	34695.211	31260.58	38302.117	27451.385	32143.547	30759.111	33254.324	29914.721	32602.826	33061.523	32384.881	36502.266	35040.191	35069.863	34853.512	31038.07	35753.188	29896.832	32079.061
1.3342	34798.59	30484.186	29571.195	27431.516	33056.859	35427.754	36971.156	30493.945	46595.918	28740.025	32323.912	30391.863	34299.918	29999.277	36661.125	31628.027	32907.176	36043.973	34651.996	34476.184	34746.914	32027.199	36168.418	29795.383	31316.82
1.4676	36016.027	31399.857	29858.314	28960.014	34313.059	33609.973	36438.227	30054.627	61215.801	26703.951	32428.018	30650.271	34940.668	29863.756	40439.027	33588.727	34894.461	36354.066	33910.914	34869.582	36919.867	30665.318	36909.445	30522.342	32482.338
1.6011	36135.461	30564.811	29596.945	27314.418	34566.852	34577.184	38721.777	29920.924	66177.594	27095.045	35260.543	31817.678	36832.012	29889.949	52176.508	33872.215	33077.961	35235.082	33185.523	34713.898	40043.625	31788.844	35860.312	29872.711	33247.484
1.7345	37985.543	30868.666	30926.779	27760.408	34632.906	35006.332	41436.727	30780.846	55571.031	28063.83	34173.281	32839.309	38897.973	29820.605	76736.023	34081.242	32341.629	35269.66	34085.445	34987.273	44166.035	31817.791	34143.949	29744.574	34206.488
1.8679	48909.805	31893.744	30601.133	29230.781	35174.844	35578.012	43588.215	30949.582	46561.684	28127.898	33710.891	34816.105	42202.82	30470.232	86729.898	33924.195	32764.988	35591.004	33808.16	36776.379	52800.5	33871.461	36568.754	29615.789	34169.34
2.0013	65279.965	35485.469	30431.465	29234.816	37370.316	35490.902	43909.371	31999.865	39417.957	33209.992	34796.23	40208.328	53869.219	30977.416	68243.484	35447.996	33967.102	39304.23	35670.93	46546.098	57025.582	34404.574	41949.238	28089.891	37118.152
2.1348	78862.789	44928.402	31653.064	29538.176	43320.715	39277.184	51161.996	34524.969	38877.43	36057.832	34605.695	51320.863	80659.391	30886.438	49115.945	41291.602	35484.098	44290.625	40647.117	67582.68	47687.352	35128.262	47517.363	28980.742	46591.277
2.2682	60909.59	53142.332	31600.564	30297.062	59557.258	43358.98	62985.785	39074.059	37616.277	37399.914	33037	64499.461	127050.453	32793.27	38398.84	52532.945	36822.914	55126.375	48510.297	107207.328	39170.613	42807.316	51041.148	29529.506	62818.961
2.4016	47148.195	48221.965	32915.238	31517.012	75128.664	49773.832	64574.684	45318	34663.305	33654.418	32738.91	66555.328	159372.781	42436.066	37128.742	71479.969	43717.078	81805.875	51778.121	133634.234	37860.957	57953.773	47356.797	28990.107	63955.445
2.535	NaN	38416.086	35066.234	38665.922	73873.742	51654.086	49132.863	41631.879	NaN	30324.896	33486.895	51665.09	129376.617	55981.242	35614.855	66681.305	59489.754	105648.773	46248.777	108041.727	NaN	63588.719	40007.66	30078.838	53845.176
2.6684	NaN	32315.738	41673.422	46928.34	56563.586	45758.617	39232.938	38007.773	NaN	29381.887	36197.266	40152.25	75810.852	63433.285	NaN	50448.805	70532.797	90953.57	38060.934	62665.191	NaN	49922.344	36853.016	31077.078	41431.863
2.8019	NaN	31489.771	55592.758	48381.527	43433.062	42630.121	34971.449	35192.766	NaN	28206.541	39931.812	34726.703	49660.961	51465.855	NaN	39132.039	62423.824	61889.434	35425.18	45921.707	NaN	39320.621	36336.41	34498.203	36142.352
2.9353	NaN	32412.91	68606.719	43053.328	37082.316	NaN	34957.254	31995.244	NaN	29599.279	47728.777	31844.332	41427.523	39523.629	NaN	38768.566	47885.531	43766.922	NaN	40728.426	NaN	35738.473	NaN	39569.508	33416.008
3.0687	NaN	31492.367	62437.883	34017.059	35277.289	NaN	34329.402	31578.771	NaN	NaN	64833.426	NaN	37233.27	33780.688	NaN	NaN	38545.344	38504.238	NaN	37474.082	NaN	32511.568	NaN	53302.695	33587.66
3.2021	NaN	34734.242	45222.773	30480.008	34193.93	NaN	34128.375	NaN	NaN	NaN	84190.984	NaN	35201.336	30400.572	NaN	NaN	35580.816	36071.211	NaN	36811.781	NaN	NaN	NaN	58702.793	NaN
3.3356	NaN	NaN	37500.191	29832.863	NaN	NaN	33549.055	NaN	NaN	NaN	78251.672	NaN	33724.082	29965.695	NaN	NaN	33681.027	34544.355	NaN	36035.395	NaN	NaN	NaN	46707.207	NaN
3.469	NaN	NaN	34670.516	28684.623	NaN	NaN	33753.184	NaN	NaN	NaN	59494.887	NaN	32371.541	31829.254	NaN	NaN	34518.145	33639.258	NaN	34548.586	NaN	NaN	NaN	37547.574	NaN
3.6024	NaN	NaN	NaN	29016.75	NaN	NaN	NaN	NaN	NaN	NaN	43960.656	NaN	32983.074	NaN	NaN	NaN	32775.66	NaN	NaN	36197.008	NaN	NaN	NaN	33993.758	NaN
3.7358	NaN	NaN	NaN	28642.555	NaN	NaN	NaN	NaN	NaN	NaN	37934.676	NaN	32530.469	NaN	NaN	NaN	NaN	NaN	NaN	NaN	NaN	NaN	NaN	31460.027	NaN
3.8692	NaN	NaN	NaN	27278.352	NaN	NaN	NaN	NaN	NaN	NaN	36666.055	NaN	NaN	NaN	NaN	NaN	NaN	NaN	NaN	NaN	NaN	NaN	NaN	31496.617	NaN
4.0027	NaN	NaN	NaN	NaN	NaN	NaN	NaN	NaN	NaN	NaN	35245.145	NaN	NaN	NaN	NaN	NaN	NaN	NaN	NaN	NaN	NaN	NaN	NaN	31375.096	NaN
4.1361	NaN	NaN	NaN	NaN	NaN	NaN	NaN	NaN	NaN	NaN	34335.949	NaN	NaN	NaN	NaN	NaN	NaN	NaN	NaN	NaN	NaN	NaN	NaN	31129.199	NaN
4.2695	NaN	NaN	NaN	NaN	NaN	NaN	NaN	NaN	NaN	NaN	35009.324	NaN	NaN	NaN	NaN	NaN	NaN	NaN	NaN	NaN	NaN	NaN	NaN	30769.258	NaN
4.4029	NaN	NaN	NaN	NaN	NaN	NaN	NaN	NaN	NaN	NaN	34901.41	NaN	NaN	NaN	NaN	NaN	NaN	NaN	NaN	NaN	NaN	NaN	NaN	29178.703	NaN
4.5363	NaN	NaN	NaN	NaN	NaN	NaN	NaN	NaN	NaN	NaN	NaN	NaN	NaN	NaN	NaN	NaN	NaN	NaN	NaN	NaN	NaN	NaN	NaN	29338.012	NaN
4.6698	NaN	NaN	NaN	NaN	NaN	NaN	NaN	NaN	NaN	NaN	NaN	NaN	NaN	NaN	NaN	NaN	NaN	NaN	NaN	NaN	NaN	NaN	NaN	NaN	NaN
4.8032	NaN	NaN	NaN	NaN	NaN	NaN	NaN	NaN	NaN	NaN	NaN	NaN	NaN	NaN	NaN	NaN	NaN	NaN	NaN	NaN	NaN	NaN	NaN	NaN	NaN
4.9366	NaN	NaN	NaN	NaN	NaN	NaN	NaN	NaN	NaN	NaN	NaN	NaN	NaN	NaN	NaN	NaN	NaN	NaN	NaN	NaN	NaN	NaN	NaN	NaN	NaN
5.07	NaN	NaN	NaN	NaN	NaN	NaN	NaN	NaN	NaN	NaN	NaN	NaN	NaN	NaN	NaN	NaN	NaN	NaN	NaN	NaN	NaN	NaN	NaN	NaN	NaN
5.2035	NaN	NaN	NaN	NaN	NaN	NaN	NaN	NaN	NaN	NaN	NaN	NaN	NaN	NaN	NaN	NaN	NaN	NaN	NaN	NaN	NaN	NaN	NaN	NaN	NaN
5.3369	NaN	NaN	NaN	NaN	NaN	NaN	NaN	NaN	NaN	NaN	NaN	NaN	NaN	NaN	NaN	NaN	NaN	NaN	NaN	NaN	NaN	NaN	NaN	NaN	NaN
5.4703	NaN	NaN	NaN	NaN	NaN	NaN	NaN	NaN	NaN	NaN	NaN	NaN	NaN	NaN	NaN	NaN	NaN	NaN	NaN	NaN	NaN	NaN	NaN	NaN	NaN
5.6037	NaN	NaN	NaN	NaN	NaN	NaN	NaN	NaN	NaN	NaN	NaN	NaN	NaN	NaN	NaN	NaN	NaN	NaN	NaN	NaN	NaN	NaN	NaN	NaN	NaN
