0.00000,13060.617
0.13342,13483.816
0.26684,14626.704
0.40027,16057.858
0.53369,18536.260
0.66711,20440.602
0.80053,19756.650
0.93395,18655.041
1.06737,18224.875
1.20080,17007.541
1.33422,16836.205
1.46764,15781.677
1.60106,16391.867
1.73448,16440.207
1.86791,16734.170
2.00133,15693.943
2.13475,14278.573
2.26817,14412.555
2.40159,13830.135
2.53502,12404.872
2.66844,12551.990
