0.00000,16701.604
0.13342,18206.107
0.26684,22392.400
0.40027,27205.652
0.53369,26475.047
0.66711,24203.604
0.80053,23478.619
0.93395,22681.078
1.06737,20799.057
1.20080,20096.646
1.33422,19369.936
1.46764,19689.697
1.60106,18484.090
1.73448,17585.924
1.86791,17775.627
2.00133,18269.422
2.13475,17109.971
2.26817,15095.473
2.40159,13853.182
2.53502,13042.663
2.66844,12839.669
2.80186,12916.055
