0.0000	33869.5312
0.1334	35144.2578
0.2668	33480.5469
0.4003	32262.6680
0.5337	32642.4531
0.6671	33608.6133
0.8005	34441.6523
0.9340	35092.5625
1.0674	37853.7773
1.2008	47780.7227
1.3342	69693.3828
1.4676	93246.6016
1.6011	87144.3594
1.7345	61966.3125
1.8679	45350.3984
2.0013	38401.3242
2.1347	36055.6484
2.2682	35865.6250
2.4016	37433.8945
