0.00000,11989.166
0.13342,12882.249
0.26684,13454.554
0.40027,14910.023
0.53369,17994.738
0.66711,20299.545
0.80053,19524.537
0.93395,18806.773
1.06737,17228.133
1.20080,15705.399
1.33422,14863.551
1.46764,13857.275
1.60106,13072.640
1.73448,12744.275
1.86791,12665.671
2.00133,12347.366
2.13475,12764.960
2.26817,12829.082
