0.00000,13067.847
0.13342,13444.223
0.26684,14580.294
0.40027,16628.986
0.53369,20179.352
0.66711,21016.959
0.80053,20523.080
0.93395,17604.117
1.06737,17534.473
1.20080,17833.229
1.33422,17031.855
1.46764,18288.078
1.60106,18897.742
1.73448,18797.631
1.86791,17847.219
2.00133,15751.393
2.13475,14893.113
2.26817,13347.640
