0.00000,12931.506
0.13342,13155.268
0.26684,13255.206
0.40027,14039.148
0.53369,16128.120
0.66711,18313.463
0.80053,19439.072
0.93395,17688.561
1.06737,17377.541
1.20080,18178.512
1.33422,20510.799
1.46764,21952.275
1.60106,21010.242
1.73448,20260.689
1.86791,20745.812
2.00133,20296.365
2.13475,21029.760
2.26817,20745.260
2.40159,19101.285
2.53502,18050.520
2.66844,16346.264
2.80186,14698.312
2.93528,13344.277
3.06870,12242.568
3.20212,12771.982
3.33555,12132.321
