0.00000,12178.447
0.13342,15077.451
0.26684,18868.262
0.40027,22242.512
0.53369,21348.225
0.66711,19638.658
0.80053,17733.844
0.93395,17278.430
1.06737,17752.307
1.20080,16591.693
1.33422,16076.387
1.46764,16166.206
1.60106,15048.826
1.73448,14773.997
1.86791,14414.447
2.00133,14276.764
2.13475,13479.596
2.26817,14074.111
2.40159,13849.505
2.53502,13545.357
2.66844,13690.097
2.80186,14248.585
2.93528,13642.229
3.06870,13271.779
3.20212,13497.978
3.33555,12498.280
3.46897,12104.589
3.60239,12386.593
3.73581,12705.844
