0.00000,15054.171
0.13342,15741.098
0.26684,16804.025
0.40027,19911.859
0.53369,21906.416
0.66711,22276.168
0.80053,20868.896
0.93395,18873.385
1.06737,18735.117
1.20080,20100.646
1.33422,22235.002
1.46764,21327.877
1.60106,19783.816
1.73448,18041.217
1.86791,16460.680
2.00133,15676.674
2.13475,14606.625
