0.00000,39997.348
0.13342,39055.922
0.26684,38232.824
0.40027,37596.688
0.53369,36252.414
0.66711,37492.773
0.80053,36901.902
0.93395,37401.879
1.06737,36684.777
1.20080,37493.023
1.33422,37648.301
1.46764,38188.754
1.60106,38351.809
1.73448,40003.141
1.86791,40622.047
2.00133,42070.883
2.13475,48223.508
2.26817,56872.438
2.40159,81437.156
2.53502,129582.945
2.66844,160383.484
2.80186,129453.047
2.93528,79870.492
3.06870,55667.000
