0.0000	35068.9766
0.1334	33419.9609
0.2668	32691.4727
0.4003	33769.6641
0.5337	32826.7656
0.6671	30927.5801
0.8005	35412.2109
0.9340	36546.3711
1.0674	35587.9062
1.2008	39085.7969
1.3342	46158.7109
1.4676	69208.7344
1.6011	108660.1328
1.7345	108906.6406
1.8679	75934.6953
2.0013	54282.8789
2.1347	44354.3359
2.2682	40500.8008
2.4016	39674.2969
