0.0000	28553.6152
0.1334	27855.0469
0.2668	29163.8711
0.4003	29549.6074
0.5337	28758.0527
0.6671	28381.7246
0.8005	30228.5527
0.9340	30127.8789
1.0674	33506.7383
1.2008	39399.4727
1.3342	49798.6172
1.4676	58315.3828
1.6011	55642.4219
1.7345	40885.2070
1.8679	33018.5234
2.0013	30554.5684
2.1347	29825.7695
2.2682	30459.6094
