0.0000	13764.1729
0.1334	14896.6016
0.2668	14326.2520
0.4003	15325.7246
0.5337	18110.2344
0.6671	20425.9531
0.8005	19861.7422
0.9340	17835.6816
1.0674	16306.9658
1.2008	15611.2305
1.3342	14921.0635
1.4676	12941.0391
1.6011	12235.8105
1.7345	11224.3633
1.8679	11105.3330
2.0013	11757.0615
2.1347	11734.8467
2.2682	11785.0303
