0.0000	13875.5273
0.1334	13694.8174
0.2668	14852.8223
0.4003	17545.8594
0.5337	20406.1152
0.6671	19903.0078
0.8005	18806.2070
0.9340	18659.6914
1.0674	18668.2754
1.2008	16425.1680
1.3342	15430.6045
1.4676	15573.0967
1.6011	15516.5850
1.7345	16035.6592
1.8679	14515.1465
2.0013	14423.7520
2.1347	14232.1201
2.2682	14630.7393
2.4016	13631.6719
2.5350	13860.1045
2.6684	13739.9834
2.8019	13998.9316
2.9353	13669.3428
