0.00000,36433.984
0.13342,37715.738
0.26684,38146.371
0.40027,36968.109
0.53369,34772.277
0.66711,36974.621
0.80053,36295.836
0.93395,40355.777
1.06737,47600.340
1.20080,71465.695
1.33422,116946.312
1.46764,132061.531
1.60106,94596.242
1.73448,60543.176
1.86791,45059.484
