0.0000	12967.6006
0.1334	13487.5791
0.2668	14522.1797
0.4003	16776.2441
0.5337	19017.7715
0.6671	20764.6719
0.8005	20469.8379
0.9340	18477.4316
1.0674	17819.3945
1.2008	16987.7734
1.3342	15153.0537
1.4676	14571.6045
1.6011	13364.5752
1.7345	14096.8750
1.8679	14345.5078
2.0013	13929.6670
2.1347	14844.2500
2.2682	14465.8711
2.4016	14275.0654
2.5350	14476.2451
2.6684	14622.3789
