x	Y_20180514_15338_c1_10_8g	Y_20180514_15338_c1_13_2g	Y_20180514_15338_c1_14_2g	Y_20180514_15338_c1_14_4g	Y_20180514_15338_c1_29_1g	Y_20180514_15338_c1_6_8g	Y_20180514_15338_c1_6_9g	Y_20180514_15338_c1_8_12g	Y_20180514_15338_c1_9_8g
0	33429.531	30477.594	34778.074	30667.168	32451.701	29753.496	31731.781	31486.67	32321.945
0.1334	32834.859	31227.656	34963.309	30361.34	31055.34	29945.676	30883.623	31346.555	31478.865
0.2668	31907.736	31303.006	33931.68	30455.029	31434.824	29763.869	30731.803	30317.902	32399.365
0.4003	33214.73	31635.824	34499.535	31174.105	32461.877	30583.504	30861.125	30399.957	31700.635
0.5337	32785.02	32709.129	33252.457	31277.18	32453.818	30874.92	30572.883	31662.947	32821.031
0.6671	32754.428	32327.178	34246.734	31372.65	31572.057	30501.148	31165.127	31750.828	33374.57
0.8005	33361.023	33638.992	33322.539	30903.311	31788.307	30328.338	31482.51	33435.207	32778.16
0.934	33034.352	33552.359	32859.121	31156.484	32167.342	32038	30672.305	32729.223	33163.402
1.0674	34155.27	34229.387	33796.215	32890.266	33045.676	31846.898	31180.764	31946.076	33236.031
1.2008	34080.207	34124.473	32373.336	32529.455	34794.043	32582	31879.342	30913.523	34071.164
1.3342	34096.402	32032.086	31627.064	32169.699	34151.164	31416.346	32011.656	31052.746	33169.824
1.4676	34524.094	32503.086	33790.02	33108.238	34148.93	31118.875	30736.939	31306.264	33582.988
1.6011	34803.426	33205.773	36207.746	34360.137	34445.691	31677.9	32317.021	31131.691	34357.887
1.7345	36194.289	33596.914	33509.754	33813.031	34019.145	31354.775	32075.49	31742.889	34768.77
1.8679	36270.883	34673.492	34454.477	33850.445	33744.875	30446.771	32365.994	32539.836	35134.246
2.0013	35747.105	33794.824	34980.199	33973.145	32674.25	30929.734	32418.678	32301.543	34882.887
2.1348	36588.781	33772.293	36196.367	32064.113	33156.828	30419.236	30666.316	31550.748	32694.834
2.2682	37083.812	34983.32	41178.523	33118.355	34369.996	29812.717	32868.457	31639.537	34161
2.4016	36623.426	36102.59	49216.164	32565.994	34062.035	29817.008	31886.135	32493.639	34164.836
2.535	37105.164	35185.348	63660.602	33379.07	32348.225	29800.529	31979.629	30845.211	33474.57
2.6684	36146.758	34851.809	64658.445	32174.422	33836.004	31694.049	32330.389	31226.322	33473.934
2.8019	36257.992	35431.039	49245.844	33480.965	36021.973	31585.328	33235.438	33648.41	33215.785
2.9353	36745.727	38396.078	41661.703	36754.941	37937.34	31208.244	31455.525	33062.586	34457.465
3.0687	40128.879	44611.551	36864.172	47674.027	40500.102	33829.375	31900.344	33413.645	34500.332
3.2021	47504.047	46636.738	36160.363	64769.312	47898.34	40370.73	31082.047	40167.852	38049.133
3.3356	62193.648	43154.191	35720.969	83009.211	53358.355	47313.988	34301.297	48164.52	46496.562
3.469	70402.234	37772.688	34448.273	73310.477	47794.684	47602.113	34732.547	58416.113	53127.82
3.6024	60242.137	35660.281	NaN	52582.48	39597.918	40752.57	35041.668	56061.293	51918.457
3.7358	45204.055	36600.234	NaN	42442.48	34012.234	33275.637	37838.621	44487.262	51065.766
3.8692	39355.566	35794.09	NaN	37853.191	33022.781	30351.49	41056.93	39125.168	48170.938
4.0027	35202.559	37378.598	NaN	34393.445	33150.957	30140.484	48253.34	36212.855	41330.23
4.1361	33617.688	37258.84	NaN	33889.875	32388.404	28576.676	46037.609	35451.836	37495.516
4.2695	33635.676	35987.906	NaN	32892.582	31634.482	NaN	39193.172	33354.297	36043.66
4.4029	33292.582	NaN	NaN	31324.762	32438.158	NaN	35869.305	31903	34947.461
4.5363	NaN	NaN	NaN	NaN	NaN	NaN	33803.945	NaN	34501.008
4.6698	NaN	NaN	NaN	NaN	NaN	NaN	32866.156	NaN	NaN
4.8032	NaN	NaN	NaN	NaN	NaN	NaN	32229.268	NaN	NaN
4.9366	NaN	NaN	NaN	NaN	NaN	NaN	31804.035	NaN	NaN
5.07	NaN	NaN	NaN	NaN	NaN	NaN	31144.711	NaN	NaN
5.2035	NaN	NaN	NaN	NaN	NaN	NaN	30586.445	NaN	NaN
5.3369	NaN	NaN	NaN	NaN	NaN	NaN	30453.246	NaN	NaN
5.4703	NaN	NaN	NaN	NaN	NaN	NaN	31941.463	NaN	NaN
