0.00000,32576.467
0.13342,33471.336
0.26684,32893.293
0.40027,32875.465
0.53369,33309.492
0.66711,34278.258
0.80053,34534.621
0.93395,33523.156
1.06737,34581.281
1.20080,34678.109
1.33422,36401.086
1.46764,36099.875
1.60106,38189.094
1.73448,43397.559
1.86791,58968.898
2.00133,88277.789
2.13475,112656.453
2.26817,92304.578
2.40159,63353.168
2.53502,52504.473
2.66844,48497.355
