X,Y
0.00000,12681.498
0.13342,13622.469
0.26684,14240.113
0.40027,17639.090
0.53369,20642.664
0.66711,20907.664
0.80053,21899.021
0.93395,21379.309
1.06737,19181.299
1.20080,17001.785
1.33422,16370.205
1.46764,15111.497
1.60106,13793.468
1.73448,13747.438
