x	Y_20180130_15100b_1_4g	Y_20180130_15100b_11_8g	Y_20180130_15100b_12_11g	Y_20180130_15100b_15_11g	Y_20180130_15100b_18_13g	Y_20180130_15100b_19_14g	Y_20180130_15100b_19_5g	Y_20180130_15100b_2_10g	Y_20180130_15100b_21_9g	Y_20180130_15100b_22_18g	Y_20180130_15100b_3_9g	Y_20180130_15100b_6_1g	Y_20180130_15100b_7_8g
0	12163.893	12708.05	10887.322	12474.837	11785.491	12014.749	11226.695	13351.877	13032.358	11759.035	12067.034	12067.906	11234.366
0.1334	12519.679	13553.779	11536.71	13573.399	12095.335	12074.915	12890.83	14808.276	14973.468	12188.025	12854.935	13613.447	12935.944
0.2668	13768.895	13706.507	12977.95	14538.944	12688.561	14944.57	15120.77	16208.322	17191.035	13607.09	16731.441	15000.919	15130.281
0.4003	15719.5	15155.959	16095.093	18309.566	13519.456	18569.254	18629.855	18779.133	19986.777	15616.935	21255.48	17564.682	18699.383
0.5337	18219.711	19239.264	16360.977	21586.191	14692.279	20735.016	22228.641	18155.113	19588.654	16280.529	25501.244	18858.84	19406.545
0.6671	17460.441	21890.971	15247.824	20898.215	15130.084	20542.219	20980.441	17464.895	16169.054	15124.195	21737.807	16757.791	17989.855
0.8005	15271.656	21122.555	14127.483	18591.441	15557.942	18694.924	18877.506	15577.018	15416.392	14651.524	19147.045	15645.269	16249.812
0.934	13532.722	19208.381	13229.721	16151.293	15077.906	17537.697	18898.643	15706.726	14629.829	13719.527	16675.582	15796.792	14188.856
1.0674	12921.189	18166.051	12454.822	15652.836	14117.638	16914.053	17933.811	14230.099	14334.631	12188.271	15432.467	15097.699	13472.593
1.2008	12510.811	15955.562	13038.047	15403.117	14296.378	16251.649	18292.172	14325.013	13980.071	12488.304	16266.955	14207.792	14988.548
1.3342	13404.43	16204.471	12998.074	14670.744	14405.653	16303.123	16648.818	16504.797	13473.627	12703.029	15602.453	14535.555	13686.785
1.4676	13440.939	15206.161	13756.97	13781.521	14752.659	16043.025	15934.499	16009.9	15224.301	12103.152	17358.133	14182.546	13504.569
1.6011	12988.492	14824.695	14562.312	13996.286	14617.342	15455.062	15686.504	15652.688	14345.342	11870.42	17323.475	13511.993	13689.168
1.7345	12692.286	14600.647	13478.867	14961.475	14524.74	14866.229	14594.673	16240.393	14500.016	12367.998	16495.176	14184.955	13219.219
1.8679	13924.834	13906.734	12346.294	14092.979	15797.349	14034.951	14588.852	14510.687	15152.913	12897.979	16246.956	14663.688	13932.02
2.0013	13578.131	15245.895	11925.405	13038.402	15761.661	14571.668	14427.904	15183.641	15297.055	13338.981	16154.449	15408.465	13620.197
2.1348	13786.834	16331.515	11872.941	14017.54	15552.747	13757.764	14706.773	15346.842	16036.019	13059.832	16111.911	15940.003	12900.694
2.2682	12867.871	16646.336	13122.871	13441.407	15663.098	14654.245	14161.077	15238.189	15422.936	13108.039	17164.512	15585.913	12311.351
2.4016	11930.783	16257.148	13345.552	13345.358	15284.32	15850.922	13869.126	15073.853	15162.07	13474.559	18242.768	15340.421	12443.674
2.535	11672.324	15707.646	13301.747	13569.699	15972.659	17872.027	14291.203	15262.901	14616.659	14122.086	17507.301	15002.394	12191.702
2.6684	11641.983	15846.622	13217.356	13755.567	14761.702	16806.855	14450.378	14449.553	14149.547	14800.278	16519.293	14510.226	13155.227
2.8019	11294.755	16110.82	13178.737	13383.886	14772.829	15028.633	14070.134	13572.706	14743.291	14342.144	15555.296	14551.505	13128.947
2.9353	11428.825	14369.747	12622.637	13032.535	14254.551	14030.347	13625.937	13081.22	15300.475	13220.535	15290.09	14782.929	12054.618
3.0687	11308.726	13512.388	12542.63	13219.58	13459.937	13215.504	13680.676	13042.477	13961.016	13699.475	16128.902	14218.019	12176.965
3.2021	11862.25	13313.032	11894.983	13681.195	12928.455	13384.229	14004.958	NaN	12582.531	13259.448	17473.398	13532.677	12053.105
3.3356	11197.956	12483.864	12223.372	14134.745	12175.837	13583.055	NaN	NaN	12791.439	12996.306	17331.705	13853.437	NaN
3.469	NaN	12096.379	13194.563	14866.28	12458.333	13480.226	NaN	NaN	12995.582	12688.745	NaN	13464.54	NaN
3.6024	NaN	NaN	12798.503	NaN	12982.601	13076.263	NaN	NaN	12967.88	NaN	NaN	NaN	NaN
3.7358	NaN	NaN	NaN	NaN	NaN	NaN	NaN	NaN	NaN	NaN	NaN	NaN	NaN
3.8692	NaN	NaN	NaN	NaN	NaN	NaN	NaN	NaN	NaN	NaN	NaN	NaN	NaN
4.0027	NaN	NaN	NaN	NaN	NaN	NaN	NaN	NaN	NaN	NaN	NaN	NaN	NaN
4.1361	NaN	NaN	NaN	NaN	NaN	NaN	NaN	NaN	NaN	NaN	NaN	NaN	NaN
4.2695	NaN	NaN	NaN	NaN	NaN	NaN	NaN	NaN	NaN	NaN	NaN	NaN	NaN
4.4029	NaN	NaN	NaN	NaN	NaN	NaN	NaN	NaN	NaN	NaN	NaN	NaN	NaN
4.5363	NaN	NaN	NaN	NaN	NaN	NaN	NaN	NaN	NaN	NaN	NaN	NaN	NaN
4.6698	NaN	NaN	NaN	NaN	NaN	NaN	NaN	NaN	NaN	NaN	NaN	NaN	NaN
4.8032	NaN	NaN	NaN	NaN	NaN	NaN	NaN	NaN	NaN	NaN	NaN	NaN	NaN
4.9366	NaN	NaN	NaN	NaN	NaN	NaN	NaN	NaN	NaN	NaN	NaN	NaN	NaN
5.07	NaN	NaN	NaN	NaN	NaN	NaN	NaN	NaN	NaN	NaN	NaN	NaN	NaN
5.2035	NaN	NaN	NaN	NaN	NaN	NaN	NaN	NaN	NaN	NaN	NaN	NaN	NaN
5.3369	NaN	NaN	NaN	NaN	NaN	NaN	NaN	NaN	NaN	NaN	NaN	NaN	NaN
