0.0000	16136.2041
0.1334	17842.1191
0.2668	20276.4219
0.4003	23844.8027
0.5337	23934.8633
0.6671	24826.4199
0.8005	25908.0547
0.9340	25084.5176
1.0674	22493.8730
1.2008	20377.8184
1.3342	18122.2852
1.4676	15939.3887
1.6011	15158.2363
1.7345	14976.6143
1.8679	14593.0742
2.0013	14488.7637
2.1347	15229.8301
2.2682	14595.3086
