0.00000,11637.535
0.13342,12804.845
0.26684,15274.070
0.40027,21901.648
0.53369,27454.227
0.66711,27594.189
0.80053,22665.535
0.93395,19246.801
1.06737,18476.346
1.20080,19357.379
1.33422,20004.273
1.46764,20515.955
1.60106,19852.984
1.73448,19252.617
1.86791,17430.734
2.00133,15357.558
2.13475,13429.863
2.26817,12842.545
2.40159,12646.430
2.53502,13593.741
2.66844,13192.364
2.80186,13563.546
2.93528,14909.348
3.06870,14654.486
3.20212,14603.166
3.33555,13996.493
3.46897,14267.212
3.60239,13876.989
