0.00000,10995.445
0.13342,11991.598
0.26684,14617.926
0.40027,19265.502
0.53369,23707.930
0.66711,23301.988
0.80053,22298.520
0.93395,20542.557
1.06737,20327.430
1.20080,20438.754
1.33422,19482.238
1.46764,19426.629
1.60106,19982.846
1.73448,18354.824
1.86791,17101.227
2.00133,16941.379
2.13475,15660.809
2.26817,16271.422
2.40159,16058.047
2.53502,16818.752
2.66844,17165.000
2.80186,17423.117
2.93528,17111.242
3.06870,17571.924
3.20212,17772.855
3.33555,16573.033
3.46897,14663.896
3.60239,13970.563
3.73581,13229.916
3.86923,13190.739
