x	Y_20180514_15338_c2_1_15g	Y_20180514_15338_c2_12_11g	Y_20180514_15338_c2_19_6g	Y_20180514_15338_c2_23_11g	Y_20180514_15338_c2_26_3g	Y_20180514_15338_c2_29_5g	Y_20180514_15338_c2_30_6g	Y_20180514_15338_c2_33_1g	Y_20180514_15338_c2_36_3g	Y_20180514_15338_c2_8_7g
0	35285.3516	33956.6836	33547.5781	28354.1836	31891.5137	35254.7617	27467.7168	34396.9102	34018.7461	34065.4648
0.1334	33065.707	32829.4297	33717.3594	28605.2949	31584.2695	33357.4922	28467	35123.4375	34514.8906	32483.3203
0.2668	33504.1289	35937.8867	34052.6875	28021.5859	33007.3945	33797.6641	28139.2559	34077.5039	36863.7734	31846.2109
0.4003	33924.2734	35828.1055	32792.293	28860.293	32037.7012	33638.9766	28831.418	33159.3828	35926.1875	32518.873
0.5337	33253.9766	34705.4141	34588.1562	29488.9082	34314.3594	32503.1719	29019.1152	32442.6387	35701.8008	33931.8555
0.6671	33328.3516	35077.2344	34691.0508	29175.2422	33121.8555	32376.2207	28811.9082	31849.3164	35280.125	33961.4492
0.8005	32495.4004	34475	33294.7383	29471.5996	32904.6797	32514.6191	29336.0957	32677.25	36007.3242	33968.418
0.934	33710.8945	34883.4805	32831.5156	30185.2812	31298.0645	32147.5547	29627.1953	32765.2637	35114.543	34141.5898
1.0674	35349.0195	36108.2188	32499.9805	29152.959	33130.3633	33800.8477	29097.7188	31839.0352	34281.8359	33042.0508
1.2008	33359.2617	34729.7852	33053.4883	29439.6621	32770.2734	33359.3984	28789.334	32974.6758	36826.2266	33279.8398
1.3342	33361.5	33734.7969	33748.8906	29441.2656	31955.1035	33526.0938	29225.3281	33406.0469	36474.4141	34767.6758
1.4676	33567.7812	35155.9375	34551.457	29247.416	32187.459	35432.4648	29180.5508	32265.7539	35628.2031	33119.6016
1.6011	31976.8848	34780.4844	34340.2148	29692.5801	31012.8496	33800.5586	29215.6582	32396.4219	36184.3398	33543.2852
1.7345	33201.543	33629.1055	32143.6543	29667.6562	31906.4453	33741.0117	29387.0703	31936.7207	37198.6484	33141.3633
1.8679	34791.543	33640.1172	33121.3438	31049.5293	31938.6836	33542.4258	27481.8418	32274.6309	36064.2266	34138.2734
2.0013	32857.7422	34180.2461	33404.5938	31133.4141	31722.6426	33530.9844	27696.9004	31958.9121	36414.7773	33878.1484
2.1347	34071.3672	34050.3516	32990.3711	28540.3652	31541.5508	32393.3281	28272.7012	32728.0957	35856.8086	34172.5938
2.2682	33897.6562	34523.6797	33031.1094	28356.1074	30573.9883	32977.9883	28167.5684	34904.3594	37415.4141	35541.2539
2.4016	33502.0312	35743.5391	34269.207	29666.0234	31463.0234	33012.9414	27853.3633	34517.5547	36563.0898	35705.6641
2.535	32981.9023	35617.8398	33497.6836	29375.7246	32864.0586	33813.9688	28192.4102	34222.7656	37290.4453	33806.2109
2.6684	34986.3203	33780.0781	33629.1367	29198.8672	32818.5156	33053.2578	26764.0957	34199.2031	36856	35352.9453
2.8019	34498.1211	34252.5195	34323.6641	27642.6797	32945.2812	33078.8594	28346.4473	35290.7812	34910.0469	38830.4844
2.9353	33417.875	35484.6602	38740.8008	29696.0254	33929.4102	33193.5508	29479.125	35601.0156	37521.7695	43878.6445
3.0687	34568.4922	42048.5039	42952.3906	29695.5488	34494.2656	32556.2988	30093.4453	37155.6172	39155.2227	56585.75
3.2021	35820.0078	53512.3477	53966.2578	31534.0957	36847.4844	35482.7148	33459.9297	42714.418	46810.7578	92114.9062
3.3355	37620.3477	87028.5469	57284.5273	30475.2363	47263.2812	37749.7266	42168.0195	53855.3164	61578.9023	137782.9219
3.469	40341.1094	110045.7031	50556.8828	34660.8164	70822.1562	44485.8672	63238.5781	74979.9297	96712.125	144796.9375
3.6024	53182.9336	88851.7422	41314.1562	40313.5977	84008.0156	58579.4805	99678.9688	88249.8281	144098.6094	101513.5938
3.7358	80689.3438	59387.375	36254.2227	55668.1523	66726.0469	65481.4844	108254.6641	76908.5469	145381.5312	64341.8477
3.8692	109327.6016	43602.2734	34568.2344	77374.8125	44218.7812	54731.8789	74625.3359	51226.6562	93310.5469	47850.3281
4.0027	104176.1094	40108.6094	35040.7852	78738.6719	38465.6797	43395.2773	47532.3359	41082.6328	57046.8359	42563.8281
4.1361	77515.1641	35628.8789	NaN	60521.793	NaN	38767.2852	35418.3164	36267.6836	42169.8398	37999.3359
4.2695	56051.8828	35297.3672	NaN	43544.1484	NaN	34502.2617	31807.9434	34753.6523	38672.332	37523.3477
4.4029	42675.1641	NaN	NaN	34827.7695	NaN	34276.0312	NaN	35017.1367	37134.1484	NaN
4.5363	NaN	NaN	NaN	NaN	NaN	NaN	NaN	34750.8672	36905.5859	NaN
4.6698	NaN	NaN	NaN	NaN	NaN	NaN	NaN	NaN	35156.0312	NaN
4.8032	NaN	NaN	NaN	NaN	NaN	NaN	NaN	NaN	NaN	NaN
4.9366	NaN	NaN	NaN	NaN	NaN	NaN	NaN	NaN	NaN	NaN
5.07	NaN	NaN	NaN	NaN	NaN	NaN	NaN	NaN	NaN	NaN
5.2035	NaN	NaN	NaN	NaN	NaN	NaN	NaN	NaN	NaN	NaN
5.3369	NaN	NaN	NaN	NaN	NaN	NaN	NaN	NaN	NaN	NaN
5.4703	NaN	NaN	NaN	NaN	NaN	NaN	NaN	NaN	NaN	NaN
