0.00000,15534.958
0.13342,14880.817
0.26684,16356.253
0.40027,18244.971
0.53369,21543.723
0.66711,24190.164
0.80053,24341.619
0.93395,22832.057
1.06737,21092.926
1.20080,20920.355
1.33422,22627.348
1.46764,22134.348
1.60106,18653.146
1.73448,18553.902
1.86791,17384.662
2.00133,15603.096
2.13475,14235.387
2.26817,14107.041
2.40159,13430.699
2.53502,12329.447
