0.0000	35417.0078
0.1334	36087.3750
0.2668	35657.3906
0.4003	35842.9961
0.5337	35462.3711
0.6671	35583.6289
0.8005	36815.9375
0.9340	36062.1211
1.0674	35982.8867
1.2008	39129.9141
1.3342	40552.3320
1.4676	45215.6836
1.6011	55059.9375
1.7345	84517.5781
1.8679	136429.5781
2.0013	159364.6562
2.1347	120733.9219
2.2682	70640.2422
2.4016	49481.1953
2.5350	41211.6367
2.6684	38238.4961
2.8019	35586.2695
