x	Y_20180130_15109_10_1g	Y_20180130_15109_2_15g	Y_20180130_15109_3_3g	Y_20180130_15109_5_2g	Y_20180130_15109_5_6g
0	38195.766	35745.781	29985.975	33241.281	37877.203
0.1334	36412.488	36607.379	29224.492	34405.812	38235.234
0.2668	37931.266	35977.582	29856.459	34664.586	36563.398
0.4003	36891.246	36996.746	30307.812	36252.688	36958.367
0.5337	36801.406	38258.32	29860.295	36360.254	37946.609
0.6671	36645.793	38324.168	29889.256	36976.133	37873.309
0.8005	37067.133	37119.445	30501.199	36809.93	38256.516
0.934	38537.871	37750.547	28293.178	36282.91	37852.688
1.0674	37795.879	38567.047	29245.572	36749.809	35281.871
1.2008	38283.758	39948.051	28417.611	34929.223	36778.805
1.3342	38058.473	39866.73	29322.066	36035.426	36742.562
1.4676	38296.184	41218.008	28799.133	35876.391	37658.688
1.6011	38225.395	42084.879	28312.039	35346.977	35641.574
1.7345	39794.105	41408.121	29689.109	35466.906	35892.309
1.8679	40197.848	39873.762	29057.75	37253.594	36799.285
2.0013	39279.426	38892.363	30265.082	38663.312	39511.008
2.1348	44419.859	38543.832	30294.52	41514.633	40411.953
2.2682	47239.652	40074.438	31529.604	47785.492	41467.586
2.4016	59752.926	45688.891	34043.684	72040.625	51011.309
2.535	90000.766	56916.344	38406.852	123260.898	67850.094
2.6684	113012.133	82204.969	51659.367	184477	104334.281
2.8019	99384.977	118040.492	69502.828	177874.125	134295.641
2.9353	65192.098	122686.273	63373.867	112666.32	124296.273
3.0687	48527.312	87724.516	44880.957	65233.645	84812.688
3.2021	43521.461	61585.152	36994.094	NaN	57689.059
3.3356	NaN	NaN	31423.721	NaN	48234.902
3.469	NaN	NaN	NaN	NaN	44676.887
3.6024	NaN	NaN	NaN	NaN	NaN
3.7358	NaN	NaN	NaN	NaN	NaN
3.8692	NaN	NaN	NaN	NaN	NaN
4.0027	NaN	NaN	NaN	NaN	NaN
4.1361	NaN	NaN	NaN	NaN	NaN
4.2695	NaN	NaN	NaN	NaN	NaN
4.4029	NaN	NaN	NaN	NaN	NaN
4.5363	NaN	NaN	NaN	NaN	NaN
