0.00000,14443.229
0.13342,14456.479
0.26684,15666.799
0.40027,19800.566
0.53369,21323.527
0.66711,21266.381
0.80053,19065.984
0.93395,16396.811
1.06737,15123.894
1.20080,15134.295
1.33422,14021.697
1.46764,14209.494
