x	Y_20180514_15325_1_4g	Y_20180514_15325_10_10g	Y_20180514_15325_10_5g	Y_20180514_15325_11_13g	Y_20180514_15325_12_1g	Y_20180514_15325_13_1g	Y_20180514_15325_13_3g	Y_20180514_15325_14_5g	Y_20180514_15325_15_1g	Y_20180514_15325_15_4g	Y_20180514_15325_16_3g	Y_20180514_15325_16_5g	Y_20180514_15325_16_6g	Y_20180514_15325_17_10g	Y_20180514_15325_17_4g	Y_20180514_15325_17_5g	Y_20180514_15325_18_1g	Y_20180514_15325_18_5g	Y_20180514_15325_18_6g	Y_20180514_15325_20_6g	Y_20180514_15325_20_7g	Y_20180514_15325_21_3g	Y_20180514_15325_22_3g	Y_20180514_15325_22_5g	Y_20180514_15325_22_9g	Y_20180514_15325_24_2g	Y_20180514_15325_25_1g	Y_20180514_15325_25_5g	Y_20180514_15325_25_6g	Y_20180514_15325_26_1g	Y_20180514_15325_27_2g	Y_20180514_15325_27_6g	Y_20180514_15325_28_6g	Y_20180514_15325_28_7g	Y_20180514_15325_29_2g	Y_20180514_15325_31_2g	Y_20180514_15325_31_3g	Y_20180514_15325_31_4g	Y_20180514_15325_32_1g	Y_20180514_15325_32_4g	Y_20180514_15325_32_5g	Y_20180514_15325_32_6g	Y_20180514_15325_4_3g	Y_20180514_15325_5_2g	Y_20180514_15325_5_3g	Y_20180514_15325_5_6g	Y_20180514_15325_6_3g	Y_20180514_15325_7_4g	Y_20180514_15325_7_7g	Y_20180514_15325_9_6g
0	32150.6016	36950.4297	34620.0703	33035.8398	33422.5742	33333.6484	34230.5586	34467.0781	32722.6816	33183.9219	34029.2266	34830.9414	29386.2949	29733.4023	32800.918	34630.1719	28988.2441	32835.8945	35029.4961	36733.5586	34514.082	29562.6289	36333.4453	35890.7305	31284.7441	35753.0977	29658.4863	35891.3398	35142.8086	32807.3867	35376.1094	29802.6367	34213.9414	32305.1992	35860.1523	29260.1309	35071.7227	32326	35513.4883	31118.1914	33511.7852	36514.6875	32482.0449	33458.3867	31001.2227	33177.8867	31921.1738	33846.5664	31759.293	29001.1133
0.1334	34543.3906	35584.6406	33457.168	32722.418	33625.7734	32491.0176	35177.0625	33915.8281	32643.5137	32562.6934	33938.1367	35083.0195	30198.5391	30059.4824	33325.5508	33768.1758	28493.8848	33442.8359	33909.3477	36020.707	34211.0781	31315.5762	34275.3438	34660.1953	30776.1094	37233.6758	29182.4863	35378.4453	35896.5273	33550.7812	33745.6211	30012.6543	34460.1289	32243.168	34440.8789	29223.375	34078.9492	31842.248	36230.6094	31832.0527	33847.2969	36222.1406	33015.9375	32232.1465	31237.1621	33959.625	30963.4785	33710.418	32449.3398	30204.2051
0.2668	32953.9531	34870.168	32556.7012	31345.5254	33073.8828	33471.7539	35144.9375	30721.4355	32093.7773	32254.1582	34772.9141	32514.1035	29529.4941	31247.7324	32739.7363	34543.457	27495.8965	31985.1855	34210.6562	36296.8945	33788.3867	30925.7148	35105.9219	34656.75	31546.7012	38337.3203	31548.1152	35237.8125	34650.6211	33720.0859	34834.8359	31997.0449	36614.1055	33272.0703	35495.1094	29999.3125	34332.3867	31844.25	34926.3281	31989.666	32908.0547	36206.2188	33291.7812	34472.9727	31019.7383	34441.6758	31928.166	34440.3047	31847.5	29905.9883
0.4003	34017.3359	34191.0312	34191.3867	31642.1641	33785.1641	33513.5859	34691.8711	31983.9551	32763.877	31058.1328	32148.4883	34358.5391	29495.7305	32130.4824	33055.7422	35114.832	26944.7832	33106.2617	33875.293	36133.8711	33799.1602	30412.1484	35081.1211	33925.0117	33699.4648	36779.6719	32396.3242	35405.2422	37286.4453	33439.6484	34454.5938	33301.4609	35718.7969	32034.1562	34993.3047	30526.1758	36186.6523	31986.4902	35838.7969	31396.6758	34054.7031	36103.9023	32619.6484	32580.7148	31673.5781	31902.8848	32713.1074	34053.5312	31904.6934	30419.4707
0.5337	34637.6328	34909.0156	33836.375	30778.6953	35994.1445	32992.8789	34412.3672	33632.2109	35245.5273	31185.9824	33720.8359	34872.8242	29153.0879	31062.2188	30894.957	34654.0859	26814.373	33215.2656	36088.9297	37245.0273	33279.8008	31247.6895	36150.8125	34180.3828	34067.5625	35756.0781	31506.5469	36261.8438	36156.0234	32700.8047	34583.2305	31805.75	34703.6445	32201.3418	35961.8047	30767.4863	36217.5664	32702.7441	35427.7578	30240.3535	35088.9219	37379.7266	33140.5391	33375.6719	31858.4395	33912.2695	33552.0469	35315.4531	32257.9141	30667.6641
0.6671	34360.3203	35992.2969	33837.3477	31780.0977	35233.8789	32498.7148	34989.1406	35128.4375	34294.7188	32458.7402	32595.4727	35705.7969	30861.6152	31011.3438	31934.0527	35106.0156	26181.2441	33238.3359	36968.875	35387.582	33487.3398	31472.8711	36527.6055	34625.9766	33576.0898	36323.9297	31542.6035	36758.3672	36993.1133	33788.6367	35390.6797	33306.8516	34602.8633	32703.5195	36121.75	30312.1504	36883.6172	32703.5938	34819.0547	30341.8125	33941.5039	37015.9219	32721.3145	32642.5039	31679.207	34409.3594	32918.2422	35299.0391	32762.5938	30830.166
0.8005	34120.4102	35132.7383	33668.2031	31271.627	36181.3711	33080.3516	34442.6367	33982.9883	33279.0039	30465.1602	31599.4023	35969.418	31532.7188	30862.8223	33127.8203	35344.3164	27224.0371	32002.9219	37491.918	36006.6328	33970.2148	31666.9258	37562.3203	34278.1445	33681.2227	36767.5273	31489.9473	36794.5781	36477.3711	33737.625	34819.0938	32348.0605	34446.0547	33935.0781	35449.7891	30869.4727	36088.4023	32263.2422	34970.0469	31474.3594	34757.7695	36202.9844	32582.8828	32482.8867	31421.6016	34080.3516	31538.7305	35591.6445	33404.5312	30013.4766
0.934	34475.6602	32841.3359	34870.8828	31727.123	34531.4258	32106.4668	34666.0703	34088.5156	33969.6602	31818.834	31595.5176	34989.043	31590.9844	31307.6816	33465.8398	35033.8398	27321.3164	31692.7891	36815.5195	36688.1523	32858.043	31223.3926	36737.582	34625.1992	31817.9414	37804.0898	32096.6074	34142.2812	35350.7266	34233.2305	36659.4844	33211.3906	34944.1367	32104.0098	35556.1484	30232.3145	36224.1641	31991.0156	34174.7969	31397.6758	34040.9766	36018.9688	32565.2129	32509.9277	32475.7539	35026.3594	32615.7402	36998.1992	34193.8281	29270.5801
1.0674	34172.0508	32986.3633	33600.4258	32882.8633	36045.918	31531.1523	35497.9688	33219.8789	33983.4492	32348.0762	32399.0605	35608.4922	29623.8594	32619.4512	34717.4531	35812.625	27920.3496	31361.6328	35549.4453	37087.2305	33588.6602	30331.7344	36761.7031	33933.9648	32116.8594	39306.875	31940.6641	37026.957	35384.5391	35185.7617	36539.8477	32817.4219	34911.2266	33766.7969	35595.2617	30799.0859	35706.582	32765.5918	34172.1484	32846.4219	33791.8359	36402.5547	34235.6641	33033.3594	31867.7676	35284	34532.3945	37116.5273	32091.377	30202.7129
1.2008	34216.4219	35758.1523	33664.957	33981.9492	36096.7109	32138.1309	34923.2344	33749.1602	32934.0352	33393.7812	32623.4238	35478.3945	30775.7656	32655.8203	35058.2383	35377.1484	27049.6934	32430.2754	36032.6602	37387.8203	34291.0664	31530.7773	35279.4844	35431.4648	32750.0625	40396.7227	30853.3203	35433.9531	33554.7266	32356.9082	35675.418	32537.2031	33955.1641	33493.3438	34898.8711	31681.7676	34671.6758	33904.2109	33077.207	33061.3711	33294.3438	36575.9258	32597.4883	31920.6719	32063.2305	34953.4961	33649.1758	37661.457	33460.7852	29995.9707
1.3342	34874.1758	34569.8125	34503.2148	33178.6797	35235.8242	32163.584	34489.6797	33776.6641	33037.4453	32579.1562	30976.3574	36876.4297	30966.4805	32706.8496	34884.1758	35110.0781	26336.1758	33222.8945	35564.2305	35906.5039	34380.6172	32342.3047	36266.1953	35145.0078	31128.1348	38357.0469	32178.5996	36965.0938	33449.7148	32807.7422	36393.8008	31418.582	35743.5742	34814.7461	35720.1367	32099.1445	35994.6992	33300.7695	33179.0938	33711.7539	33972.9141	36335.4297	33504.4102	32400.1348	32506.5859	34875.0156	32304.9023	36862.625	33591.7305	28286.0723
1.4676	35029.5352	35574.4414	32330.0859	33706.8359	34504.832	31562.2285	34519.6719	33049.5664	32605.0508	31831.3887	31390.041	37315.0859	29334.6035	31952.4297	31581.5117	34845.9766	27315.0195	33625.8398	36356.7969	35921.8516	32807.1328	34398.8555	33638.2695	35645.8867	31082.2012	38314.3398	32336.4844	35300.207	33870.7852	33337.9727	35448.3945	31746.082	36154.2812	33980.9766	36709.1875	31951.207	35127.4922	34495.6289	32635.1289	32991.2266	33825.5234	34874.0742	32123.3477	33139.1641	32737.3086	36869.4141	32719.7324	35328.9023	33482.8164	27400.9277
1.6011	34087.8477	34685.4453	31961.2246	32286.6113	34043.3555	31737.5801	33578.793	33504.6016	32868.3789	32320.5723	32976.9844	36608.0586	30491.9941	32592.3418	32040.2539	34454.2617	27017.1953	33301.9297	35744.9258	36270.7148	34774.0703	32259.2617	32851.1953	34329.3047	31113.6836	38001.8906	32923.3203	36793.6016	33327.4883	34054.5625	36339.9297	32504.543	36024.0938	36313.8008	35994.582	31968.3828	34234.3594	34798.5273	33382.9688	32722.5527	33293.4375	34994.5078	31637.5156	32694.0332	33789.043	36220.5352	32165.9258	33376.7188	34537.3906	29802.998
1.7345	35554.7891	33670.7773	34168.0898	32725.1406	34900.8203	32226.1621	33506.6367	32295.4023	33445.0352	31571.5586	33362.9883	37823.9023	30274.9785	32292.959	32907.5	34857.043	27708.9531	32594.7598	34569.2969	34254.8672	37514.2539	32419.0645	34826.3281	34825.5586	30688.498	38993.875	32186.7656	37140.6445	34429.0117	33997.3945	35572.1445	32004.4219	33448.1875	35197.9375	35777.5586	32408.8945	35206.707	33785.7266	34264.9648	32182.6406	32501.1738	34605.0117	32312.0547	32319.0547	32027.043	34529.6914	32032.2441	34940.2773	34320.168	31004.625
1.8679	34366.8203	33436.9375	34882.8711	32899.9766	33464.9297	32445.668	33916.1914	33217.5234	33308.8828	32727.6504	33484.8516	40427.2773	29305.0762	31138.4395	32619.1816	34581.5859	27383.584	34273.9531	35360.3555	35342.4297	35362.2344	31078.7324	34130.625	34443	31710.2793	39155.5195	32418.6816	35814.1836	35566.832	32375.2734	36055.5859	33521.5977	34277.418	34660.8945	37374.4688	33284.9297	33514.9258	35176.1055	34539.2422	32214.541	31811.4551	35643.8945	33463.8242	31330.8262	32470.8164	34897.625	31820.9863	36485.9961	34557.2422	29979.8887
2.0013	33258.2031	35435.4375	34889.6562	33120.5703	34394.1875	32939.8398	34164.5898	32475.8027	30862.2168	33538.9102	34209.8594	39805.8008	29132.5938	33044.7383	32642.6875	35025.4727	27524.3906	35744.4805	36924.1719	37478.6445	36139.0703	33316.0039	33956.6484	34723.0703	30888.332	40007.918	33207.8164	36188.2773	35653.0898	33271.6367	38033.8203	34035.7812	33758.5117	33942.8086	37966.6641	33627.8242	35344.9258	38599.2969	33204.1445	32211.1328	31203.8828	35851.8047	35594.2148	32017.2148	35348.3789	36679.7969	32104.9395	35704.4648	35071.043	28229.918
2.1347	33452.1406	35331.4688	36343.1602	32068.4062	34535.0352	34609.0703	34797.4492	32496.2031	33240.6133	34407.6445	34944.4648	43345.5898	29687.9375	33255.3828	33648.9258	35286.7578	28857.8535	34919.9961	36024.5195	36752.3008	35102.2188	33715.7148	35936.9375	37080.4961	29131.2539	40104.6133	34132.1875	37614.9805	36126.8477	32849.4023	40679.5352	33827.125	35393.6992	34887.3672	39130.4297	35906.832	36402.2461	41974.6836	35424.3438	32101.5527	31798.9531	36969.3555	34607.9805	32219.3008	35402.8711	36480.832	33110.3281	36287.75	35033.5625	29045.8926
2.2682	34436.9219	35864.6523	39211.3008	36089.832	33896.6367	36963.3047	35604.8672	32948.668	33906.4531	36091.9961	36833.8711	51881.1055	30246.8281	38827.8906	33407.7852	38219.9375	31564.8965	34924.8281	36156.625	38292.0469	35173.1289	37568.1367	36366.5625	39474.8789	29888.9766	42266.4727	34245.7656	39403.5898	36543.1875	33738.4766	44936.4453	34338.5273	35989.8672	35639.75	40407.6094	35889.7969	36845.3984	51095.125	37410.3984	32805.4336	33588.4922	35850.3125	34771.9336	35427.3867	37881.9805	38164.8906	35221.293	38306.0469	37998.1797	29513.0918
2.4016	35291.8242	37873.3008	46715.2031	38658.0742	35850.3359	37053.9492	35311.6953	34689.4492	35459.9219	41305.3164	41768.5273	58926.8594	30003.4883	54292.9844	33698.7461	37896.5391	38356.3633	34969.5508	39282.3008	38361.6641	36541.9023	45206.7305	39070.5234	42941.2109	29705.7227	46756.8164	36594.2227	42180.0352	38958.7227	35113.2734	58161.625	34057.2461	36694.0781	35006.2891	43065.4492	39589.4609	40876.4648	76230.9141	38480.9023	36108.9102	34431.332	37511.0234	37834.2852	37840.4258	44800.8438	39011.3086	36479.457	41583.4688	43016.0977	31501.1133
2.535	36923.5	40633.2305	62382.3008	43742.7773	43324.5039	44173.832	35201.7461	34664.2031	39683.6836	54702.0938	59552.5312	65220.9531	32161.4336	84139.6406	36096.1797	42502.9414	55845.5977	36192.3164	47001.6641	41536.875	34737.6367	65643	47416.5352	59374.707	30413.998	57540.668	39410.7031	48494.1172	42808.3789	38925.2266	82353.4375	36843.0898	36775.293	39256.8125	45380.25	52332.8828	53824.6836	96896.4531	40424.6562	44519.5234	36203.668	38759.625	41927.7422	48772.9766	54205.8711	42354.1914	40609.8359	44089.5898	56915.0469	32630.5449
2.6684	45895.9766	46339.5703	87581.6016	56714.2461	55669.5195	53340.6719	39934.9219	34863.9453	45886.0039	74162.5781	80967.0703	67909.1406	38386.9883	105448.3359	37924.418	56510.5078	78839.7188	40828.2266	62888.5352	50200.9727	39959.9609	98635.9922	66168	81204.75	34004.7812	86912.6875	47606.3633	65874.625	54523.1992	44682.0039	86767.1797	43028.8711	38983.7578	44247.1992	50570.3945	74943.1328	85341.1016	81879.7109	50964.8633	68263.2422	35855.207	45588.1719	60569.1211	67506.7344	76202.9141	47215.5234	51188.0352	55927.4023	88610.3359	35563.7656
2.8019	65253.2188	63574.75	83477.2656	83425.8906	78805.5625	71737.9844	48730.6484	37180.7383	66077.1406	79158.0469	81666.3047	58504.2266	53531.3516	92671.3203	43613.6445	84373.625	74053.4531	52340.7773	100504.5391	69169.875	43480.8711	113140.6719	86089.7344	85545.2188	35682.2773	142760.1719	66598.1641	98428.5234	73557.8984	56477.3984	65871.2734	64006.3672	42288.1055	62417.1562	65888.2188	88326.7969	135942.8125	54672.1211	73724.5938	100216.9609	41074.0938	60729.7109	78714.3594	88715.6406	87783.0938	64895.3945	81440.7656	88085.2578	103171.6094	47196.9961
2.9353	102073.8281	87376.7188	60135.4805	115227.0781	75566.3984	108936.7891	53940.1562	46507.9609	90508.2344	59255.6016	60722.5703	47852.3398	68687.4219	58735.3672	53346.0859	97869.2188	51133.5391	74887.7031	133368.0625	84078.3047	51703.418	81310.9375	87801.4922	62095.8555	39496.5156	194316.4844	102379.8125	105038.2109	85346.25	67587.7344	46514.2227	84736.0547	54448.8438	100403.75	97577.7188	70228.0078	141974.8594	41886.9883	111406.3828	102292.1875	54571.4375	103122.2812	72075.3672	79082.2188	73481.5078	108679.2266	105228.0156	117323.8125	79097.6406	63446.3672
3.0687	112866.8984	84028.2422	46104.7734	99749.0234	56079.3555	146006.8281	51737.3398	69965.0312	81583.0156	43304.1016	42573.5156	42293.4609	63620.6367	45238.2617	85350.2344	74173.5391	34762.2383	77076.3359	120587.7422	71440.6172	54543.7734	54971.3359	62879.9414	44999.4258	46692.5742	167793.6406	108859.5156	76930.3828	68357.7188	61223.8203	40389.0625	77382	68274.4766	128275.2734	147349.625	47626.5469	93894.7109	36647.1719	117440.8281	70320.7031	72670.9531	159715.8438	53297.957	53153.0938	49000.1211	141143.5781	80319.1719	88740.1328	51356.3477	67457.8359
3.2021	83447.2734	58982.3125	38563.8984	61579.3047	41975.832	122369.6094	42600.9102	91165.9062	56824.375	37146.5742	37118.9961	40503.9336	48298.3281	NaN	119865.7344	51748.6992	NaN	59589.7266	89703.2656	53718.3281	49954.5156	44643.5977	46362.6211	NaN	47939.6133	100045.2344	77769.1328	51005.4961	49393.7422	49556.1445	37270.1836	54867.4453	65776.6172	107086.7031	143852.9688	39651.1055	60594.2383	36399.8203	77015.1953	47234.3203	71334.2109	162244.3281	39380.3633	38681.1562	37563.793	116378.5469	57164.5781	58628.3047	38443.5781	49169.1719
3.3355	55423.0391	43293.3164	37563.8164	43120.1172	40723.4141	74519.4375	39222.0117	84669.1875	40844.5586	34685.7148	37018.9531	NaN	40079.7344	NaN	111808.6172	41681.3086	NaN	44109.3398	84285.5703	43420.5469	46032.8711	NaN	38846.3047	NaN	40907.1445	56584.8008	51688.5469	NaN	41555.9961	42589.0352	NaN	41936.0547	50236.1602	66867.4844	103118.2969	39238.9609	45052.3906	37860.9648	54005.9062	37327.8398	55999.4609	109989.8984	37534.3984	26287.4688	33569.7695	72012.5938	44081.9688	43670.6602	NaN	39043.8438
3.469	43449.707	38499.6836	37103.457	37528.4961	40255.0586	NaN	36765.4297	57460.8047	37741.5	33782.3125	NaN	NaN	34042.7969	NaN	73714.2969	NaN	NaN	36705.3242	NaN	38985.8555	44999.9883	NaN	37133.7422	NaN	34454.6992	44656.2109	40133.7852	NaN	37953.168	39100.8203	NaN	37731.4531	40937.8867	47023.7969	64147.8164	NaN	39098.5977	NaN	42593.7109	35339.2852	45227.1406	65045.2617	36225.3867	NaN	NaN	49768.0117	38155.8125	39177.5156	NaN	36317.5234
3.6024	37583.7773	36339.8945	36706.9492	34217.2852	NaN	NaN	36147.5078	42322.3867	35308.1992	33456.1875	NaN	NaN	31807.332	NaN	50226.2539	NaN	NaN	34192.0195	NaN	38709.0703	43435.1445	NaN	35552.4648	NaN	31048.0547	NaN	NaN	NaN	NaN	38551.9375	NaN	34189.3984	38338.6836	41534.0195	49244.9766	NaN	37813.5391	NaN	41264.4805	NaN	40731.5625	NaN	36520.1016	NaN	NaN	41948.2109	35738.6797	NaN	NaN	NaN
3.7358	NaN	34192.3555	NaN	31903.3047	NaN	NaN	NaN	37974.8047	34186.4062	33117.0703	NaN	NaN	NaN	NaN	39829.5898	NaN	NaN	NaN	NaN	NaN	NaN	NaN	33284.5352	NaN	28738.6562	NaN	NaN	NaN	NaN	36976.0938	NaN	35534.6797	37177.8008	41258.1719	41951.0352	NaN	NaN	NaN	44395.832	NaN	41267.4688	NaN	NaN	NaN	NaN	38372.1133	NaN	NaN	NaN	NaN
3.8692	NaN	33791.8398	NaN	32557.9492	NaN	NaN	NaN	36491.5117	NaN	NaN	NaN	NaN	NaN	NaN	35811.5547	NaN	NaN	NaN	NaN	NaN	NaN	NaN	NaN	NaN	NaN	NaN	NaN	NaN	NaN	35574.457	NaN	NaN	37607.1836	41493.7227	38570.207	NaN	NaN	NaN	NaN	NaN	NaN	NaN	NaN	NaN	NaN	37886.0938	NaN	NaN	NaN	NaN
4.0027	NaN	32792.3867	NaN	NaN	NaN	NaN	NaN	36380.4414	NaN	NaN	NaN	NaN	NaN	NaN	34291.2109	NaN	NaN	NaN	NaN	NaN	NaN	NaN	NaN	NaN	NaN	NaN	NaN	NaN	NaN	34375.3906	NaN	NaN	35957.6055	38888.207	39679.3789	NaN	NaN	NaN	NaN	NaN	NaN	NaN	NaN	NaN	NaN	36499.5742	NaN	NaN	NaN	NaN
4.1361	NaN	NaN	NaN	NaN	NaN	NaN	NaN	36314.7695	NaN	NaN	NaN	NaN	NaN	NaN	34087.875	NaN	NaN	NaN	NaN	NaN	NaN	NaN	NaN	NaN	NaN	NaN	NaN	NaN	NaN	34989.9453	NaN	NaN	NaN	NaN	39141.5	NaN	NaN	NaN	NaN	NaN	NaN	NaN	NaN	NaN	NaN	35729.8594	NaN	NaN	NaN	NaN
4.2695	NaN	NaN	NaN	NaN	NaN	NaN	NaN	NaN	NaN	NaN	NaN	NaN	NaN	NaN	NaN	NaN	NaN	NaN	NaN	NaN	NaN	NaN	NaN	NaN	NaN	NaN	NaN	NaN	NaN	34778.7891	NaN	NaN	NaN	NaN	NaN	NaN	NaN	NaN	NaN	NaN	NaN	NaN	NaN	NaN	NaN	NaN	NaN	NaN	NaN	NaN
4.4029	NaN	NaN	NaN	NaN	NaN	NaN	NaN	NaN	NaN	NaN	NaN	NaN	NaN	NaN	NaN	NaN	NaN	NaN	NaN	NaN	NaN	NaN	NaN	NaN	NaN	NaN	NaN	NaN	NaN	NaN	NaN	NaN	NaN	NaN	NaN	NaN	NaN	NaN	NaN	NaN	NaN	NaN	NaN	NaN	NaN	NaN	NaN	NaN	NaN	NaN
4.5363	NaN	NaN	NaN	NaN	NaN	NaN	NaN	NaN	NaN	NaN	NaN	NaN	NaN	NaN	NaN	NaN	NaN	NaN	NaN	NaN	NaN	NaN	NaN	NaN	NaN	NaN	NaN	NaN	NaN	NaN	NaN	NaN	NaN	NaN	NaN	NaN	NaN	NaN	NaN	NaN	NaN	NaN	NaN	NaN	NaN	NaN	NaN	NaN	NaN	NaN
4.6698	NaN	NaN	NaN	NaN	NaN	NaN	NaN	NaN	NaN	NaN	NaN	NaN	NaN	NaN	NaN	NaN	NaN	NaN	NaN	NaN	NaN	NaN	NaN	NaN	NaN	NaN	NaN	NaN	NaN	NaN	NaN	NaN	NaN	NaN	NaN	NaN	NaN	NaN	NaN	NaN	NaN	NaN	NaN	NaN	NaN	NaN	NaN	NaN	NaN	NaN
4.8032	NaN	NaN	NaN	NaN	NaN	NaN	NaN	NaN	NaN	NaN	NaN	NaN	NaN	NaN	NaN	NaN	NaN	NaN	NaN	NaN	NaN	NaN	NaN	NaN	NaN	NaN	NaN	NaN	NaN	NaN	NaN	NaN	NaN	NaN	NaN	NaN	NaN	NaN	NaN	NaN	NaN	NaN	NaN	NaN	NaN	NaN	NaN	NaN	NaN	NaN
4.9366	NaN	NaN	NaN	NaN	NaN	NaN	NaN	NaN	NaN	NaN	NaN	NaN	NaN	NaN	NaN	NaN	NaN	NaN	NaN	NaN	NaN	NaN	NaN	NaN	NaN	NaN	NaN	NaN	NaN	NaN	NaN	NaN	NaN	NaN	NaN	NaN	NaN	NaN	NaN	NaN	NaN	NaN	NaN	NaN	NaN	NaN	NaN	NaN	NaN	NaN
5.07	NaN	NaN	NaN	NaN	NaN	NaN	NaN	NaN	NaN	NaN	NaN	NaN	NaN	NaN	NaN	NaN	NaN	NaN	NaN	NaN	NaN	NaN	NaN	NaN	NaN	NaN	NaN	NaN	NaN	NaN	NaN	NaN	NaN	NaN	NaN	NaN	NaN	NaN	NaN	NaN	NaN	NaN	NaN	NaN	NaN	NaN	NaN	NaN	NaN	NaN
5.2035	NaN	NaN	NaN	NaN	NaN	NaN	NaN	NaN	NaN	NaN	NaN	NaN	NaN	NaN	NaN	NaN	NaN	NaN	NaN	NaN	NaN	NaN	NaN	NaN	NaN	NaN	NaN	NaN	NaN	NaN	NaN	NaN	NaN	NaN	NaN	NaN	NaN	NaN	NaN	NaN	NaN	NaN	NaN	NaN	NaN	NaN	NaN	NaN	NaN	NaN
5.3369	NaN	NaN	NaN	NaN	NaN	NaN	NaN	NaN	NaN	NaN	NaN	NaN	NaN	NaN	NaN	NaN	NaN	NaN	NaN	NaN	NaN	NaN	NaN	NaN	NaN	NaN	NaN	NaN	NaN	NaN	NaN	NaN	NaN	NaN	NaN	NaN	NaN	NaN	NaN	NaN	NaN	NaN	NaN	NaN	NaN	NaN	NaN	NaN	NaN	NaN
5.4703	NaN	NaN	NaN	NaN	NaN	NaN	NaN	NaN	NaN	NaN	NaN	NaN	NaN	NaN	NaN	NaN	NaN	NaN	NaN	NaN	NaN	NaN	NaN	NaN	NaN	NaN	NaN	NaN	NaN	NaN	NaN	NaN	NaN	NaN	NaN	NaN	NaN	NaN	NaN	NaN	NaN	NaN	NaN	NaN	NaN	NaN	NaN	NaN	NaN	NaN
5.6037	NaN	NaN	NaN	NaN	NaN	NaN	NaN	NaN	NaN	NaN	NaN	NaN	NaN	NaN	NaN	NaN	NaN	NaN	NaN	NaN	NaN	NaN	NaN	NaN	NaN	NaN	NaN	NaN	NaN	NaN	NaN	NaN	NaN	NaN	NaN	NaN	NaN	NaN	NaN	NaN	NaN	NaN	NaN	NaN	NaN	NaN	NaN	NaN	NaN	NaN
5.7371	NaN	NaN	NaN	NaN	NaN	NaN	NaN	NaN	NaN	NaN	NaN	NaN	NaN	NaN	NaN	NaN	NaN	NaN	NaN	NaN	NaN	NaN	NaN	NaN	NaN	NaN	NaN	NaN	NaN	NaN	NaN	NaN	NaN	NaN	NaN	NaN	NaN	NaN	NaN	NaN	NaN	NaN	NaN	NaN	NaN	NaN	NaN	NaN	NaN	NaN
5.8706	NaN	NaN	NaN	NaN	NaN	NaN	NaN	NaN	NaN	NaN	NaN	NaN	NaN	NaN	NaN	NaN	NaN	NaN	NaN	NaN	NaN	NaN	NaN	NaN	NaN	NaN	NaN	NaN	NaN	NaN	NaN	NaN	NaN	NaN	NaN	NaN	NaN	NaN	NaN	NaN	NaN	NaN	NaN	NaN	NaN	NaN	NaN	NaN	NaN	NaN
