x	Y_20180130_15109_10_8g_left	Y_20180130_15109_11_5g_left	Y_20180130_15109_12_1g	Y_20180130_15109_13_3g	Y_20180130_15109_15_14g	Y_20180130_15109_15_1g_left	Y_20180130_15109_15_7g_left	Y_20180130_15109_16_3g_left	Y_20180130_15109_16_9g_left	Y_20180130_15109_17_1g_left	Y_20180130_15109_17_3g_left	Y_20180130_15109_17_4g_left	Y_20180130_15109_18_2g	Y_20180130_15109_18_9g	Y_20180130_15109_19_10g	Y_20180130_15109_19_5g	Y_20180130_15109_20_7g	Y_20180130_15109_21_8g	Y_20180130_15109_24_10g	Y_20180130_15109_26_3g	Y_20180130_15109_26_4g	Y_20180130_15109_28_2g	Y_20180130_15109_29_3g	Y_20180130_15109_3_6g_left	Y_20180130_15109_30_5g	Y_20180130_15109_38_1g	Y_20180130_15109_39_5g	Y_20180130_15109_4_2g_left	Y_20180130_15109_4_5g_left	Y_20180130_15109_40_1g	Y_20180130_15109_5_3g_left	Y_20180130_15109_8_3g_left	Y_20180130_15109_8_7g_left	Y_20180130_15109_9_2g_left	Y_20180130_15109_9_8g_left	Y_20180130_15109_42_12g	Y_20180130_15109_42_3g	Y_20180130_15109_42_4g	Y_20180130_15109_1_15g	Y_20180130_15109_1_16g	Y_20180130_15109_1_7g_right	Y_20180130_15109_10_5g_right	Y_20180130_15109_10_6g_right	Y_20180130_15109_2_10g	Y_20180130_15109_2_11g	Y_20180130_15109_2_18g	Y_20180130_15109_2_19g	Y_20180130_15109_2_2g_right	Y_20180130_15109_2_3g	Y_20180130_15109_2_6g	Y_20180130_15109_2_7g	Y_20180130_15109_3_6g_right	Y_20180130_15109_5_14g	Y_20180130_15109_5_16g	Y_20180130_15109_6_1g_right	Y_20180130_15109_6_5g_right	Y_20180130_15109_6_6g_right	Y_20180130_15109_7_9g_right	Y_20180130_15109_14_3g_right	Y_20180130_15109_14_9g_right	Y_20180130_15109_15_7g_right	Y_20180130_15109_16_4g_right
0	13661.125	13628.4	13103.795	13521.554	13828.013	13895.006	13517.589	12680.176	13132.479	11457.351	13712.466	11306.262	11499.752	12232.132	12998.59	14621.358	12476.196	12713.94	12903.792	13030.777	14056.358	12967.66	13219.261	11513.888	16747.572	13107.263	12744.18	13008.878	13046.338	13902.414	12948.931	10327	13932.552	12464.768	11615.355	12159.997	11583.526	13245.072	12233.584	14531.459	11779.173	13214.586	13340.538	12413.234	11643.42	13342.9	13274.254	14363.03	11553.03	12247.484	11093.889	12890.469	12237.075	13393.982	14067.14	12983.602	12832.572	12118.745	11744.5	14334.387	13352.624	12637.173
0.1334	13771.801	14997.443	13263.381	13286.586	14244.136	14301.502	14681.21	12355.675	13746.692	11869.629	13928.934	11852.527	12261.765	12283.746	13228.304	14887.943	12513.784	12781.719	13462.21	13934.366	15597.348	12685.22	12951.997	12119.975	16711.232	13203.627	12537.441	13092.053	13000.597	13957.502	12821.549	10701.506	14529.685	12957.624	12549.48	12879.796	12181.491	13192.86	12793.681	15774.522	12307.139	13203.686	13510.889	12435.272	12232.71	13750.066	14338.771	14417.36	11767.139	13479.661	11766.665	13260.412	12405.559	13605.924	14180.926	12887.525	13124.999	12281.576	12430.706	14273.308	14520.588	13242.66
0.2668	14551.153	15664.114	13729.405	13102.238	15451.911	15493.594	15244.467	14055.429	14228.427	12343.987	15822.422	12400.225	13116.888	13359.546	14187.38	15543.922	14014.372	13775.108	13998.661	15782.947	16509.57	13493.026	14215.627	12356.326	18180.967	14208.182	12868.263	14420.065	13577.707	14092.5	12922.07	11987.238	15501.694	15223.216	13782.936	13379.675	13362.231	13755.572	14242.778	19717.008	12854.848	15168.987	14178.503	13007.824	12484.154	14622.449	15865.053	17077.119	13734.4	14339.814	13270.042	14592.761	13806.608	15238.288	15653.533	15534.019	14336.136	13080.131	14186.7	15207.507	15146.945	15360.139
0.4003	15759.013	17997.984	16654.309	14482.65	16971.186	17461.008	16164.2	15142.394	15710.427	13548.862	19150.51	14387.479	14342.079	14212.844	15961.962	16824.734	15523.824	15258.74	15847.695	19513.102	19533.955	15265.176	15087.602	13326.616	20231.51	16452.93	14285.097	16988.881	14876.694	14585.742	14712.665	13680.358	19190.281	19160.791	14883.472	14032.326	15071.08	15435.337	16308.513	25837.094	16450.871	16898.414	15617.737	15527.879	14072.616	18222.75	19628.273	20361.768	14498.188	17818.125	16619.34	17565.547	14540.866	16872.248	19672.982	20394.113	16469.453	14733.992	16910.131	17262.775	20469.619	16886.893
0.5337	17601.686	24012.467	19968.572	15709.964	19802.951	24096.883	19946.205	15468.789	19067.582	16682.482	20402.344	16128.989	15453.98	18218.094	18844.498	19439.549	19654.051	17579.189	18181.064	21372.109	24087.748	18340.754	19253.846	14410.678	21198.775	17654.311	16644.215	20661.588	16105.325	17603.412	17347.66	15191.2	24678.305	20690.441	15503.766	16423.801	15713.281	18532.74	20294.027	31724.754	20459.943	19965.918	18078.613	18723.957	16916.787	21306.078	20044.299	20389.055	14500.997	22867.523	20318.748	22884.127	17498.148	19737.801	24264.379	23943.254	20341.246	17744.807	19487.002	18630.686	23470.58	18360.58
0.6671	19745.059	26262.037	20430.068	19192.914	21650.641	27230.994	23071.82	14235.752	25530.697	19514.994	19339.756	18767.51	16768.766	21265.312	25299.131	23417.859	23635.285	19692.588	23981.061	22461.547	33035.746	22507.951	25568.75	16444.039	23301.045	19531.928	19221.156	21469.904	19380.07	20362.197	19883.146	14723.069	28954.424	20562.166	15392.81	18476.613	14078.641	22463.176	21257.607	34261.508	25977.764	23272.637	22634.391	21622.824	20193.811	23682.93	19276.465	19562.564	14617.654	28939.322	22573.107	24888.637	22186.869	25471.584	25790.693	24087.037	24432.568	20181.855	20113.129	19388.479	22021.91	17981.135
0.8005	21979.281	21567.127	18858.695	22701.418	19445.93	24967.973	22102.301	14208.263	32021.871	19396.197	19904.863	21637.533	15388.398	19722.768	28966.152	23941.088	22955.418	20349.396	32337.463	21363.621	38052.363	23916.529	27949.932	18308.383	25262.9	20147.691	20229.404	22791.17	21483.562	20037.139	19892.145	13909.127	29200.814	17845.51	15546.583	19029.447	14124.048	22065.047	20339.781	33924.301	27488.916	23230.152	25398.246	21970.445	20081.258	25056.789	17004.891	20489.75	14462.693	29682.725	21076.654	25921.621	25125.408	27893.41	26029.15	22561.932	25149.623	22012.684	19142.209	19693.033	20298.146	17782.879
0.934	22957.531	18315.332	17501.619	21783.619	16797.039	23733.928	19273.832	13401.87	33433.555	17751.484	19418.389	20964.459	14993.568	17595.801	28649.48	22078.045	22258.396	20033.443	33301.875	21371.76	36788.121	25318.688	28232.873	19601.797	25155.957	19052.48	18797.832	21182.889	20221.201	18215.76	20771.975	14389.621	25006.461	17064.246	16754.373	18464.703	16399.846	20651.264	20859.699	29040.166	26018.465	22571.076	22774.188	20844.918	18758.107	24355.479	16717.707	20541.512	14685.92	28753.088	19678.395	23305.111	25599.732	26854.709	23334.305	19962.369	22207.053	19856.971	17820.154	18193.436	19467.877	17217.838
1.0674	21702.414	16464.178	17867.584	19312.975	15794.986	20998.957	17736.641	13946.05	33190.434	17976.203	17574.369	19327.869	15142.38	15368.149	24912.764	21133.578	20703.143	19026.822	31218.975	21029.316	30075.287	24557.229	28336.084	19602.572	25185.574	18103.797	18751.303	22780.846	19333.158	17739.99	21084.039	14074.424	20744.604	16407.955	18016.252	19319.756	16321.025	19823.68	19107.469	26570.41	23944.186	20238.141	22935.197	18674.107	18421.092	25256.248	16319.31	22300.795	15343.022	25724.549	18775.928	21917.93	28156.92	25024.609	22921.797	17036.992	20986.914	20669.855	15667.862	19128.889	18379.41	16459.613
1.2008	21062.078	15189.507	19331.234	17285.826	16457.324	19096.256	16363.406	14276.358	31066.152	17674.99	16156.396	18407.09	15389.45	14272.506	24074.244	20224.834	21640.246	17053.795	28504.861	19324.707	27081.115	24420.838	30516.871	19907.072	22173.916	17663.492	18793.814	21551.143	19093.932	18520.451	21901.357	16033.396	18933.467	16469.178	20155.717	18998.92	16814.836	17885.592	17407.092	24706.66	22457.926	20296.105	21085.09	17647.34	19462.836	21579.803	15626.557	22126.504	14780.025	23848.918	19737.414	22667.311	31175.59	24319.742	19652.982	15489.523	20683.564	19667.559	16424.18	18300.754	17497.734	15742.721
1.3342	19563.738	14697.404	19157.33	17504.219	16755.229	18775.273	17697.631	15120.802	28272.752	18913.477	16123.143	17354.855	15646.748	14330.583	22855.211	19445.52	20982.4	15399.684	28461.117	17718.518	25497.441	23473.277	29448.951	20033.453	18992.545	16673.209	17899.664	20585.148	17957.355	18060.389	20275.08	15122.395	17717.498	16139.951	19986.477	17027.719	17529.527	18153.746	17485.457	21144.268	20343.143	19217.748	18884.557	15961.972	19815.959	21632.863	15958.539	21501.207	14013.038	20421.205	19609.768	22126.564	30319.609	22102.496	16838.869	15289.498	19900.309	19954.846	15560.831	19948.078	17806.338	17385.27
1.4676	17054.768	15616.752	17380.117	17759.309	15993.97	21104.652	15509.054	17107.996	24458.982	18478.469	15124.414	17085.418	14585.979	15026.939	23390.158	19116.482	19743.785	14763.282	26450.807	17057.5	24573.121	21265.125	26961.615	20995.484	18244.516	16331.994	17125.242	19348.828	18910.533	16790.773	19453.963	15638.113	17278.08	14379.905	19625.557	15969.218	20695.078	18541.098	17147.057	19626.125	18844.477	19875.184	18095.502	16146.576	17680.334	19938.869	15494.618	18351.666	14337.919	19602.807	18347.945	19688.496	27638.012	21350.086	15652.582	15757.023	18748.912	22026.758	14688.714	21016.721	18623.996	17757.896
1.6011	16071.437	16450.498	17080.777	18112.035	15253.368	21650.176	14562.034	19473.461	22698.297	19113.416	15323.389	15128.063	14005.688	14489.267	22496.533	19231.479	18498.066	15774.19	25232.148	15832.521	22221.615	18683.939	24792.779	19522.752	17333.717	16168.686	16110.085	18191.146	19224.035	18140.002	19518.486	15241.349	16998.496	13724.573	19464.084	15282.583	25586.936	18505.387	16058.012	18180.033	18429.549	17980.352	17043.893	16549.121	16239.093	19708.092	16395.588	17513.107	13347.52	20511.623	17568.793	17142.305	23412.885	20324.854	15795.395	15744.928	18803.082	21124.965	13103.864	20717.25	17399.438	16939.777
1.7345	15623.267	16335.723	16042.538	16550.541	14287.929	18806.9	15832.511	19519.232	21458.834	19050.25	14939.346	15355.251	14160.095	14885.115	20634.277	18455.002	17723.793	16375.372	23234.174	15380.363	19297.893	17648.689	21785.783	17494.637	16430.473	16252.416	15533.004	16728.895	18188.477	18874.162	17448.545	16425.41	16618.945	12784.724	18019.646	13865.998	25807.789	17675.234	14297.632	18227.301	16640.906	15360.929	16752.223	16575.004	14952.484	16648.803	14050.829	17136.242	12482.033	19456.453	17382.988	15414.77	21125.018	18596.229	17813.127	16534.705	18337.551	18858.436	13153.588	20684.771	15436.631	14752.37
1.8679	14345.058	15182.707	14853.615	16838.74	13458.521	15944.263	16463.471	16750.51	20106.328	16331.456	13413.359	14224.531	14454.096	16441.35	19136.123	17374.119	16597.543	15588.025	20386.098	14065.872	17554.4	17158.146	18942.748	16250.715	15107.084	15827.604	15130.411	15497.919	16831.533	16887.973	16367.459	14389.44	16000.684	12482.444	17525.512	12566.729	20488.199	15553.316	12705.618	16805.992	15182.993	14930.254	16349.871	15667.29	13450.721	15718.881	13080.884	15913.539	12511.837	17620.129	17215.307	13697.934	21145.254	16362.229	18611.162	15564.449	16575.58	18160.758	12604.603	20557.764	13626.174	13727.709
2.0013	12125.933	14013.152	14049.196	16695.594	12041.131	13465.37	14398.842	14357.347	19350.408	14127.447	12072.329	13152.829	14180.593	15680.338	17421.816	16043.574	15528.949	14516.374	18378.824	12907.985	15280.31	14994.207	17646.713	15928.923	14731.999	15086.442	16441.861	14459.793	16029.928	15189.36	15483.795	13637.235	15290.211	11985.618	18221.742	11516.917	16261.484	13966.541	11776.66	15314.566	14047.968	14190.292	14537.942	14358.803	11378.779	13978.826	11909.867	14813.793	12030.604	16110.32	15684.758	11784.414	20014.967	13419.613	19369.857	15091.493	14376.005	17040.338	11353.289	18188.662	12899.091	13426.741
2.1348	11158.519	12071.653	12904.099	14985.087	12056.821	12274.603	13716.971	13420.194	17126.578	12639.824	11637.725	11911.271	13016.884	13973.832	15297.546	15615.616	15519.558	12922.339	15102.764	12458.197	14286.098	13416.978	17178.273	15318.605	14118.74	14590.176	16106.77	13224.126	15932.832	13350.109	15310.26	12182.179	14502.027	11333.097	17577.707	11491.586	14011.966	13396.196	11574.331	14362.79	13153.021	13141.552	13450.892	12431.613	11107.228	13656.982	11099.077	13784.494	12037.37	14939.087	14833.088	11162.591	18333.381	12208.5	17468.959	13496.492	13692.122	15203.352	11812.146	15738.886	13049.942	13314.199
2.2682	12313.202	12746.28	12095.322	14544.44	11511.569	12434.146	13108.496	NaN	15160.159	12341.196	11842.412	11340.106	13189.878	13116.359	13578.594	15406.267	15601.168	13298.798	13140.903	11868.61	13298.531	12093.712	17271.441	15833.623	12726.093	13500.35	13888.038	12613.382	14744.473	13125.245	15307.15	12087.515	13206.722	11598.309	18279.328	10861.04	13416.98	13075.72	11456.422	13436.35	12290.755	12036.979	13135.562	12003.49	10840.146	12216.656	11999.306	12764.696	11723.655	14177.989	13991.904	11092.686	17100.277	11660.498	14996.028	12414.261	13817.49	13737.182	11824.149	13774.999	12593.678	12695.762
2.4016	11955.514	12772.177	12221.713	13436.52	11904.521	NaN	12225.451	NaN	12835.102	12988.506	11658.562	11607.597	NaN	12451.458	12968.378	14257.784	14857.43	12289.871	12833.689	11529.409	12952.181	11895.881	16057.245	16318.985	12353.024	12827.234	12701.242	12991.319	13026.518	13448.015	14286.036	12008.229	13249.867	11933.385	16322.634	10751.616	12999.905	11784.347	10986.415	12494.916	11545.198	12450.319	12383.021	11326.488	11026.561	11709.905	12268.857	12612.542	NaN	14222.484	13574.192	11520.268	15602.127	12150.451	13780.021	11872.577	13320.149	12978.85	11470.524	13174.722	12567.057	12739.73
2.535	11754.604	12650.9	11982.683	13529.561	12096.012	NaN	12289.742	NaN	12845.224	NaN	12006.967	11212.928	NaN	12413.054	12516.268	13421.112	14330.4	13692.337	12168.782	NaN	11718.48	12039.832	15484.728	14514.886	12115.292	11976.822	12681.521	12503.158	12161.392	12924.732	12924.422	NaN	12146.061	12156.856	13802.263	11254.308	NaN	11292.108	11140.228	12508.086	12481.349	12386.59	12483.606	11426.197	NaN	11948.621	12115.991	11300.693	NaN	13595.35	13265.228	10619.258	14631.297	11983.041	13390.1	11738.12	13068.129	12747.25	11630.062	12807.815	NaN	NaN
2.6684	11271.421	NaN	11802.844	12516.13	NaN	NaN	NaN	NaN	12922.886	NaN	11929.907	11459.95	NaN	NaN	12833.032	12974.472	NaN	13178.679	11726.799	NaN	11971.728	12250.355	14349.887	13787.366	NaN	12201.634	12502.095	NaN	11981.27	12872.1	12383.094	NaN	12422.785	NaN	13000.353	11471.966	NaN	NaN	11186.989	11910.439	12311.3	11755.859	12896.24	NaN	NaN	11942.239	12036.658	12116.513	NaN	12906.708	NaN	10968.136	13277.065	NaN	NaN	NaN	12701.77	12917.861	NaN	12841.28	NaN	NaN
2.8019	11607.916	NaN	12777.657	11862.822	NaN	NaN	NaN	NaN	NaN	NaN	NaN	NaN	NaN	NaN	12483.651	NaN	NaN	13464.471	11780.013	NaN	12532.414	NaN	13250.207	12341.678	NaN	12618.609	12043.811	NaN	NaN	NaN	11897.163	NaN	NaN	NaN	11812.998	12071.124	NaN	NaN	NaN	NaN	NaN	NaN	NaN	NaN	NaN	NaN	12179.213	12062.104	NaN	NaN	NaN	11354.55	12463.508	NaN	NaN	NaN	NaN	12154.804	NaN	13223.755	NaN	NaN
2.9353	11518.673	NaN	NaN	NaN	NaN	NaN	NaN	NaN	NaN	NaN	NaN	NaN	NaN	NaN	NaN	NaN	NaN	NaN	11921.058	NaN	NaN	NaN	12701.292	12164.599	NaN	NaN	NaN	NaN	NaN	NaN	12139.879	NaN	NaN	NaN	11840.54	NaN	NaN	NaN	NaN	NaN	NaN	NaN	NaN	NaN	NaN	NaN	NaN	NaN	NaN	NaN	NaN	NaN	12292.396	NaN	NaN	NaN	NaN	NaN	NaN	NaN	NaN	NaN
3.0687	12068.059	NaN	NaN	NaN	NaN	NaN	NaN	NaN	NaN	NaN	NaN	NaN	NaN	NaN	NaN	NaN	NaN	NaN	NaN	NaN	NaN	NaN	12492.282	11268.055	NaN	NaN	NaN	NaN	NaN	NaN	12541.372	NaN	NaN	NaN	NaN	NaN	NaN	NaN	NaN	NaN	NaN	NaN	NaN	NaN	NaN	NaN	NaN	NaN	NaN	NaN	NaN	NaN	12244.417	NaN	NaN	NaN	NaN	NaN	NaN	NaN	NaN	NaN
3.2021	NaN	NaN	NaN	NaN	NaN	NaN	NaN	NaN	NaN	NaN	NaN	NaN	NaN	NaN	NaN	NaN	NaN	NaN	NaN	NaN	NaN	NaN	NaN	12215.64	NaN	NaN	NaN	NaN	NaN	NaN	NaN	NaN	NaN	NaN	NaN	NaN	NaN	NaN	NaN	NaN	NaN	NaN	NaN	NaN	NaN	NaN	NaN	NaN	NaN	NaN	NaN	NaN	11966.281	NaN	NaN	NaN	NaN	NaN	NaN	NaN	NaN	NaN
3.3356	NaN	NaN	NaN	NaN	NaN	NaN	NaN	NaN	NaN	NaN	NaN	NaN	NaN	NaN	NaN	NaN	NaN	NaN	NaN	NaN	NaN	NaN	NaN	11812.389	NaN	NaN	NaN	NaN	NaN	NaN	NaN	NaN	NaN	NaN	NaN	NaN	NaN	NaN	NaN	NaN	NaN	NaN	NaN	NaN	NaN	NaN	NaN	NaN	NaN	NaN	NaN	NaN	NaN	NaN	NaN	NaN	NaN	NaN	NaN	NaN	NaN	NaN
3.469	NaN	NaN	NaN	NaN	NaN	NaN	NaN	NaN	NaN	NaN	NaN	NaN	NaN	NaN	NaN	NaN	NaN	NaN	NaN	NaN	NaN	NaN	NaN	12109.294	NaN	NaN	NaN	NaN	NaN	NaN	NaN	NaN	NaN	NaN	NaN	NaN	NaN	NaN	NaN	NaN	NaN	NaN	NaN	NaN	NaN	NaN	NaN	NaN	NaN	NaN	NaN	NaN	NaN	NaN	NaN	NaN	NaN	NaN	NaN	NaN	NaN	NaN
3.6024	NaN	NaN	NaN	NaN	NaN	NaN	NaN	NaN	NaN	NaN	NaN	NaN	NaN	NaN	NaN	NaN	NaN	NaN	NaN	NaN	NaN	NaN	NaN	NaN	NaN	NaN	NaN	NaN	NaN	NaN	NaN	NaN	NaN	NaN	NaN	NaN	NaN	NaN	NaN	NaN	NaN	NaN	NaN	NaN	NaN	NaN	NaN	NaN	NaN	NaN	NaN	NaN	NaN	NaN	NaN	NaN	NaN	NaN	NaN	NaN	NaN	NaN
3.7358	NaN	NaN	NaN	NaN	NaN	NaN	NaN	NaN	NaN	NaN	NaN	NaN	NaN	NaN	NaN	NaN	NaN	NaN	NaN	NaN	NaN	NaN	NaN	NaN	NaN	NaN	NaN	NaN	NaN	NaN	NaN	NaN	NaN	NaN	NaN	NaN	NaN	NaN	NaN	NaN	NaN	NaN	NaN	NaN	NaN	NaN	NaN	NaN	NaN	NaN	NaN	NaN	NaN	NaN	NaN	NaN	NaN	NaN	NaN	NaN	NaN	NaN
3.8692	NaN	NaN	NaN	NaN	NaN	NaN	NaN	NaN	NaN	NaN	NaN	NaN	NaN	NaN	NaN	NaN	NaN	NaN	NaN	NaN	NaN	NaN	NaN	NaN	NaN	NaN	NaN	NaN	NaN	NaN	NaN	NaN	NaN	NaN	NaN	NaN	NaN	NaN	NaN	NaN	NaN	NaN	NaN	NaN	NaN	NaN	NaN	NaN	NaN	NaN	NaN	NaN	NaN	NaN	NaN	NaN	NaN	NaN	NaN	NaN	NaN	NaN
4.0027	NaN	NaN	NaN	NaN	NaN	NaN	NaN	NaN	NaN	NaN	NaN	NaN	NaN	NaN	NaN	NaN	NaN	NaN	NaN	NaN	NaN	NaN	NaN	NaN	NaN	NaN	NaN	NaN	NaN	NaN	NaN	NaN	NaN	NaN	NaN	NaN	NaN	NaN	NaN	NaN	NaN	NaN	NaN	NaN	NaN	NaN	NaN	NaN	NaN	NaN	NaN	NaN	NaN	NaN	NaN	NaN	NaN	NaN	NaN	NaN	NaN	NaN
4.1361	NaN	NaN	NaN	NaN	NaN	NaN	NaN	NaN	NaN	NaN	NaN	NaN	NaN	NaN	NaN	NaN	NaN	NaN	NaN	NaN	NaN	NaN	NaN	NaN	NaN	NaN	NaN	NaN	NaN	NaN	NaN	NaN	NaN	NaN	NaN	NaN	NaN	NaN	NaN	NaN	NaN	NaN	NaN	NaN	NaN	NaN	NaN	NaN	NaN	NaN	NaN	NaN	NaN	NaN	NaN	NaN	NaN	NaN	NaN	NaN	NaN	NaN
4.2695	NaN	NaN	NaN	NaN	NaN	NaN	NaN	NaN	NaN	NaN	NaN	NaN	NaN	NaN	NaN	NaN	NaN	NaN	NaN	NaN	NaN	NaN	NaN	NaN	NaN	NaN	NaN	NaN	NaN	NaN	NaN	NaN	NaN	NaN	NaN	NaN	NaN	NaN	NaN	NaN	NaN	NaN	NaN	NaN	NaN	NaN	NaN	NaN	NaN	NaN	NaN	NaN	NaN	NaN	NaN	NaN	NaN	NaN	NaN	NaN	NaN	NaN
4.4029	NaN	NaN	NaN	NaN	NaN	NaN	NaN	NaN	NaN	NaN	NaN	NaN	NaN	NaN	NaN	NaN	NaN	NaN	NaN	NaN	NaN	NaN	NaN	NaN	NaN	NaN	NaN	NaN	NaN	NaN	NaN	NaN	NaN	NaN	NaN	NaN	NaN	NaN	NaN	NaN	NaN	NaN	NaN	NaN	NaN	NaN	NaN	NaN	NaN	NaN	NaN	NaN	NaN	NaN	NaN	NaN	NaN	NaN	NaN	NaN	NaN	NaN
4.5363	NaN	NaN	NaN	NaN	NaN	NaN	NaN	NaN	NaN	NaN	NaN	NaN	NaN	NaN	NaN	NaN	NaN	NaN	NaN	NaN	NaN	NaN	NaN	NaN	NaN	NaN	NaN	NaN	NaN	NaN	NaN	NaN	NaN	NaN	NaN	NaN	NaN	NaN	NaN	NaN	NaN	NaN	NaN	NaN	NaN	NaN	NaN	NaN	NaN	NaN	NaN	NaN	NaN	NaN	NaN	NaN	NaN	NaN	NaN	NaN	NaN	NaN
4.6698	NaN	NaN	NaN	NaN	NaN	NaN	NaN	NaN	NaN	NaN	NaN	NaN	NaN	NaN	NaN	NaN	NaN	NaN	NaN	NaN	NaN	NaN	NaN	NaN	NaN	NaN	NaN	NaN	NaN	NaN	NaN	NaN	NaN	NaN	NaN	NaN	NaN	NaN	NaN	NaN	NaN	NaN	NaN	NaN	NaN	NaN	NaN	NaN	NaN	NaN	NaN	NaN	NaN	NaN	NaN	NaN	NaN	NaN	NaN	NaN	NaN	NaN
4.8032	NaN	NaN	NaN	NaN	NaN	NaN	NaN	NaN	NaN	NaN	NaN	NaN	NaN	NaN	NaN	NaN	NaN	NaN	NaN	NaN	NaN	NaN	NaN	NaN	NaN	NaN	NaN	NaN	NaN	NaN	NaN	NaN	NaN	NaN	NaN	NaN	NaN	NaN	NaN	NaN	NaN	NaN	NaN	NaN	NaN	NaN	NaN	NaN	NaN	NaN	NaN	NaN	NaN	NaN	NaN	NaN	NaN	NaN	NaN	NaN	NaN	NaN
4.9366	NaN	NaN	NaN	NaN	NaN	NaN	NaN	NaN	NaN	NaN	NaN	NaN	NaN	NaN	NaN	NaN	NaN	NaN	NaN	NaN	NaN	NaN	NaN	NaN	NaN	NaN	NaN	NaN	NaN	NaN	NaN	NaN	NaN	NaN	NaN	NaN	NaN	NaN	NaN	NaN	NaN	NaN	NaN	NaN	NaN	NaN	NaN	NaN	NaN	NaN	NaN	NaN	NaN	NaN	NaN	NaN	NaN	NaN	NaN	NaN	NaN	NaN
5.07	NaN	NaN	NaN	NaN	NaN	NaN	NaN	NaN	NaN	NaN	NaN	NaN	NaN	NaN	NaN	NaN	NaN	NaN	NaN	NaN	NaN	NaN	NaN	NaN	NaN	NaN	NaN	NaN	NaN	NaN	NaN	NaN	NaN	NaN	NaN	NaN	NaN	NaN	NaN	NaN	NaN	NaN	NaN	NaN	NaN	NaN	NaN	NaN	NaN	NaN	NaN	NaN	NaN	NaN	NaN	NaN	NaN	NaN	NaN	NaN	NaN	NaN
5.2035	NaN	NaN	NaN	NaN	NaN	NaN	NaN	NaN	NaN	NaN	NaN	NaN	NaN	NaN	NaN	NaN	NaN	NaN	NaN	NaN	NaN	NaN	NaN	NaN	NaN	NaN	NaN	NaN	NaN	NaN	NaN	NaN	NaN	NaN	NaN	NaN	NaN	NaN	NaN	NaN	NaN	NaN	NaN	NaN	NaN	NaN	NaN	NaN	NaN	NaN	NaN	NaN	NaN	NaN	NaN	NaN	NaN	NaN	NaN	NaN	NaN	NaN
5.3369	NaN	NaN	NaN	NaN	NaN	NaN	NaN	NaN	NaN	NaN	NaN	NaN	NaN	NaN	NaN	NaN	NaN	NaN	NaN	NaN	NaN	NaN	NaN	NaN	NaN	NaN	NaN	NaN	NaN	NaN	NaN	NaN	NaN	NaN	NaN	NaN	NaN	NaN	NaN	NaN	NaN	NaN	NaN	NaN	NaN	NaN	NaN	NaN	NaN	NaN	NaN	NaN	NaN	NaN	NaN	NaN	NaN	NaN	NaN	NaN	NaN	NaN
5.4703	NaN	NaN	NaN	NaN	NaN	NaN	NaN	NaN	NaN	NaN	NaN	NaN	NaN	NaN	NaN	NaN	NaN	NaN	NaN	NaN	NaN	NaN	NaN	NaN	NaN	NaN	NaN	NaN	NaN	NaN	NaN	NaN	NaN	NaN	NaN	NaN	NaN	NaN	NaN	NaN	NaN	NaN	NaN	NaN	NaN	NaN	NaN	NaN	NaN	NaN	NaN	NaN	NaN	NaN	NaN	NaN	NaN	NaN	NaN	NaN	NaN	NaN
5.6037	NaN	NaN	NaN	NaN	NaN	NaN	NaN	NaN	NaN	NaN	NaN	NaN	NaN	NaN	NaN	NaN	NaN	NaN	NaN	NaN	NaN	NaN	NaN	NaN	NaN	NaN	NaN	NaN	NaN	NaN	NaN	NaN	NaN	NaN	NaN	NaN	NaN	NaN	NaN	NaN	NaN	NaN	NaN	NaN	NaN	NaN	NaN	NaN	NaN	NaN	NaN	NaN	NaN	NaN	NaN	NaN	NaN	NaN	NaN	NaN	NaN	NaN
5.7371	NaN	NaN	NaN	NaN	NaN	NaN	NaN	NaN	NaN	NaN	NaN	NaN	NaN	NaN	NaN	NaN	NaN	NaN	NaN	NaN	NaN	NaN	NaN	NaN	NaN	NaN	NaN	NaN	NaN	NaN	NaN	NaN	NaN	NaN	NaN	NaN	NaN	NaN	NaN	NaN	NaN	NaN	NaN	NaN	NaN	NaN	NaN	NaN	NaN	NaN	NaN	NaN	NaN	NaN	NaN	NaN	NaN	NaN	NaN	NaN	NaN	NaN
