0.00000,38719.598
0.13342,39279.539
0.26684,37720.031
0.40027,38414.168
0.53369,38350.359
0.66711,39015.699
0.80053,39147.391
0.93395,39795.273
1.06737,39651.031
1.20080,39470.871
1.33422,43414.652
1.46764,51514.973
1.60106,76433.336
1.73448,101074.719
1.86791,100812.547
2.00133,68968.078
2.13475,51568.660
