X,Y
0.00000,13309.188
0.13342,13216.731
0.26684,14705.808
0.40027,15723.600
0.53369,17385.762
0.66711,15445.398
0.80053,14208.445
0.93395,13990.316
1.06737,13360.078
1.20080,13354.655
1.33422,13658.804
1.46764,14356.214
1.60106,14639.006
1.73448,13808.753
