x	Y_20180130_15100b_1_13g	Y_20180130_15100b_1_5g	Y_20180130_15100b_1_8g	Y_20180130_15100b_10_13g	Y_20180130_15100b_10_14g	Y_20180130_15100b_10_7g	Y_20180130_15100b_12_1g	Y_20180130_15100b_12_8g	Y_20180130_15100b_13_2g	Y_20180130_15100b_13_4g	Y_20180130_15100b_15_15_1g	Y_20180130_15100b_15_2g	Y_20180130_15100b_15_7g	Y_20180130_15100b_16_12g	Y_20180130_15100b_17_4g	Y_20180130_15100b_18_10g	Y_20180130_15100b_18_11g	Y_20180130_15100b_18_8g	Y_20180130_15100b_18_9g	Y_20180130_15100b_2_8g	Y_20180130_15100b_20_14g	Y_20180130_15100b_20_5_2g	Y_20180130_15100b_21_1g	Y_20180130_15100b_4_17g	Y_20180130_15100b_4_7g	Y_20180130_15100b_5_15g	Y_20180130_15100b_6_2g	Y_20180130_15100b_7_13g	Y_20180130_15100b_7_16g	Y_20180130_15100b_8_3g
0	34218.344	33597.699	36095.898	38139.988	36008.117	33974.762	33602.434	33178.906	33692.602	36575.262	39284.895	34127.758	36639.129	39107.746	36645.562	35404.637	34412.086	38459.988	34061.637	40546.273	35363.887	36513.621	34213.41	37459.648	38072.48	35178.531	34842.039	34524.727	39829.48	38746.562
0.1334	34882.883	32241.037	36877.117	38820.898	36573.48	33695.016	32359.984	33596.633	34079.215	36004.418	38567.801	32481.924	36896.637	39281.703	36079.574	35493.258	36107.832	37296.887	34790.855	38704.043	37351.176	36677.574	34564.219	37617.617	38231.203	33730.324	35686.5	34459.738	39482.52	37242.074
0.2668	33001.766	33275.547	35882.648	35751.809	36602.789	34084.762	33839.941	35084.875	33777.586	36289.398	39055.148	32589.227	37039.898	40782.695	33707.766	35436.234	35038.25	36571.574	34775.172	38238.453	38281.734	36230.867	34436.238	36515.164	38324.531	35247.43	36340.355	37154.754	39314.246	36955.23
0.4003	34648.121	34698.152	37236.375	37167.707	36108.016	34524.516	31944.885	34419.824	34337.609	36259.547	39028.668	33413.199	37542.766	39946.391	34049.68	35812.598	34952.945	36885.938	33500.48	38430.168	37930.695	36080.848	35725.566	35485.477	38011.926	33916.98	34959.82	35831.086	37711.34	35539.734
0.5337	35058.512	32540.691	38123.5	35121.062	36571.887	33280.727	31678.502	35365.676	36195.766	35002.316	37817.777	33273.59	36100.246	40382.355	33990.203	37793.223	35153.07	37962.27	34510.477	36887.242	38299.914	36492.703	35533.59	36966.289	37506.691	34981.441	36335.453	36880.453	36934.137	35823.566
0.6671	34260.418	31938.055	35920.664	35654.926	38065.309	34018.539	33242.84	33779.445	35297.004	34824.496	39059.906	31929.824	36447.102	40471.633	34577.789	35947.305	34042.703	37942.699	33398.242	36825.402	38705.988	35944.836	34597.195	35970.953	37526.254	34414.492	36479.758	33655.805	35996.477	36204.465
0.8005	33605.301	34397.91	37619.805	36848.906	38450.938	33257.008	32909.566	34428.488	34443.141	34851.199	39171.629	31805.617	35318.582	39586.266	36253.133	36234.363	33685.117	37493.984	35100.246	39425.934	37700.145	37623.844	35129.816	37478.184	37420.766	34989.246	36774.977	34175.758	36405.215	36351.262
0.934	33907.297	34380.586	37368.906	36419.066	37519.699	33457.207	33369.828	33908.789	36689.383	35426.543	37499.617	31278.625	36260.367	39609.441	35710.59	37063.309	33483.281	37481.094	34768.266	39414.984	35854.711	37047.215	35746.766	38542.352	36535.355	34941.141	39478.621	33235.594	37512.875	36013.613
1.0674	33044.18	35252.266	35852.895	36298.445	38291.508	34152.504	32379.346	34779.125	35233.484	36411.324	39105.887	31647.234	38072.105	39856.332	37446.535	36336.254	34257.473	37135.461	34501.262	38908.711	37862.977	37791.242	35248.961	38434.172	35985.797	36042.793	39776.195	31950.152	39348.691	37369
1.2008	33120.039	38326.762	37333.488	38255.906	40265.805	35088.996	32852.039	37232.242	36641.266	35896.203	40211.262	32923.309	40560.172	41320.906	37313.797	36469.617	35815.441	37084.719	33903.93	38262.23	41074.156	37615.215	36697.391	40993.379	37890.133	37705.676	40892.816	34402.871	40178.195	37299.98
1.3342	34833.777	57587.789	40784.047	37647.023	44644.238	35458.953	36801.082	35331.727	40021.324	37841.082	44473.918	35689.082	42159.52	41360.672	43082.527	38536.465	35688.398	39172.219	36193.52	38347.934	46733.734	40038.555	36768.723	44019.926	37752.906	39551.832	46507.945	35304.547	42536.332	38341.906
1.4676	41622.066	87432.875	49247.723	44088.789	59239.754	40177.746	39454.285	40923.062	46635.18	38679.453	47545.391	43383.805	51343.152	43532.543	59381.934	43174.902	39087.172	42831.496	36750.562	44593.844	53095.816	46051.875	38568.867	53789.695	39657.434	43297.727	62281.578	36013.73	50614.34	41964.32
1.6011	52534.062	127249.148	71588.258	54446.262	86122.984	54611.352	49836.512	49561.773	61740.934	41372.121	61158.566	60866.324	68062.367	49777.449	89615.75	53034.184	43321.281	54576.059	40702.004	55738.266	74639.273	56531.074	40262.199	74603.109	46544.043	54057.898	99167.625	40238.199	64218.562	48330.574
1.7345	66368.547	104401.742	110396.75	66894.562	134795.094	80487.023	62893.363	65938.836	99070.008	51112.637	97357.359	97020.695	103794.625	63496.113	107583.539	63793.418	53918.539	69189.82	48252.605	79560.609	120804.953	67316.391	52384.859	110214.734	56497.93	80588.609	114626.984	54881.07	97950.008	60397.699
1.8679	71415.336	61866.672	126553.867	66372.188	147667.672	104694.344	74192.016	88894.094	118257.258	74059.109	145599.734	115498.938	133606.484	86316.844	84346.484	60252.047	69227.859	68048.961	68497	113421.32	143513.219	59242.312	70249.656	119537.297	82911.484	93520.711	89345.898	88138.492	124230.883	79270.172
2.0013	54819.699	43871.539	84268.219	48775.004	104210.242	91512.945	63250.477	85081.812	93569.492	78633.922	128349.117	90093.273	108019.188	93939.289	57970.746	47314.438	65471.438	55414.988	82460.32	114941.625	105654.906	47899.312	76464.234	86661.961	103084.016	77479.898	58376.766	116225.742	103584.07	76620.547
2.1348	42891.391	NaN	52009.871	41173.07	65147.688	61716.234	52528.75	56775.664	55965.574	60628.754	79434.43	60753.324	71073.914	70225.883	NaN	NaN	51749.762	46550.824	69450.406	82829.453	65618.281	NaN	61512.277	62916.125	85052.867	61504.613	NaN	100158.234	68364.477	58455.848
2.2682	38260.512	NaN	41687.844	NaN	48075.461	43956.121	NaN	45342.758	NaN	47589.801	57353.914	44521.906	51667.219	51148.02	NaN	NaN	42841.516	40570.746	52712.637	57535.742	48884.238	NaN	44872.738	NaN	60534.598	49933.355	NaN	64418.828	49840.406	46310.281
2.4016	36980.758	NaN	39471.043	NaN	NaN	38479.133	NaN	41553.453	NaN	NaN	49899.719	NaN	NaN	44735.547	NaN	NaN	NaN	39050.605	44364.844	48347.883	41876.359	NaN	40645.129	NaN	48853.992	NaN	NaN	46395.125	NaN	NaN
2.535	NaN	NaN	NaN	NaN	NaN	NaN	NaN	NaN	NaN	NaN	NaN	NaN	NaN	NaN	NaN	NaN	NaN	NaN	NaN	44705.777	NaN	NaN	36061.336	NaN	NaN	NaN	NaN	38262.043	NaN	NaN
2.6684	NaN	NaN	NaN	NaN	NaN	NaN	NaN	NaN	NaN	NaN	NaN	NaN	NaN	NaN	NaN	NaN	NaN	NaN	NaN	NaN	NaN	NaN	35328.699	NaN	NaN	NaN	NaN	NaN	NaN	NaN
2.8019	NaN	NaN	NaN	NaN	NaN	NaN	NaN	NaN	NaN	NaN	NaN	NaN	NaN	NaN	NaN	NaN	NaN	NaN	NaN	NaN	NaN	NaN	NaN	NaN	NaN	NaN	NaN	NaN	NaN	NaN
2.9353	NaN	NaN	NaN	NaN	NaN	NaN	NaN	NaN	NaN	NaN	NaN	NaN	NaN	NaN	NaN	NaN	NaN	NaN	NaN	NaN	NaN	NaN	NaN	NaN	NaN	NaN	NaN	NaN	NaN	NaN
3.0687	NaN	NaN	NaN	NaN	NaN	NaN	NaN	NaN	NaN	NaN	NaN	NaN	NaN	NaN	NaN	NaN	NaN	NaN	NaN	NaN	NaN	NaN	NaN	NaN	NaN	NaN	NaN	NaN	NaN	NaN
3.2021	NaN	NaN	NaN	NaN	NaN	NaN	NaN	NaN	NaN	NaN	NaN	NaN	NaN	NaN	NaN	NaN	NaN	NaN	NaN	NaN	NaN	NaN	NaN	NaN	NaN	NaN	NaN	NaN	NaN	NaN
3.3356	NaN	NaN	NaN	NaN	NaN	NaN	NaN	NaN	NaN	NaN	NaN	NaN	NaN	NaN	NaN	NaN	NaN	NaN	NaN	NaN	NaN	NaN	NaN	NaN	NaN	NaN	NaN	NaN	NaN	NaN
3.469	NaN	NaN	NaN	NaN	NaN	NaN	NaN	NaN	NaN	NaN	NaN	NaN	NaN	NaN	NaN	NaN	NaN	NaN	NaN	NaN	NaN	NaN	NaN	NaN	NaN	NaN	NaN	NaN	NaN	NaN
3.6024	NaN	NaN	NaN	NaN	NaN	NaN	NaN	NaN	NaN	NaN	NaN	NaN	NaN	NaN	NaN	NaN	NaN	NaN	NaN	NaN	NaN	NaN	NaN	NaN	NaN	NaN	NaN	NaN	NaN	NaN
3.7358	NaN	NaN	NaN	NaN	NaN	NaN	NaN	NaN	NaN	NaN	NaN	NaN	NaN	NaN	NaN	NaN	NaN	NaN	NaN	NaN	NaN	NaN	NaN	NaN	NaN	NaN	NaN	NaN	NaN	NaN
3.8692	NaN	NaN	NaN	NaN	NaN	NaN	NaN	NaN	NaN	NaN	NaN	NaN	NaN	NaN	NaN	NaN	NaN	NaN	NaN	NaN	NaN	NaN	NaN	NaN	NaN	NaN	NaN	NaN	NaN	NaN
4.0027	NaN	NaN	NaN	NaN	NaN	NaN	NaN	NaN	NaN	NaN	NaN	NaN	NaN	NaN	NaN	NaN	NaN	NaN	NaN	NaN	NaN	NaN	NaN	NaN	NaN	NaN	NaN	NaN	NaN	NaN
4.1361	NaN	NaN	NaN	NaN	NaN	NaN	NaN	NaN	NaN	NaN	NaN	NaN	NaN	NaN	NaN	NaN	NaN	NaN	NaN	NaN	NaN	NaN	NaN	NaN	NaN	NaN	NaN	NaN	NaN	NaN
4.2695	NaN	NaN	NaN	NaN	NaN	NaN	NaN	NaN	NaN	NaN	NaN	NaN	NaN	NaN	NaN	NaN	NaN	NaN	NaN	NaN	NaN	NaN	NaN	NaN	NaN	NaN	NaN	NaN	NaN	NaN
4.4029	NaN	NaN	NaN	NaN	NaN	NaN	NaN	NaN	NaN	NaN	NaN	NaN	NaN	NaN	NaN	NaN	NaN	NaN	NaN	NaN	NaN	NaN	NaN	NaN	NaN	NaN	NaN	NaN	NaN	NaN
4.5363	NaN	NaN	NaN	NaN	NaN	NaN	NaN	NaN	NaN	NaN	NaN	NaN	NaN	NaN	NaN	NaN	NaN	NaN	NaN	NaN	NaN	NaN	NaN	NaN	NaN	NaN	NaN	NaN	NaN	NaN
4.6698	NaN	NaN	NaN	NaN	NaN	NaN	NaN	NaN	NaN	NaN	NaN	NaN	NaN	NaN	NaN	NaN	NaN	NaN	NaN	NaN	NaN	NaN	NaN	NaN	NaN	NaN	NaN	NaN	NaN	NaN
4.8032	NaN	NaN	NaN	NaN	NaN	NaN	NaN	NaN	NaN	NaN	NaN	NaN	NaN	NaN	NaN	NaN	NaN	NaN	NaN	NaN	NaN	NaN	NaN	NaN	NaN	NaN	NaN	NaN	NaN	NaN
4.9366	NaN	NaN	NaN	NaN	NaN	NaN	NaN	NaN	NaN	NaN	NaN	NaN	NaN	NaN	NaN	NaN	NaN	NaN	NaN	NaN	NaN	NaN	NaN	NaN	NaN	NaN	NaN	NaN	NaN	NaN
5.07	NaN	NaN	NaN	NaN	NaN	NaN	NaN	NaN	NaN	NaN	NaN	NaN	NaN	NaN	NaN	NaN	NaN	NaN	NaN	NaN	NaN	NaN	NaN	NaN	NaN	NaN	NaN	NaN	NaN	NaN
5.2035	NaN	NaN	NaN	NaN	NaN	NaN	NaN	NaN	NaN	NaN	NaN	NaN	NaN	NaN	NaN	NaN	NaN	NaN	NaN	NaN	NaN	NaN	NaN	NaN	NaN	NaN	NaN	NaN	NaN	NaN
5.3369	NaN	NaN	NaN	NaN	NaN	NaN	NaN	NaN	NaN	NaN	NaN	NaN	NaN	NaN	NaN	NaN	NaN	NaN	NaN	NaN	NaN	NaN	NaN	NaN	NaN	NaN	NaN	NaN	NaN	NaN
