0.0000	31226.4453
0.1334	31222.6562
0.2668	31785.9805
0.4003	31819.9258
0.5337	32569.7461
0.6671	32573.4707
0.8005	33897.2852
0.9340	33174.2500
1.0674	32373.1719
1.2008	32334.8887
1.3342	32878.2031
1.4676	31295.7031
1.6011	32707.1504
1.7345	33247.5430
1.8679	32776.6953
2.0013	31956.5996
2.1347	32718.4922
2.2682	33469.2305
2.4016	36022.8047
2.5350	41215.9141
2.6684	55382.7617
2.8019	86374.6641
2.9353	116318.9375
3.0687	103450.7578
3.2021	64609.1953
3.3355	44684.7422
3.4690	36857.4023
