0.00000,35050.996
0.13342,35112.559
0.26684,33840.328
0.40027,34675.742
0.53369,32933.055
0.66711,34111.418
0.80053,33998.090
0.93395,33574.441
1.06737,34246.242
1.20080,35130.230
1.33422,34927.414
1.46764,36286.414
1.60106,38223.508
1.73448,40519.680
1.86791,45489.926
2.00133,62592.277
2.13475,92370.812
2.26817,109899.664
2.40159,81295.141
2.53502,57327.457
2.66844,46717.523
2.80186,40735.957
2.93528,38875.332
