x	Y_20180514_15100_10_1g	Y_20180514_15100_10_2g	Y_20180514_15100_11_10g	Y_20180514_15100_24_1g	Y_20180514_15100_7_2g	Y_20180514_15100_9_5g
0	31395.078	31610.037	27622.439	29665	33330.207	32595.316
0.1334	31688.285	32210.318	28480.127	30244.814	33796.98	30689.277
0.2668	31388.072	33297.281	28991.279	30453.27	32027.377	30967.186
0.4003	31703.727	33221.094	27841.469	30845.674	33152.738	30661.812
0.5337	32859.77	31944.564	28434.973	29964.77	32063.473	31933.078
0.6671	31873.332	31597.324	28153.336	31019.949	33428.414	33310.914
0.8005	31077.479	32600.498	28444.072	29972.479	33333.074	31933.857
0.934	31312.49	32349.766	27969.264	30448.35	32804.695	33476.672
1.0674	32053.053	33469.219	27639.037	31745.996	35152.844	33925.188
1.2008	32781.793	32873.246	28748.648	30425.18	34181.574	33410.625
1.3342	32243.117	32791.621	28545.859	30957.504	35682.793	33301.078
1.4676	31801.639	31754.189	29901.568	31790.443	34432.742	32864.828
1.6011	31814.326	32044.314	29520.549	31203.463	35154.863	33202.934
1.7345	32240.012	32713.154	28746.617	32134.838	35821.285	34557.602
1.8679	31498.695	32546.178	27776.779	31831.967	35527.672	35689.383
2.0013	32083.557	32285.723	28989.729	33363.617	33143.625	35306.688
2.1348	31067.834	32609.891	28616.789	32244.439	34252.754	35979.27
2.2682	30846.291	31863.576	28673.721	33171.984	35840.953	36250.641
2.4016	32289.344	31820.072	29122.779	30674.115	36262.047	33998.383
2.535	33451.809	31469.236	28323.492	31481.215	36355.105	35186.316
2.6684	37417.777	32232.736	29865.357	32193.023	36554.492	34722.898
2.8019	45678.656	32107.617	30595.387	30849.918	42148.348	39146.258
2.9353	50519.844	33650.324	30227.295	31763.926	50034.137	47759.004
3.0687	43513.309	33406.383	33543.336	32242.746	68717.727	58308.895
3.2021	37914.566	37101.07	41778.297	38049.012	78257.367	60867.191
3.3356	33044.406	41508.949	53356.477	48121.824	66064.719	47991.242
3.469	32264.525	49937.508	57697.188	55034.879	48313.328	40321.898
3.6024	32400.432	53578.977	49524.785	48528	40281.023	38005.941
3.7358	34455.105	44008.387	39023.727	40759.117	36429.59	39951.406
3.8692	33621.5	37200.887	34724.367	34085.258	36030.992	46028.453
4.0027	NaN	33106.492	32996.039	32500.58	35176.152	NaN
4.1361	NaN	31801.838	30870.738	30295.232	35671.98	NaN
4.2695	NaN	NaN	NaN	30586.596	34184.027	NaN
4.4029	NaN	NaN	NaN	30689.109	NaN	NaN
4.5363	NaN	NaN	NaN	30338.723	NaN	NaN
4.6698	NaN	NaN	NaN	30871.518	NaN	NaN
4.8032	NaN	NaN	NaN	31090.566	NaN	NaN
4.9366	NaN	NaN	NaN	NaN	NaN	NaN
5.07	NaN	NaN	NaN	NaN	NaN	NaN
5.2035	NaN	NaN	NaN	NaN	NaN	NaN
5.3369	NaN	NaN	NaN	NaN	NaN	NaN
5.4703	NaN	NaN	NaN	NaN	NaN	NaN
5.6037	NaN	NaN	NaN	NaN	NaN	NaN
