0.00000,35145.754
0.13342,33576.297
0.26684,35229.219
0.40027,34060.191
0.53369,35726.641
0.66711,36081.492
0.80053,35957.418
0.93395,35472.789
1.06737,34645.664
1.20080,35629.980
1.33422,36025.238
1.46764,33767.945
1.60106,33342.168
1.73448,36354.797
1.86791,35922.891
2.00133,35305.949
2.13475,36159.895
2.26817,38521.602
2.40159,42867.336
2.53502,51080.160
2.66844,72113.086
2.80186,113263.547
2.93528,139536.984
3.06870,105370.555
3.20212,66269.570
3.33555,51017.449
3.46897,43467.133
3.60239,42460.148
