0.00000,14018.182
0.13342,13764.173
0.26684,13611.908
0.40027,14118.750
0.53369,16663.422
0.66711,19587.709
0.80053,21414.213
0.93395,20386.355
1.06737,19240.111
1.20080,18578.547
1.33422,17510.117
1.46764,16732.717
1.60106,14323.956
1.73448,14293.303
1.86791,12938.808
2.00133,13174.185
