X,Y
0.00000,36657.277
0.13342,35914.812
0.26684,36387.023
0.40027,36043.375
0.53369,36386.656
0.66711,35703.871
0.80053,35996.984
0.93395,37176.699
1.06737,39627.664
1.20080,45166.566
1.33422,56325.555
1.46764,64293.223
1.60106,56894.789
1.73448,44290.836
1.86791,40225.598
