0.0000	29634.2383
0.1334	29230.4277
0.2668	29610.0000
0.4003	28370.6484
0.5337	29387.0234
0.6671	30405.2285
0.8005	29970.3262
0.9340	29858.6875
1.0674	29531.1250
1.2008	29383.1699
1.3342	30207.2578
1.4676	29527.6172
1.6011	31900.8711
1.7345	33445.9766
1.8679	40877.9727
2.0013	55153.2812
2.1347	81325.5000
2.2682	88211.0391
2.4016	65789.5078
2.5350	45419.6094
2.6684	35631.6992
2.8019	32724.9141
