0.00000,14687.667
0.13342,15965.080
0.26684,17558.277
0.40027,21028.799
0.53369,23106.391
0.66711,23471.654
0.80053,22136.281
0.93395,19978.482
1.06737,18787.066
1.20080,18052.504
1.33422,18115.938
1.46764,18056.971
1.60106,18168.773
1.73448,16786.236
1.86791,15380.643
2.00133,14534.872
2.13475,14274.733
2.26817,13490.436
2.40159,13445.159
2.53502,14227.068
2.66844,14629.307
