0.00000,38655.551
0.13342,38198.008
0.26684,38769.395
0.40027,39439.758
0.53369,36497.293
0.66711,36315.164
0.80053,39621.258
0.93395,38466.238
1.06737,39507.266
1.20080,40259.398
1.33422,41869.953
1.46764,47700.090
1.60106,57539.379
1.73448,81005.000
1.86791,108253.570
2.00133,103778.836
2.13475,80767.906
2.26817,67095.086
2.40159,58331.703
2.53502,48659.805
2.66844,43005.691
