x	Y_20180514_15338_c2_1_15g	Y_20180514_15338_c2_12_11g	Y_20180514_15338_c2_19_6g	Y_20180514_15338_c2_23_11g	Y_20180514_15338_c2_26_3g	Y_20180514_15338_c2_29_5g	Y_20180514_15338_c2_30_6g	Y_20180514_15338_c2_33_1g	Y_20180514_15338_c2_36_3g	Y_20180514_15338_c2_8_7g	Y_20180514_15338_c1_20_3g	Y_20180514_15338_c1_3_3g	Y_20180514_15338_c1_4_3g
0	10608.04	12523.2168	14317.0674	8750.2051	12935.9521	12329.3154	14189.6025	14357.4531	13922.1367	11978.8555	15472.7949	11929.8955	11957.7549
0.1334	10894.6182	12767.4141	17165.6738	9341.1084	16094.6768	12378.8447	16319.6221	15594.2705	15778.7715	13260.2393	18055.9277	12517.9902	12485.166
0.2668	14000.8594	14697.4922	24657.7168	10109.2939	23909.1211	12872.083	21211.0098	19537.9414	16823.623	16443.8125	21752.5938	13995.0273	14022.6309
0.4003	20223.877	19746.7031	31859.668	11150.3418	30714.875	15522.2783	27367.1035	26035.1855	20511.0039	19693.3672	27270.0859	16593.3125	16596.6445
0.5337	33022.3906	23873.1855	29477.7871	13324.5039	32400.9414	20669.9492	28591.4336	27633.8066	28069.7734	20589.291	30227.2422	20915.4434	20900.4062
0.6671	36952.7031	21308.5723	23395.2031	15703.043	30882.7656	26176.875	27312.6211	24156.7773	31935.1074	19668.6523	26778.4668	27518.5586	27559.4512
0.8005	32684.8203	19668.7598	19632.8809	16047.79	26781.1309	26512.6387	22977.1758	21307.209	28715.4727	18794.7148	23759.5723	25107.625	24940.043
0.934	27215.9883	17920.4082	18773.8711	15553.3662	26261.334	22770.6406	20457.3145	20072.9043	24166.4863	18135.7832	20799.7285	20370.0098	20301.5703
1.0674	24302.3965	17349.4473	18878.916	14631.8564	24024.248	19600.3125	19496.293	17383.4453	21275.0605	16548.1094	19704.9609	15786.7148	15684.4102
1.2008	21435.125	17833.5742	19109.0879	15092.2734	22343.8477	17867.5059	19695.9863	15000.0352	16986.7051	16485.9551	19207.9004	14061.6318	13998.252
1.3342	20860.6074	18276.5781	19647.5723	14506.6201	21139.2246	15408.0781	18450.0352	14601.2666	17001.0645	15331.8242	18916.9883	13726.8916	13613.1016
1.4676	20768.041	18263.3906	18825.4375	14749.167	22187.0527	15837.1533	17527.9609	14392.0068	16013.2881	16686.9492	18721.0547	14173.3467	14106.1592
1.6011	20861.6895	19314.9707	19391.7793	14495.8545	23810.5977	16192.5029	16182.4561	14465.9121	15161.7471	16115.2676	18776.1523	14249.7354	14176.8574
1.7345	20179.0918	19087.6289	19487.4297	14616.3887	22981.9805	15750.7314	16318.3154	16321.9727	15742.167	16003.1221	17970.3828	15221.7988	15154.0498
1.8679	18635.3008	20258.3223	19113.5703	14640.0479	24399.9492	16901.3516	16151.3047	16301.5957	16584.4609	15329.71	17843.6367	15791.4756	15712.8086
2.0013	18508.0352	19436.4043	18595.5625	14258.0449	23208.2949	17118.4297	16874.3555	16077.5566	17306.7227	15205.7402	18643.1016	16691.2246	16596.0898
2.1347	19672.3691	20400.5059	19031.0332	13920.7451	19809.2734	18276.6719	16857.0039	15889.4287	18581.4668	15410.0859	19035.166	17216.9199	17010.8242
2.2682	20410.0352	20208.252	20654.8535	14523.6123	17181.0391	19065.7793	16475.4375	16252.3213	19239.0508	15672.2295	19139.5723	16444.8457	16264.4053
2.4016	21602.2812	18900.3359	19475.7734	14362.0732	17963.8203	21551.3066	17413.3984	16911.3008	17940.375	16142.0713	20283.0547	16128.2334	15762.8262
2.535	21043.7031	18974.1914	18903.4453	13652.8994	17903.9414	20907.3945	17600.6113	16321.9854	17532.7969	16252.3877	22346.7324	15044.9346	14834.0098
2.6684	21114.6895	17311.4492	16774.1797	13648.8887	18021.2227	21944.6582	17833.1758	15636.3145	17034.5156	15480.7285	23259.9043	14702.833	14376.0439
2.8019	20456.1543	16117.6367	15149.8359	13868.0127	19288.6621	24277.8105	15922.4756	15426.042	16710.4785	16028.1895	22420.8223	15541.9639	15522.2168
2.9353	21337.6172	16417.4805	14162.5273	14337.1338	20778.9219	25764.6094	15712.4971	14925.1006	17087.6191	15334.4043	24026.3281	15343.5312	15397.2871
3.0687	23771.7285	17985.7676	13667.7529	14063.8174	21764.2656	27198.3457	16001.0391	14458.4316	16820.5547	14394.1152	24197.3535	15052.8408	15203.041
3.2021	21959.5996	17915.6816	12504.208	13673.5439	20534.1738	23544.5762	18255.3164	14637.9541	19255.9746	14656.5371	25051.584	14814.3018	14757.0391
3.3355	18312.3184	17208.8203	12129.8789	14732.4424	19006.1953	19442.8125	20389.1191	13892.0635	20224.8281	15732.9766	24373.1934	14380.4043	14318.9297
3.469	18310.0156	15499.8613	12039.3965	14819.0498	18205.4023	17806.6367	19466.4258	12492.3291	18773.8613	14294.6865	22643.9766	13415.2959	13360.2842
3.6024	17157.5762	13963.2607	11781.6836	14434.8545	15079.9424	14845.4785	15946.1465	11834.8037	16488.043	14748.6396	20173.5879	13494.8428	13480.2002
3.7358	16841.7305	12525.248	12428.0967	13223.8975	14477.7969	13522.6709	14461.998	11858.7041	14255.625	14452.5391	18497.1504	12774.5391	12684.917
3.8692	15967.5098	12307.377	12376.4443	13058.5693	13801.7529	12803.5703	13397.6045	11970.4834	14181.7891	14128.8076	17133.1836	12657.501	12465.7637
4.0027	16284.1543	12035.7871	12563.5469	12389.5977	13105.2617	11890.1455	12890.6582	12159.9531	15488.167	14392.7559	NaN	12501.3369	12437.0098
4.1361	16550.3379	12849.6387	NaN	11743.457	NaN	12536.6934	12730.4619	11908.5889	14997.332	14356.0664	NaN	NaN	11969.2812
4.2695	15687.8779	12294.9912	NaN	12156.583	NaN	12541.2988	12703.791	11384.6025	16638.4395	14860.9854	NaN	NaN	11763.8096
4.4029	16438.2891	NaN	NaN	12058.1455	NaN	12809.7891	NaN	11832.9102	15091.0977	NaN	NaN	NaN	NaN
4.5363	NaN	NaN	NaN	NaN	NaN	NaN	NaN	12525.417	14359.793	NaN	NaN	NaN	NaN
4.6698	NaN	NaN	NaN	NaN	NaN	NaN	NaN	NaN	14194.4355	NaN	NaN	NaN	NaN
4.8032	NaN	NaN	NaN	NaN	NaN	NaN	NaN	NaN	NaN	NaN	NaN	NaN	NaN
4.9366	NaN	NaN	NaN	NaN	NaN	NaN	NaN	NaN	NaN	NaN	NaN	NaN	NaN
5.07	NaN	NaN	NaN	NaN	NaN	NaN	NaN	NaN	NaN	NaN	NaN	NaN	NaN
5.2035	NaN	NaN	NaN	NaN	NaN	NaN	NaN	NaN	NaN	NaN	NaN	NaN	NaN
5.3369	NaN	NaN	NaN	NaN	NaN	NaN	NaN	NaN	NaN	NaN	NaN	NaN	NaN
5.4703	NaN	NaN	NaN	NaN	NaN	NaN	NaN	NaN	NaN	NaN	NaN	NaN	NaN
5.6037	NaN	NaN	NaN	NaN	NaN	NaN	NaN	NaN	NaN	NaN	NaN	NaN	NaN
5.7371	NaN	NaN	NaN	NaN	NaN	NaN	NaN	NaN	NaN	NaN	NaN	NaN	NaN
5.8706	NaN	NaN	NaN	NaN	NaN	NaN	NaN	NaN	NaN	NaN	NaN	NaN	NaN
