0.00000,10106.972
0.13342,10473.315
0.26684,10804.586
0.40027,12332.746
0.53369,14511.834
0.66711,19408.084
0.80053,21326.768
0.93395,21069.350
1.06737,19912.236
1.20080,18870.312
1.33422,17075.000
1.46764,16317.271
1.60106,17295.740
1.73448,16342.631
1.86791,15241.533
2.00133,15129.391
2.13475,14976.104
2.26817,15766.355
2.40159,15571.501
2.53502,16560.387
2.66844,17422.936
2.80186,16244.884
2.93528,14541.453
3.06870,13407.965
3.20212,12749.070
3.33555,12323.176
3.46897,12477.961
3.60239,11494.685
3.73581,11795.833
3.86923,12550.553
