x	Y_20180514_15100_1_2g	Y_20180514_15100_1_7g	Y_20180514_15100_10_1g	Y_20180514_15100_10_5g	Y_20180514_15100_11_10g	Y_20180514_15100_11_3g	Y_20180514_15100_11_4g	Y_20180514_15100_12_10g	Y_20180514_15100_12_2g	Y_20180514_15100_12_4g	Y_20180514_15100_12_5g	Y_20180514_15100_12_6g	Y_20180514_15100_12_9g	Y_20180514_15100_14_1g	Y_20180514_15100_14_9g	Y_20180514_15100_15_2g	Y_20180514_15100_15_3g	Y_20180514_15100_15_5g	Y_20180514_15100_17_2g	Y_20180514_15100_17_3g	Y_20180514_15100_19_2g	Y_20180514_15100_19_4g	Y_20180514_15100_19_6g	Y_20180514_15100_21_1g	Y_20180514_15100_21_3g	Y_20180514_15100_21_7g	Y_20180514_15100_23_11g	Y_20180514_15100_23_3g	Y_20180514_15100_23_4g	Y_20180514_15100_27_4g	Y_20180514_15100_28_2g	Y_20180514_15100_28_3g	Y_20180514_15100_28_5g	Y_20180514_15100_28_7g	Y_20180514_15100_3_5g	Y_20180514_15100_31_6g	Y_20180514_15100_32_4g	Y_20180514_15100_4_11g	Y_20180514_15100_4_8g	Y_20180514_15100_5_2g	Y_20180514_15100_5_7g	Y_20180514_15100_6_1g	Y_20180514_15100_7_2g	Y_20180514_15100_7_5g	Y_20180514_15100_7_7g	Y_20180514_15100_8_1g	Y_20180514_15100_8_2g	Y_20180514_15100_8_4g	Y_20180514_15100_8_5g	Y_20180514_15100_8_7g	Y_20180514_15100_9_10g	Y_20180514_15100_9_2g	Y_20180514_15100_9_6g
0	32939.9375	28046.5996	32275.291	28552.707	31222.9512	32762.2559	34484.7578	28391.5801	33416.7578	34223.6172	35063.3359	31776.0195	31016.2109	28354.6152	31454.334	30649.4121	33409.3086	30777.8906	34026.6758	30883.5449	32101.7012	34397.1602	29774.2754	30495.8105	28553.6152	34504.5391	32029.3613	34144.0273	34517.4805	31126.0488	34599.5625	28398.1699	31564.332	31945.0059	29049.2266	37041.957	32731.2148	31553.3223	33974.5	33783.9414	34540.8086	29104.8066	29909.8027	33204.0742	34105.9375	30128.5996	32908.8828	31878.7461	34651.2188	32469.2285	29144.2012	32392.2852	31319.9258
0.1334	32458.877	29215.3203	32489.4141	28290.6895	31807.1934	32671.9883	34281.8203	27581.2207	35329.5508	33813.8477	34597.3594	30917.6641	31734.5469	29449.8809	31413.4336	30825.4434	34160.2812	31545.5977	33612.4062	29022.1035	33747.8008	35198.8242	30904.9434	29403.75	27855.0469	33302.0938	31057.8809	33723.2383	34878.9922	32660.1738	34741.0117	30396.3438	31617.7363	30811.7441	30077.5215	37528.125	33074.0703	32158.6113	33705.9141	34893.1445	34548.1016	28254.3555	29751.3496	33416.3945	32194.2383	30507.3633	32324.2812	32673.0117	33276.9844	34597.6523	30153.5703	32912.5117	31189.1582
0.2668	32062.0977	29505.7617	31348.9082	30005.8008	32918.7461	32771.2852	34787.9883	27645.9668	32979.4141	34196.9102	35187.7422	33081.457	32121.1484	29845.5547	29915.2441	30629.209	34866.4492	31549.7305	31464.8359	27530.3379	32304.623	34923.4609	30309.2871	29937.9473	29163.8711	34439.8867	31307.5352	32926.0586	37015.9453	31264.5	34387.9609	30465.9336	31500.5625	30766.6621	30041.75	37387.4297	34255.8828	32905.3164	33264.9922	34586.4805	34319.8281	28612.6641	29747.543	34384.9023	31550.4863	28045.5684	33045.4688	32065.4922	34153.2695	34025.2578	30368.0195	31526.9258	32013
0.4003	31651.8281	30200.3984	30678.498	29069.2969	32324.4824	33406.3125	35335.9258	28029.0215	33794.1992	35517.4219	33879.6719	33652.5078	31778.4219	28640.2871	31045.2559	32149.0703	34323.7695	31407.3105	33572.8047	29129.3066	33670.0078	33967.5352	28511.0898	29248.875	29549.6074	32466.2539	31208.3125	32619.5449	34080.3203	32027.5684	34709.25	30998.5957	31803.1758	30248.0508	30195.623	37155.3281	34113.7617	33639.25	32856.0156	33498.125	34654.9766	28775.4375	29923.9688	33304.1172	31985.373	29058.6816	34112.457	33121.25	34067.2188	34346.7148	29646.4609	31883.9297	29171.5137
0.5337	32299.3691	30608.1953	32898.5117	29123.4355	31198.3047	32451.8105	34560.2734	28683.9648	34269.4453	35191.0312	34191.9961	32624.4414	32367.5742	30892.0684	29983.9141	33148.6211	34278.3438	30750.6777	33822.0273	30494.0352	33093.6953	34706.582	30464.3574	30936.5977	28758.0527	33073.7188	32656.0586	32678.3945	33815.3633	31151.1816	35979.8711	29116.75	29870.8262	28905.3301	29157.9434	36419.2305	34099.2617	32168.2344	35025.2539	32785.6641	36449.5391	28619.1934	31122.3984	32906.7031	31218.0039	29021.9785	33490.6523	33472.4141	32344.5488	35726.9766	30184.9102	31685.0898	30399.3555
0.6671	31659.248	27853.5332	34062.1445	29055.8672	30148.4121	31295.6719	34633.418	29127.998	32949.2656	33400.4805	33740.6211	32040.9219	30056.0781	30874.2617	31122.0703	34019.4648	35157.9414	31296.5508	33042.2734	29736.1543	32394.5684	33264.1562	30355.709	31003.2539	28381.7246	34448.4336	31417.9844	32454.4531	32444.1816	31785.6367	36843.3555	30823.4043	31672.2363	30264.9277	29481.918	36071.3867	34023.2305	32441.248	35105.0508	30795.7305	38455.7617	27854.7207	29472.2949	34917.0312	34853.8281	28569.8926	33302.6797	31966.6152	31779.1484	37978.4297	30102.9609	32153.168	30445.1172
0.8005	33482.1914	30297.9629	34516.7188	30389.2656	31714.5098	32526.7031	36252.6953	28936.9844	33685.8555	35628.168	33368.6562	32243.6973	29761.1523	29590.6035	32723.8906	34786.8438	36712.5547	30815.834	34005.875	28414.541	32486.6055	32666.2305	28767.3398	30318.5215	30228.5527	35265.1562	32098.4941	32307.5781	32664.8672	33051	40181.668	30950.3047	32511.0273	31500.2559	30945.0645	38142.8047	34088.625	34005.5703	34582.375	30821.0234	45150.6562	29658.8223	31574.0156	36569.6328	34193.4062	29278.5176	33779.8477	32641.7246	32738.3535	38071.8438	31459.6172	32022.8594	31911.8926
0.934	32179.3809	28409.2363	33908.4219	29730.5332	31849.0293	34341.7578	36682.6445	29094.5117	35260.8789	35765.2344	35497.4688	31265.3047	30302.625	30149.8613	31929.0703	34801.7266	44504.6602	30645.7832	34003.8555	27969.0527	34214.1641	35794.3672	29473.459	29999.998	30127.8789	34979.5039	30306.2969	31311.3301	34022.6719	33657.9492	45947.9375	32744.6758	32290.1211	32598.9766	29730.7715	42862.3867	35164.9766	33232.6602	34219.2461	32388.1074	60094.4102	30154.3672	29074.291	35487.9336	34245.8711	30549.7305	33409.7305	34167.043	32663.8145	43963.543	32003.832	31635.416	31016.3555
1.0674	32300.0449	29095.1328	38843.4805	29251.1426	31529.9375	35653.4805	35599.1797	29371.6387	33656.5	37740.8594	36190.3516	32228.9492	31729.168	31947.4766	37045.6641	33766.6562	61417.8711	30980.543	34145.4492	28439.0742	34310.3125	39618.8555	30904.8711	31909.082	33506.7383	35565.793	31587.998	33477.4336	34821.7617	34303.25	66726.8906	33513.9961	32422.3652	31564.7715	30225.4473	53963.0117	36764.2695	33850.6797	36038.0078	33142.0781	90536.0859	27715.7012	30634.5918	37405.5898	33638.6289	29997.0605	33382.1758	32889.7461	36464.4922	64463.1719	31761.709	32289.7227	30524.041
1.2008	33413.9766	29999.4551	45318.6602	30131.7695	32403.6133	34260.957	36500.2148	30332.707	38189.457	44833.1602	35163.0625	33474.2305	31397.4883	32035.5059	50442.8906	32916.0273	77110.8672	30321.3203	35686.2344	29737.2207	36180.4766	52456.3281	32066.6543	32155.5352	39399.4727	39485.8164	32299.3066	32580.5039	34759.6914	38565.2773	108393.7578	34676.4375	34081.9531	30073.5039	29841.6562	69073.3828	40421.5742	35868.8516	39733.8789	36038.6367	111308.2891	29383.3574	31788.9922	35896.5938	35375.8125	32916.125	34244.6055	33743.8164	42613.5664	107549.5938	31417.0957	34570.375	29490.3535
1.3342	37074.3906	31710.209	68061.2656	33113.8203	33799.668	36203.7891	38054.2773	31102.9512	45224.5391	61126.5078	35766.3125	35908.2266	33123.4062	33017.5547	67191.6406	37758.2188	70061.8359	29949.7031	37621.5312	29879.3711	40426.5312	80389.0156	37374.7188	36559.6406	49798.6172	44958.3281	33874.3516	32961.2539	37082.6875	47684.6172	119331.8672	39905.2305	40561.8086	31727.4961	32091.75	70391.5781	49631.6562	41028.3281	45531.3555	40469.7969	88162.0781	30345.8105	38051.3477	35454.3438	38385.6836	33555.5625	36749.6211	34042.6445	58461.3125	140448.9688	34046.5547	38173.9609	32202.6465
1.4676	42734.1953	38377.0117	111292.1797	41036.9609	35327.1367	43928.9609	41183.3555	33953.1953	59425.6055	94140.6484	38883.4375	42244.8555	35645.9688	38892.0234	68056.1406	43418.0859	50680.1914	32089.7031	42019.8594	31553.2617	49278.6836	125691.2031	50985.9492	42040.8672	58315.3828	57431.5078	39562.3672	36474.0156	50361.2266	57373.8984	81561.5156	47599.8281	51343.0352	32327.3789	35614.6875	53524.6406	67882.7188	52724.375	69166.5781	49815.5586	56096.9688	31675.5664	51553.5312	39035.957	45129.1914	43541.5508	46538.5977	37468.4336	94887.125	117945.2578	40085.6016	44710.9922	34663.8047
1.6011	58815.2695	54655.8555	128443	64467.3125	39411.1094	60289.4492	48641	41830.6406	90853.1953	123422.4062	47647.1172	57773.2656	41071.0273	50330.9922	49164.2734	58804.7773	40467.8477	35487.9922	54588.5078	41847.9453	76947.2109	134118.9062	79766.1562	59024.2695	55642.4219	83944.7109	50465.3047	41933.7852	76582.2656	54031.0742	54831.0742	61246.625	75127.3125	34521.457	38385.2344	42932.8828	114446.0391	70774.0469	92997.9766	77777.3047	41492.3438	35509.7109	74055.1328	49458.7773	57942.3789	63733.9805	64230.625	49598.2891	115072.875	74050.8203	52360.1133	60152.5508	42822.3477
1.7345	82894.8125	82635.0078	91114.375	80919.3125	52625.9766	97186.3438	70572.125	60163.7539	106651.0625	108133.0156	64489.2344	77440.1172	56252.4922	74032.125	37247.8242	82588.8359	NaN	44238.4805	78541.2109	55488.5508	119280.4297	91337.4062	109122.5078	79148.0625	40885.207	111773.3281	73191.8594	51481.8398	109182.3828	44254.6289	44250.3516	75389.5703	87696.5312	40119.9492	53057.8203	37371.3242	152977.0312	80004.8359	94760.4453	115199.4688	37047.0742	43262.332	75952.5234	62767.7148	59368.332	94975.5312	92570.7031	72127.4375	88842.6094	54760.8398	76112.4609	86520.0078	64350.0039
1.8679	81642.4219	86636.4922	59926.207	69838.3516	68828.9688	138150.0625	85466.7266	81108.5234	78015.3906	68135.6875	77359.3438	69339.5391	80522.2734	95712.2031	34032.0938	77331.4062	NaN	61098.418	105742.2344	61994.4453	131979.8438	57466.3359	91057.25	76324.7344	33018.5234	100670.875	90754.3594	74586.625	94956.0859	NaN	40536.8906	71952.7734	72791.0391	54916.4766	87388.8594	36902.332	120936.9297	66287.6094	67139.1406	112219.7734	36024.4688	54310.1562	54902.4727	77625.7031	48747.1562	104425.0781	103444.0703	89377.3906	58838.3398	48917.1797	91130.2578	90424.0859	90400.1484
2.0013	58126.6055	61821.3789	44276.1211	49001.7188	65908.1172	116952.8125	77614.4922	79699.5312	52196.7188	48594.9492	70201.1641	50966.3945	95672.6094	80550.4219	32610.8242	56988.668	NaN	68332.1016	96769.1406	52562.2695	87683.8828	44547.7695	54172.3828	55742.957	30554.5684	67105.9688	76330.0547	90639.7656	59421.4805	NaN	38921.957	52173.8789	49931.5352	67599.1953	113561.3672	36608.9414	79752.0234	49107.0586	47188.2227	75925.625	NaN	59737.6836	40898.4297	71976.3828	38265.1641	72272.0625	91642.1172	77940.9297	42993.9961	45656.918	71534.5312	64422.2852	95236.4531
2.1347	41999.8086	43511.6406	40720.8789	37221.1055	48480.0547	73489.8359	57390.082	58025.9766	NaN	42071.6562	52941.8594	40181.0703	76250.4688	53582.3633	NaN	40183.8477	NaN	58090.9688	66295.2109	38543.1758	52512.0117	39539.8867	40250.9023	41594.2109	29825.7695	47306.8398	52366.4766	78792.7969	44209.1992	NaN	NaN	38959.2656	39315.332	59892.9492	92333.75	35594.8711	53344.5195	40005.125	40009.3008	53074.7305	NaN	48460.1055	36649.918	55059.9766	NaN	47521.1562	74067.9844	54764.2539	35081.7578	NaN	49924.6602	45834.6836	70452.4609
2.2682	37571.6602	33924.7422	38548.0391	33094.4102	38983.7969	49020.8203	NaN	43400.082	NaN	NaN	41701.625	37625.3242	52541.957	38193.7891	NaN	35888.6289	NaN	43844.8555	46480.2852	33500.5703	42310.4336	37756.0273	33092.2109	37421.6562	30459.6094	39784.0352	39378.3867	55647.6992	39298.9219	NaN	NaN	33794.125	37213.7852	46745.7031	59714.6562	36053.9492	43045.9883	35939.0898	36359.8281	43060.2656	NaN	37069.5586	33963.043	44257.2227	NaN	36513.7461	51430.8281	43150.8008	33113.2188	NaN	39775.418	37343.6758	49865.1133
2.4016	34073.7422	32502.4668	NaN	31701.4941	35925.8555	40441.5	NaN	35620.2852	NaN	NaN	39446.6211	NaN	41979.4531	33908.8281	NaN	36015.125	NaN	36278.9141	39962.4961	31444.6523	37203.7695	40964.5078	31936.0352	37527.1992	NaN	35983.1016	33950.3047	43017.4492	39143.1875	NaN	NaN	32369.2578	36520.9961	41404.0117	43106.4062	33550.5898	38868.1602	34070.8164	35205.3086	40719.6953	NaN	32706.668	NaN	41133.3438	NaN	34447.5977	41040.1875	39583.8594	35168.2422	NaN	36072.168	34563.9453	40846.625
2.535	34347.293	30928.1758	NaN	31675.6387	33796.8047	35653.1523	NaN	33738.9648	NaN	NaN	NaN	NaN	36961.4336	32241.9688	NaN	NaN	NaN	NaN	37653.9023	31435.2305	35895.0703	NaN	31703.2148	NaN	NaN	34648.1328	32954.5898	NaN	NaN	NaN	NaN	31049.1074	NaN	NaN	36969.0391	NaN	37693.8398	34428.9766	NaN	NaN	NaN	29823.5586	NaN	NaN	NaN	32975.6992	36305.4219	38719.1953	36012.2188	NaN	NaN	35624.6953	34155.1641
2.6684	NaN	NaN	NaN	32979.4883	NaN	34600.7969	NaN	31716.875	NaN	NaN	NaN	NaN	34745.4453	32037.502	NaN	NaN	NaN	NaN	36585.5312	NaN	NaN	NaN	NaN	NaN	NaN	34135.0781	34524.6992	NaN	NaN	NaN	NaN	31488.5938	NaN	NaN	35626.2227	NaN	NaN	NaN	NaN	NaN	NaN	NaN	NaN	NaN	NaN	32194.1719	33216.0156	36060.3867	NaN	NaN	NaN	36886.4883	33993.5078
2.8019	NaN	NaN	NaN	NaN	NaN	34205.1289	NaN	NaN	NaN	NaN	NaN	NaN	NaN	NaN	NaN	NaN	NaN	NaN	35766.0977	NaN	NaN	NaN	NaN	NaN	NaN	NaN	NaN	NaN	NaN	NaN	NaN	NaN	NaN	NaN	NaN	NaN	NaN	NaN	NaN	NaN	NaN	NaN	NaN	NaN	NaN	NaN	32550.332	NaN	NaN	NaN	NaN	NaN	32679.252
2.9353	NaN	NaN	NaN	NaN	NaN	NaN	NaN	NaN	NaN	NaN	NaN	NaN	NaN	NaN	NaN	NaN	NaN	NaN	36239.7227	NaN	NaN	NaN	NaN	NaN	NaN	NaN	NaN	NaN	NaN	NaN	NaN	NaN	NaN	NaN	NaN	NaN	NaN	NaN	NaN	NaN	NaN	NaN	NaN	NaN	NaN	NaN	33652.1953	NaN	NaN	NaN	NaN	NaN	NaN
3.0687	NaN	NaN	NaN	NaN	NaN	NaN	NaN	NaN	NaN	NaN	NaN	NaN	NaN	NaN	NaN	NaN	NaN	NaN	NaN	NaN	NaN	NaN	NaN	NaN	NaN	NaN	NaN	NaN	NaN	NaN	NaN	NaN	NaN	NaN	NaN	NaN	NaN	NaN	NaN	NaN	NaN	NaN	NaN	NaN	NaN	NaN	NaN	NaN	NaN	NaN	NaN	NaN	NaN
3.2021	NaN	NaN	NaN	NaN	NaN	NaN	NaN	NaN	NaN	NaN	NaN	NaN	NaN	NaN	NaN	NaN	NaN	NaN	NaN	NaN	NaN	NaN	NaN	NaN	NaN	NaN	NaN	NaN	NaN	NaN	NaN	NaN	NaN	NaN	NaN	NaN	NaN	NaN	NaN	NaN	NaN	NaN	NaN	NaN	NaN	NaN	NaN	NaN	NaN	NaN	NaN	NaN	NaN
3.3355	NaN	NaN	NaN	NaN	NaN	NaN	NaN	NaN	NaN	NaN	NaN	NaN	NaN	NaN	NaN	NaN	NaN	NaN	NaN	NaN	NaN	NaN	NaN	NaN	NaN	NaN	NaN	NaN	NaN	NaN	NaN	NaN	NaN	NaN	NaN	NaN	NaN	NaN	NaN	NaN	NaN	NaN	NaN	NaN	NaN	NaN	NaN	NaN	NaN	NaN	NaN	NaN	NaN
3.469	NaN	NaN	NaN	NaN	NaN	NaN	NaN	NaN	NaN	NaN	NaN	NaN	NaN	NaN	NaN	NaN	NaN	NaN	NaN	NaN	NaN	NaN	NaN	NaN	NaN	NaN	NaN	NaN	NaN	NaN	NaN	NaN	NaN	NaN	NaN	NaN	NaN	NaN	NaN	NaN	NaN	NaN	NaN	NaN	NaN	NaN	NaN	NaN	NaN	NaN	NaN	NaN	NaN
3.6024	NaN	NaN	NaN	NaN	NaN	NaN	NaN	NaN	NaN	NaN	NaN	NaN	NaN	NaN	NaN	NaN	NaN	NaN	NaN	NaN	NaN	NaN	NaN	NaN	NaN	NaN	NaN	NaN	NaN	NaN	NaN	NaN	NaN	NaN	NaN	NaN	NaN	NaN	NaN	NaN	NaN	NaN	NaN	NaN	NaN	NaN	NaN	NaN	NaN	NaN	NaN	NaN	NaN
3.7358	NaN	NaN	NaN	NaN	NaN	NaN	NaN	NaN	NaN	NaN	NaN	NaN	NaN	NaN	NaN	NaN	NaN	NaN	NaN	NaN	NaN	NaN	NaN	NaN	NaN	NaN	NaN	NaN	NaN	NaN	NaN	NaN	NaN	NaN	NaN	NaN	NaN	NaN	NaN	NaN	NaN	NaN	NaN	NaN	NaN	NaN	NaN	NaN	NaN	NaN	NaN	NaN	NaN
3.8692	NaN	NaN	NaN	NaN	NaN	NaN	NaN	NaN	NaN	NaN	NaN	NaN	NaN	NaN	NaN	NaN	NaN	NaN	NaN	NaN	NaN	NaN	NaN	NaN	NaN	NaN	NaN	NaN	NaN	NaN	NaN	NaN	NaN	NaN	NaN	NaN	NaN	NaN	NaN	NaN	NaN	NaN	NaN	NaN	NaN	NaN	NaN	NaN	NaN	NaN	NaN	NaN	NaN
4.0027	NaN	NaN	NaN	NaN	NaN	NaN	NaN	NaN	NaN	NaN	NaN	NaN	NaN	NaN	NaN	NaN	NaN	NaN	NaN	NaN	NaN	NaN	NaN	NaN	NaN	NaN	NaN	NaN	NaN	NaN	NaN	NaN	NaN	NaN	NaN	NaN	NaN	NaN	NaN	NaN	NaN	NaN	NaN	NaN	NaN	NaN	NaN	NaN	NaN	NaN	NaN	NaN	NaN
4.1361	NaN	NaN	NaN	NaN	NaN	NaN	NaN	NaN	NaN	NaN	NaN	NaN	NaN	NaN	NaN	NaN	NaN	NaN	NaN	NaN	NaN	NaN	NaN	NaN	NaN	NaN	NaN	NaN	NaN	NaN	NaN	NaN	NaN	NaN	NaN	NaN	NaN	NaN	NaN	NaN	NaN	NaN	NaN	NaN	NaN	NaN	NaN	NaN	NaN	NaN	NaN	NaN	NaN
4.2695	NaN	NaN	NaN	NaN	NaN	NaN	NaN	NaN	NaN	NaN	NaN	NaN	NaN	NaN	NaN	NaN	NaN	NaN	NaN	NaN	NaN	NaN	NaN	NaN	NaN	NaN	NaN	NaN	NaN	NaN	NaN	NaN	NaN	NaN	NaN	NaN	NaN	NaN	NaN	NaN	NaN	NaN	NaN	NaN	NaN	NaN	NaN	NaN	NaN	NaN	NaN	NaN	NaN
4.4029	NaN	NaN	NaN	NaN	NaN	NaN	NaN	NaN	NaN	NaN	NaN	NaN	NaN	NaN	NaN	NaN	NaN	NaN	NaN	NaN	NaN	NaN	NaN	NaN	NaN	NaN	NaN	NaN	NaN	NaN	NaN	NaN	NaN	NaN	NaN	NaN	NaN	NaN	NaN	NaN	NaN	NaN	NaN	NaN	NaN	NaN	NaN	NaN	NaN	NaN	NaN	NaN	NaN
4.5363	NaN	NaN	NaN	NaN	NaN	NaN	NaN	NaN	NaN	NaN	NaN	NaN	NaN	NaN	NaN	NaN	NaN	NaN	NaN	NaN	NaN	NaN	NaN	NaN	NaN	NaN	NaN	NaN	NaN	NaN	NaN	NaN	NaN	NaN	NaN	NaN	NaN	NaN	NaN	NaN	NaN	NaN	NaN	NaN	NaN	NaN	NaN	NaN	NaN	NaN	NaN	NaN	NaN
4.6698	NaN	NaN	NaN	NaN	NaN	NaN	NaN	NaN	NaN	NaN	NaN	NaN	NaN	NaN	NaN	NaN	NaN	NaN	NaN	NaN	NaN	NaN	NaN	NaN	NaN	NaN	NaN	NaN	NaN	NaN	NaN	NaN	NaN	NaN	NaN	NaN	NaN	NaN	NaN	NaN	NaN	NaN	NaN	NaN	NaN	NaN	NaN	NaN	NaN	NaN	NaN	NaN	NaN
4.8032	NaN	NaN	NaN	NaN	NaN	NaN	NaN	NaN	NaN	NaN	NaN	NaN	NaN	NaN	NaN	NaN	NaN	NaN	NaN	NaN	NaN	NaN	NaN	NaN	NaN	NaN	NaN	NaN	NaN	NaN	NaN	NaN	NaN	NaN	NaN	NaN	NaN	NaN	NaN	NaN	NaN	NaN	NaN	NaN	NaN	NaN	NaN	NaN	NaN	NaN	NaN	NaN	NaN
4.9366	NaN	NaN	NaN	NaN	NaN	NaN	NaN	NaN	NaN	NaN	NaN	NaN	NaN	NaN	NaN	NaN	NaN	NaN	NaN	NaN	NaN	NaN	NaN	NaN	NaN	NaN	NaN	NaN	NaN	NaN	NaN	NaN	NaN	NaN	NaN	NaN	NaN	NaN	NaN	NaN	NaN	NaN	NaN	NaN	NaN	NaN	NaN	NaN	NaN	NaN	NaN	NaN	NaN
5.07	NaN	NaN	NaN	NaN	NaN	NaN	NaN	NaN	NaN	NaN	NaN	NaN	NaN	NaN	NaN	NaN	NaN	NaN	NaN	NaN	NaN	NaN	NaN	NaN	NaN	NaN	NaN	NaN	NaN	NaN	NaN	NaN	NaN	NaN	NaN	NaN	NaN	NaN	NaN	NaN	NaN	NaN	NaN	NaN	NaN	NaN	NaN	NaN	NaN	NaN	NaN	NaN	NaN
