x	Y_20180514_15100b_13_7g	Y_20180514_15100b_18_10g	Y_20180514_15100b_7_5g	Y_20180514_15100b_9_8g
0	33505.4375	24140.209	34885.8555	36195.3711
0.1334	32976.2969	28669.5	34661.9297	37712.3633
0.2668	32837.3711	28751.7988	34776.8945	37568.8086
0.4003	33314.9805	28793.3516	35229.4102	37111.7422
0.5337	32571.2246	29385.7422	35178.9258	36890.0352
0.6671	32773.6172	28708.5898	36083.3594	37667.043
0.8005	33834.6992	27893.6172	35386.7188	39166.3828
0.934	34595.293	29009.4023	36716.0664	37524.6914
1.0674	33908.1562	29826.3594	39863.2266	37952.3086
1.2008	33276.4141	30106.291	40973.9922	38145.9297
1.3342	34446.0117	30173.0605	37594.0156	38564.6875
1.4676	35177.4844	30841.5195	36975.3203	38001.207
1.6011	35097.9492	31658.4023	36017.1172	35193.0938
1.7345	34321.7227	31373.4316	36479.5234	37431.418
1.8679	34378.9766	30312.2676	33924.332	36287.4727
2.0013	34858.625	30479.0898	36467.4492	35772.0039
2.1347	34844.6406	31604.0996	36020.5273	33941.0742
2.2682	34893.6797	31819.9434	35834.3594	38031.082
2.4016	34952.0938	31111.8496	35740.9609	38237.3711
2.535	38689.9258	31802.5488	35443.5312	40560.375
2.6684	43317.3438	31763.377	36652.5273	41542.1328
2.8019	52667.9336	37036.6758	37522.4297	48767.3359
2.9353	79671.0312	48183.4414	38497.0664	70804.4609
3.0687	118770.7969	68016.4297	41206.8438	122439.1016
3.2021	122731.875	80855.4922	52363.1172	149464.625
3.3355	85742.2656	68238.6094	77192.3984	115750.2188
3.469	54335.4727	48917.0039	99236.7812	69688.4766
3.6024	42108.8516	38820.0117	85191.6641	51048.5703
3.7358	39108.2734	34145.5469	59771.9258	43831.1602
3.8692	37120.2773	33449.4727	43825.4375	42448.5391
4.0027	NaN	NaN	37977.9805	40813.7773
4.1361	NaN	NaN	36074.9492	NaN
4.2695	NaN	NaN	35067.6289	NaN
4.4029	NaN	NaN	34597.6758	NaN
4.5363	NaN	NaN	NaN	NaN
4.6698	NaN	NaN	NaN	NaN
4.8032	NaN	NaN	NaN	NaN
4.9366	NaN	NaN	NaN	NaN
5.07	NaN	NaN	NaN	NaN
