0.00000,13571.732
0.13342,13695.851
0.26684,15846.570
0.40027,17925.395
0.53369,20280.609
0.66711,21661.035
0.80053,20055.533
0.93395,20860.748
1.06737,19566.609
1.20080,20406.871
1.33422,19100.146
1.46764,18491.498
1.60106,20376.148
1.73448,20741.223
1.86791,21776.463
2.00133,21175.189
2.13475,19683.348
2.26817,19503.389
2.40159,17674.135
2.53502,16218.006
2.66844,15004.562
2.80186,13882.997
2.93528,14045.540
3.06870,13808.755
