x	Y_20180514_15338_c1_1_2g	Y_20180514_15338_c1_12_4g	Y_20180514_15338_c1_17_9g	Y_20180514_15338_c1_18_7g	Y_20180514_15338_c1_19_15g	Y_20180514_15338_c1_20_1g	Y_20180514_15338_c1_20_3g	Y_20180514_15338_c1_3_3g	Y_20180514_15338_c1_4_3g	Y_20180514_15338_c1_8_2g	Y_20180514_15338_c1_8_3g	Y_20180514_15338_c1_8_4g	Y_20180514_15338_c1_9_13g
0	9885.5312	12526.7275	11627.8037	12758.5996	10505.9854	15454.9746	15472.7949	11929.8955	11957.7549	11839.0283	10356.7656	11173.3916	11926.9814
0.1334	10882.9463	12222.1748	13606.6387	14754.4453	11250.6572	15311.0088	18055.9277	12517.9902	12485.166	13727.5518	11310.1846	10472.5713	11325.4922
0.2668	11085.3135	13011.0713	17922.5059	18325.2012	12294.6875	17028.207	21752.5938	13995.0273	14022.6309	14929.0283	13534.7842	10572.0586	11324.1797
0.4003	12176.4443	15786.125	25850.543	23718.6523	13323.1836	20795.3574	27270.0859	16593.3125	16596.6445	16110.0254	15866.3887	10283.7939	13077.2666
0.5337	13623.1504	20322.3945	30361.9668	26431.2617	15365.4131	28368.8984	30227.2422	20915.4434	20900.4062	18815.9551	20023.0547	11097.1523	14494.0713
0.6671	15776.1797	23272.4961	28281.6035	19762.9492	19489.3203	33513.3008	26778.4668	27518.5586	27559.4512	21440.6113	22273.3438	13244.0352	17753.418
0.8005	20211.832	24155.8652	25508.4902	18383.2734	23252.5938	29350.6855	23759.5723	25107.625	24940.043	19184.4238	21232.1387	16056.3184	22926.1348
0.934	24099.7031	23145.9414	22672.3887	16923.1914	22115.5312	23369.4492	20799.7285	20370.0098	20301.5703	17289.9629	19993.7891	22056.625	23539.7031
1.0674	25797.5117	20209.0352	20051.4258	16498.4336	18941.4336	19348.3691	19704.9609	15786.7148	15684.4102	15132.6699	18267.0664	25150.0293	18767.2266
1.2008	24361.4004	18156.6855	19120.5078	17003.1777	18432.2012	18122.7422	19207.9004	14061.6318	13998.252	14390.5684	17005.2754	23129.4961	17757.916
1.3342	22609.373	16332.7588	19997.752	18109.6211	17625.1367	16447.9922	18916.9883	13726.8916	13613.1016	14418.6143	16319.7842	20990.1133	17377.0859
1.4676	21199.3652	16181.46	19336.1387	17306.4531	17417.7129	14561.9209	18721.0547	14173.3467	14106.1592	14519.6592	16829.6406	19100.8613	18420.6855
1.6011	21168.7812	15975.7139	20003.3633	17690.3047	16807.2578	16143.6289	18776.1523	14249.7354	14176.8574	14346.708	16811.1797	18081.5273	18307.2617
1.7345	19408.6289	16507.1855	19717.5918	17298.3867	15720.2305	17711.0176	17970.3828	15221.7988	15154.0498	13892.6572	15540.6172	19213.3945	18546.8008
1.8679	19252.2441	16478.2461	19523.8945	17444.4512	15048.7041	18757.668	17843.6367	15791.4756	15712.8086	13790.5059	17522.3594	19055.7441	19990.0273
2.0013	19441.1426	17613.2227	17901.9238	18785.7676	14687.5205	20420.1133	18643.1016	16691.2246	16596.0898	12217.4141	18220.3672	19203.6582	21054.5508
2.1347	18671.332	18174.6328	16976.6406	18119.6172	15203.0664	22295.2559	19035.166	17216.9199	17010.8242	12231.4746	17555.0234	18504.7949	19676.6992
2.2682	18387.543	19113.8555	16461.334	16893.0156	15747.7109	21840.8516	19139.5723	16444.8457	16264.4053	12317.8496	17257.2051	18263.1055	18279.1641
2.4016	17310.2461	19898.7578	15604.168	16245.9883	14956.1328	19924.5078	20283.0547	16128.2334	15762.8262	13198.124	16275.8398	17034.002	16090.543
2.535	16160.8506	20681.8262	14634.3613	15517.5986	15261.2275	19117.8633	22346.7324	15044.9346	14834.0098	14173.8643	15525.1133	16732.7285	15795.6201
2.6684	14845.7451	21239.8574	15707.001	16312.1484	16045.9307	18686.1953	23259.9043	14702.833	14376.0439	13464.3721	15697.1104	16991.1543	16552.252
2.8019	14136.8271	19555.0059	16414.9648	15997.0176	17405.7539	19203.4746	22420.8223	15541.9639	15522.2168	14786.4336	15784.6934	16799.459	16892.7305
2.9353	13991.1113	17271.8398	16886.4629	16007.5576	16992.2559	19332.3906	24026.3281	15343.5312	15397.2871	15016.4141	14715.9775	15097.3008	18025.0977
3.0687	16458.1035	15717.4697	16013.4502	15660.7773	16768.0801	19271.9785	24197.3535	15052.8408	15203.041	14352.7217	14674.998	14572.5068	18071.3652
3.2021	18531.0645	13928.2412	15027.7812	14554.8984	17589.3184	16962.8887	25051.584	14814.3018	14757.0391	13498.3408	13920.0957	14069.3535	17294.5879
3.3355	20814.6367	13984.4521	13898.2939	13810.9785	18206.1523	15890.8516	24373.1934	14380.4043	14318.9297	12659.1152	12937.7139	14018.2949	16349.1855
3.469	20170.9727	13570.1475	13450.2812	13696.6416	17355.8281	15202.3311	22643.9766	13415.2959	13360.2842	12906.9775	13281.2617	14132.3691	14564.6416
3.6024	18418.6953	12064.8389	13492.0098	13369.6836	16682.8477	14420.4385	20173.5879	13494.8428	13480.2002	12268.8125	12385.3262	15236.7891	14175.1758
3.7358	17518.4648	11890.5742	NaN	13283.8271	15362.4023	14201.0117	18497.1504	12774.5391	12684.917	NaN	12065.8359	16157.1943	14053.2021
3.8692	17171.4551	12068.2754	NaN	13215.1377	14481.5576	NaN	17133.1836	12657.501	12465.7637	NaN	11769.4717	17272.3672	13345.1963
4.0027	15906.9014	13085.4082	NaN	NaN	14612.7725	NaN	NaN	12501.3369	12437.0098	NaN	12177.7178	16151.833	13396.4189
4.1361	14700.3359	13754.1865	NaN	NaN	13787.1963	NaN	NaN	NaN	11969.2812	NaN	12628.2588	15908.2471	13560.377
4.2695	15601.4893	14541.0146	NaN	NaN	13852.6582	NaN	NaN	NaN	11763.8096	NaN	12780.2217	NaN	13019.6992
4.4029	14829.3438	NaN	NaN	NaN	NaN	NaN	NaN	NaN	NaN	NaN	NaN	NaN	NaN
4.5363	15433.8828	NaN	NaN	NaN	NaN	NaN	NaN	NaN	NaN	NaN	NaN	NaN	NaN
4.6698	NaN	NaN	NaN	NaN	NaN	NaN	NaN	NaN	NaN	NaN	NaN	NaN	NaN
4.8032	NaN	NaN	NaN	NaN	NaN	NaN	NaN	NaN	NaN	NaN	NaN	NaN	NaN
4.9366	NaN	NaN	NaN	NaN	NaN	NaN	NaN	NaN	NaN	NaN	NaN	NaN	NaN
5.07	NaN	NaN	NaN	NaN	NaN	NaN	NaN	NaN	NaN	NaN	NaN	NaN	NaN
5.2035	NaN	NaN	NaN	NaN	NaN	NaN	NaN	NaN	NaN	NaN	NaN	NaN	NaN
5.3369	NaN	NaN	NaN	NaN	NaN	NaN	NaN	NaN	NaN	NaN	NaN	NaN	NaN
5.4703	NaN	NaN	NaN	NaN	NaN	NaN	NaN	NaN	NaN	NaN	NaN	NaN	NaN
5.6037	NaN	NaN	NaN	NaN	NaN	NaN	NaN	NaN	NaN	NaN	NaN	NaN	NaN
5.7371	NaN	NaN	NaN	NaN	NaN	NaN	NaN	NaN	NaN	NaN	NaN	NaN	NaN
5.8706	NaN	NaN	NaN	NaN	NaN	NaN	NaN	NaN	NaN	NaN	NaN	NaN	NaN
