0.00000,16297.421
0.13342,17800.176
0.26684,21392.871
0.40027,22572.365
0.53369,22394.645
0.66711,21584.945
0.80053,19107.566
0.93395,17577.373
1.06737,18422.982
1.20080,18583.852
1.33422,19545.271
1.46764,21225.770
1.60106,20798.801
1.73448,21331.646
1.86791,23585.314
2.00133,25665.598
2.13475,27385.885
2.26817,28746.230
2.40159,24793.189
2.53502,23621.719
2.66844,19965.408
2.80186,17111.818
2.93528,15054.730
3.06870,13922.125
3.20212,13137.826
3.33555,13563.895
3.46897,13102.678
3.60239,13021.090
