X,Y
0.00000,10927.926
0.13342,11926.609
0.26684,12946.810
0.40027,13913.981
0.53369,15765.755
0.66711,19812.641
0.80053,21461.217
0.93395,19347.795
1.06737,17977.045
1.20080,17186.309
1.33422,15905.199
1.46764,16381.388
1.60106,17238.375
1.73448,16915.703
1.86791,15408.128
2.00133,15345.531
2.13475,15870.543
2.26817,15512.094
2.40159,14648.855
2.53502,14051.254
2.66844,13261.274
2.80186,12977.657
2.93528,12839.422
3.06870,12626.497
