X,Y
0.00000,12923.122
0.13342,13915.969
0.26684,16441.943
0.40027,19885.002
0.53369,19563.654
0.66711,19750.494
0.80053,21232.104
0.93395,23498.404
1.06737,25236.734
1.20080,24000.699
1.33422,21623.754
1.46764,19547.654
1.60106,18504.271
1.73448,17221.170
1.86791,15609.031
2.00133,14456.312
2.13475,13536.938
2.26817,13443.779
2.40159,12642.921
2.53502,12088.023
2.66844,11551.502
2.80186,11957.214
2.93528,12011.701
3.06870,11868.377
3.20212,11812.643
