0.00000,37277.551
0.13342,36879.766
0.26684,36089.719
0.40027,36586.293
0.53369,36983.820
0.66711,35313.410
0.80053,37148.363
0.93395,38854.223
1.06737,43177.816
1.20080,50743.852
1.33422,73707.531
1.46764,105617.836
1.60106,102406.914
1.73448,76129.820
1.86791,55603.160
2.00133,44549.598
