0.00000,13706.779
0.13342,14432.089
0.26684,15531.843
0.40027,17019.855
0.53369,18466.994
0.66711,20246.043
0.80053,19734.371
0.93395,21576.293
1.06737,22201.742
1.20080,22357.225
1.33422,22155.570
1.46764,20884.148
1.60106,20143.994
1.73448,20510.225
1.86791,20633.262
2.00133,20213.469
2.13475,19080.312
2.26817,17197.225
2.40159,14513.594
2.53502,14484.617
2.66844,13631.840
2.80186,12519.726
2.93528,12798.354
