X,Y
0.00000,32983.062
0.13342,32599.320
0.26684,31863.471
0.40027,31276.633
0.53369,31159.006
0.66711,32377.320
0.80053,32350.221
0.93395,32393.609
1.06737,31179.777
1.20080,31959.895
1.33422,32312.342
1.46764,32591.338
1.60106,31664.650
1.73448,34564.742
1.86791,36393.707
2.00133,41842.551
2.13475,61056.730
2.26817,90627.578
2.40159,96366.438
2.53502,66865.336
2.66844,47704.426
2.80186,39882.258
