0.00000,13852.142
0.13342,13848.102
0.26684,14529.285
0.40027,16900.326
0.53369,20303.199
0.66711,23165.109
0.80053,23134.172
0.93395,22063.291
1.06737,20461.236
1.20080,20162.229
1.33422,18986.322
1.46764,16016.588
1.60106,14450.340
1.73448,14519.957
1.86791,14849.102
