0.0000	32869.7539
0.1334	31945.9531
0.2668	31859.8750
0.4003	31604.6660
0.5337	32109.1543
0.6671	33490.2656
0.8005	31550.9512
0.9340	31899.2930
1.0674	31852.8555
1.2008	30877.6309
1.3342	31571.6465
1.4676	31140.9082
1.6011	30707.6621
1.7345	29998.8594
1.8679	30569.0898
2.0013	31070.7363
2.1347	33165.2930
2.2682	35721.4336
2.4016	42550.5664
2.5350	59740.6211
2.6684	78565.3438
2.8019	75944.1094
2.9353	52048.5859
3.0687	38815.1406
3.2021	35254.1562
