0.00000,41516.844
0.13342,39988.910
0.26684,40190.773
0.40027,40788.309
0.53369,40216.133
0.66711,39768.652
0.80053,39521.008
0.93395,39278.641
1.06737,38376.688
1.20080,39923.977
1.33422,42497.055
1.46764,47113.781
1.60106,63830.637
1.73448,92109.633
1.86791,103115.469
2.00133,77349.867
2.13475,55756.977
2.26817,50169.113
2.40159,45702.125
2.53502,43606.766
