0.00000,13762.152
0.13342,13687.802
0.26684,14289.500
0.40027,16629.627
0.53369,21060.295
0.66711,22397.297
0.80053,22824.836
0.93395,21781.191
1.06737,21802.449
1.20080,19748.908
1.33422,18090.758
1.46764,17119.219
1.60106,15689.574
1.73448,14669.356
1.86791,14283.534
2.00133,13357.822
2.13475,12929.951
2.26817,13196.274
2.40159,12959.173
2.53502,12462.169
2.66844,11965.036
2.80186,11896.114
2.93528,12061.256
3.06870,12440.311
3.20212,11951.613
3.33555,12048.007
3.46897,12180.117
