x	Y_20180514_15338_c2_1_1g	Y_20180514_15338_c2_10_4g	Y_20180514_15338_c2_12_11g	Y_20180514_15338_c2_12_12g	Y_20180514_15338_c2_12_3g	Y_20180514_15338_c2_12_4g	Y_20180514_15338_c2_13_2g	Y_20180514_15338_c2_13_3g	Y_20180514_15338_c2_14_3g	Y_20180514_15338_c2_15_4g	Y_20180514_15338_c2_16_7g	Y_20180514_15338_c2_19_3g	Y_20180514_15338_c2_21_4g	Y_20180514_15338_c2_21_5g	Y_20180514_15338_c2_21_7g	Y_20180514_15338_c2_22_2g	Y_20180514_15338_c2_23_1g	Y_20180514_15338_c2_23_3g	Y_20180514_15338_c2_23_4g	Y_20180514_15338_c2_25_2g	Y_20180514_15338_c2_25_3g	Y_20180514_15338_c2_26_6g	Y_20180514_15338_c2_27_2g	Y_20180514_15338_c2_27_3g	Y_20180514_15338_c2_29_2g	Y_20180514_15338_c2_29_3g	Y_20180514_15338_c2_29_4g	Y_20180514_15338_c2_29_5g	Y_20180514_15338_c2_3_2g	Y_20180514_15338_c2_3_5g	Y_20180514_15338_c2_30_1g	Y_20180514_15338_c2_30_3g	Y_20180514_15338_c2_31_1g	Y_20180514_15338_c2_31_2g	Y_20180514_15338_c2_31_5g	Y_20180514_15338_c2_32_2g	Y_20180514_15338_c2_32_3g	Y_20180514_15338_c2_32_4g	Y_20180514_15338_c2_33_3g	Y_20180514_15338_c2_33_5g	Y_20180514_15338_c2_34_4g	Y_20180514_15338_c2_34_5g	Y_20180514_15338_c2_34_6g	Y_20180514_15338_c2_34_9g	Y_20180514_15338_c2_35_4g	Y_20180514_15338_c2_36_1g	Y_20180514_15338_c2_4_4g	Y_20180514_15338_c2_6_2g	Y_20180514_15338_c2_7_4g	Y_20180514_15338_c2_8_3g	Y_20180514_15338_c2_9_5g	Y_20180514_15338_c2_9_6g
0	29129.775	32200.801	28385.9	29616.814	33832.949	31156.738	32085.869	31224.357	29498.385	32804.57	33695.57	35814.305	33949.523	31381.939	29600.871	27901.596	34971.172	32052.174	34653.348	32629.25	33969.281	30884.66	31862.916	32468.377	31427.74	30278.053	32497.029	33398.176	31112.117	27467.342	33558.184	32528	30295.15	31414.834	32713.785	28804.08	32005.641	34096.629	32161.805	34541.875	34156.504	32529.564	34115.785	32943.934	31578.043	34335.277	31299.793	30228.523	30261.742	33267.203	30941.279	32851.512
0.1334	29211.471	31908.115	27698.955	28840.607	33448.621	30911.236	32540.42	31333.504	29083.568	32388.057	34028.211	34543.605	32662.277	30537.098	31195.086	26536.967	33499.574	32966.594	33328.41	32003.314	34146.645	31994.746	31680.896	33932.652	31447.127	31495.406	32248.555	33869.234	31450.904	26854.396	32916.145	33210.168	31004.492	31750.916	33264.641	28458.234	31467.098	32841.16	32355.625	33748.285	33708.297	31786.691	33499.812	32481.781	32034.844	33203.234	33026.535	31413.863	31197.111	32332.002	31576.426	33487.41
0.2668	30203.459	32010.012	29087.918	28242.77	33987.312	31092.279	31697.453	31425.828	30054.922	32903.344	33590.977	34367.848	32036.791	30099.807	31190.303	27105.617	33270.781	34085.398	32733.895	30262.365	32254.609	30754.963	31202.365	33409.422	30701.357	34163.121	32161.859	33004.176	31150.686	28293.137	33148.602	32370.938	31572.029	32760.645	34814.734	29421.521	31568.805	31924.902	31220.602	33626.371	32582.789	31570.52	30873.961	33802.07	31695.045	33297.27	32272.633	32839.012	30605.131	32946.656	31686.934	32895.672
0.4003	30215.283	32824	29300.076	28615.662	33101.195	31685.262	32860.172	30971.658	31421.951	33614.008	34214.578	32850.426	31327.488	30235.537	30482.309	28301.061	35121.309	32862.273	30883.529	33275.836	33260.438	33264.711	30808.805	33754.945	30584.348	32199.531	33555.75	34085.062	31997.729	28698.475	34497.988	32848.367	31822.629	33985.84	34528.914	29615.027	33412.699	33787.41	32775.055	34678.02	33529.426	32987.777	31218.68	32490.664	34287.008	35708.348	33921.613	32140.461	29725.781	32905.172	31498.99	33350.531
0.5337	30468.578	33021.555	30513.254	29253.494	34174.945	31367.902	33790.422	32260.664	29093.043	33980.43	34685.645	33727.758	31965.684	31751.529	30895.219	28211.176	35057.656	32682.334	32952.781	33026.133	32394.791	33264.727	31701.891	31988.025	29784.152	32256.604	34092.395	34197.77	31964.818	28409.703	35048.715	33547.293	31714.836	34338.633	33472.23	29837.695	32997.809	33525.383	31587.705	34732.871	33221.84	31899.68	31201.623	33784.504	35812.496	34416.566	32901.395	30375.947	31866.209	32207.367	31590.338	34831.586
0.6671	31159.545	33690.02	30496.629	29307.918	32692.594	30838.258	32097.551	31881.021	31964.73	34222.176	33471.707	34185.402	32214.037	31463.695	32342.076	27352.59	35703.988	33172.418	31215.047	34501.637	31807.385	32353.062	31935.723	32498.312	29662.457	31983.902	34767.824	34256.125	32080.061	28691.848	34705.422	34497.516	32389.459	34206.406	32587.379	29654.791	32086.742	32785.289	32959.203	33706.566	34679.246	32652.408	30986.938	34646	34900.164	34620.66	34262.055	29923.623	31730.678	32101.484	33362.727	32051.404
0.8005	32723.619	35200.5	29549.064	29479.885	33268.746	31951.018	31311.723	33650.797	31446.652	34546.648	31776.361	35222.359	33281.344	30982.062	32917.852	28049.178	34434.504	33607.688	31042.756	36109.762	32900.699	33327.137	33579.051	32157.814	29054.93	31200.387	35405.773	34365.199	35446.941	29435.082	34468.527	34300.988	32678.455	33748.809	34019.324	28916.367	31696.988	33748.758	33172.023	36111.352	33637.973	33300.91	32824.309	33427.504	34450.535	35174.559	33504.137	31169.268	32195.514	31249.59	32650.689	33468.465
0.934	33114.457	35046.922	31461.621	29839.115	33865.102	31719.127	32670.016	36564.457	30714.863	35457.227	32758.172	34958.086	34396.91	33683.113	31188.236	27895.059	33255.293	35824.934	32302.465	34710.582	32902.023	33440.461	34020.445	31958.404	30302.436	32364.158	35295.32	34648.648	34544.098	30879.449	33811.066	33419.402	31542.654	32857.801	34059.762	30561.268	30211.846	36441.512	31896.02	38592.441	34132.945	32243.506	31753.209	33122.973	32982.773	35849.324	33101.406	31160.506	32826.141	32540.863	32224.648	34446.543
1.0674	32653.264	35149.781	29468.85	29438.631	36134.047	33032.418	32921.137	37457.805	31589.734	35705.902	34519.977	35989.648	33646.422	35667.859	31809.115	29710.938	35542.961	35558.809	32308.822	35893.355	31592.723	32624.975	32944.652	33316.652	31137.695	32849.289	34620.48	33902.301	33562.191	30689.037	33596.363	33781.016	32366.086	33381.648	34910.523	28841.984	33076.414	38186.367	33599.277	47385.453	33011.625	31358.293	32745.492	33652.586	33200.203	36812.992	31891.971	31214.729	34197.188	33878.016	32118.521	32923.902
1.2008	34918.898	34593.715	31227.129	30518.277	37184.438	33319.191	34225.477	42520.414	32134.555	35921.699	39498.875	35728.59	33304.516	47326.02	32269.992	31641.453	35951.117	39417.617	32251.254	36445.207	33267.621	33511.156	34587.359	33349.555	29358.41	32518.041	36811.02	34479.629	35872.461	31901.566	34597.793	36610.395	30666.016	34447.555	38143.602	29901.143	34751.188	38422.984	34066.633	55006.906	33785.309	33650.152	31806.396	33354.992	33251.047	37042.863	33589.438	30959.621	32661.049	33344.379	32047.318	34172.492
1.3342	34152.996	35485.023	31520.41	30097.184	41007.766	33757.02	33308.195	48250.133	31556.535	36623.902	45807.578	35545.82	35090.25	65460.738	36665.938	37101.754	34187.867	50115.871	31714.91	37334.32	33187.363	35095.48	36385.855	32268.215	30901.322	33559.117	40179.492	33095.758	38687.191	34689.504	34748.602	39374.316	31693.432	33376.953	44591.246	31117.48	37426.188	40660.863	32852.211	48056.016	33101.254	35652.914	32286.584	34126.02	34117.621	37486.812	34954.305	32227.971	32025.205	33640.098	34493.836	33232.52
1.4676	35540.027	36022.762	31021.475	31056.707	43757.816	34485.598	35966.059	47053.105	34613.602	37491.883	49644.531	35828.379	35985.969	71099.109	44642.145	48148.832	36044	58108.539	32449.803	44580.906	35919.359	36047.133	36586.371	34246.078	32004.678	32972.125	48569.656	34967.723	40157.754	43060.938	34292.422	48085.082	33929.668	34112.57	56310.219	32563.816	45074.105	41884.914	33216.266	38558.863	35441.051	40189.195	32513.76	34607.176	35541.16	38740.02	34232.148	32945.793	33971.406	35784.711	35213.531	33314.465
1.6011	39461.82	36436.684	32706.031	31528.799	55294.004	35616.27	38941.617	39716.887	40303.789	36946.23	44069.234	34336.645	35747.379	58131.664	55434.434	54847.863	35077.766	54421.48	30885.6	53988.375	42531.16	42083	35711.93	38589.414	32839.598	33950.785	67681.289	36971.941	49681.891	49106.191	34228.66	49050.102	33677.652	34869.727	61224.621	38018.336	50866.352	45133.668	34700.961	34535.512	37657.082	48649.816	31461.479	36263.637	37738.094	40956.586	36282.043	35761.176	35898.719	41196.953	39852.152	33933.055
1.7345	46301.723	38305.664	35266.465	34799.883	62996.594	35912.066	43303.727	35046.262	49512.484	38010.992	39761.27	36836.98	40099.562	42442.445	56375.121	48271.883	35413.797	42621.391	31761.459	54708.062	55952.684	51059.402	38864.82	47106.137	34639.047	34358.191	78922.938	44819.965	72495.891	41513.879	34618.227	40900.805	37682.617	35546.879	54088.902	44286.008	44078.703	53155.984	35646.961	NaN	42523.48	51305.078	32792.352	40853.742	45874.805	48486.914	37225.18	40457.195	41946.988	55261.328	50469.293	36615.57
1.8679	64801.359	39683.406	37503.352	43012.715	55733.039	35851.629	38694.465	33464.031	50126.98	40128.414	35317.027	40832.812	50209.422	36193.859	46058.691	36291.305	36049.215	36754.805	32869.941	47384.277	67714.102	64802.746	48888.473	47294.25	37947.195	35332.332	61610.336	60477.324	81125.523	34846.496	36364.824	36503.984	44293.055	39557.664	44705.102	47805.297	36850.82	60325.125	39439.723	NaN	54352.957	43821.391	34805.562	45531.305	56127.754	62344.965	36636.941	48538.934	45980.844	64490.762	65022.617	41950.199
2.0013	71092.039	50635.32	51007.105	45891.23	41529.344	34000.762	34813.324	33595.305	42062.402	44926.281	34753.992	54158.336	73417.133	34019.98	39213.387	30875.371	40538.484	34717.809	35466.469	38613.434	60095.242	63499.789	65543.828	40546.828	43415.492	37923.516	45269.395	65910.992	66022.109	31295.586	38758.418	34810.699	55968.473	47309.738	44479.98	41997.617	33198.34	53264.039	51993.316	NaN	67365.266	37578.348	39039.297	60572.902	56875.738	85447.445	35822.789	50765.559	47094.805	56544.02	64261.371	41206.996
2.1348	59969.793	71394.195	75259.898	40353.184	37483.93	34129.055	33100.527	33868.801	34873.457	50698.676	33736.578	66515.594	96129.398	32169.678	36415.582	29817.691	45837.055	34763.625	39156.648	38001.812	43355.805	51262.477	73813.5	38737.059	45849.027	44746.719	38454.746	55353.812	50228.496	NaN	48417.633	NaN	61569.977	57626.105	52434.688	36092.957	NaN	42208.91	68376.086	NaN	64849.609	34504.297	47334.254	82384.953	48090.637	97532.531	34995.039	43659.422	39661.457	43982.066	50523.84	38261.285
2.2682	45998.738	88521.477	92222.023	35396.816	35934.172	34959.938	34627.141	NaN	33370.844	65130.191	35011.961	61167.316	85452.43	NaN	35595.504	30229.791	59940.598	33934.059	46719.516	36008.148	35942.047	40726.367	57193.012	36023.938	42049.027	51912.844	34900.648	43825.914	42093.852	NaN	61272.832	NaN	51723.906	55236.691	NaN	37331.359	NaN	36346.73	73328.211	NaN	50755.125	35018.461	55168.406	81811.852	40037.238	80210.766	39777.719	47540.973	35251.953	37654.84	40647.293	34995.086
2.4016	40948.629	72200.156	66075.938	31397.424	35062.715	37049.855	NaN	NaN	32849.016	79278.422	34228.316	49810.699	59529.805	NaN	35200.625	30556.289	63820.699	33168.219	45734.375	35277.391	33935.746	36312.941	44017.398	37432.676	36534.707	45199.902	34081.531	37922.816	40156.309	NaN	62436.41	NaN	39551.707	44999.969	NaN	NaN	NaN	35657.961	57198.703	NaN	39092.238	35320.422	51745.508	59353.672	37786.945	57157.328	44426.715	63408.699	32689.406	35485.062	34744.301	33686.359
2.535	NaN	50778.512	47763.543	30016.822	33856.246	37461.441	NaN	NaN	32900.129	71161.016	NaN	41031.824	47558.656	NaN	NaN	NaN	60506.539	NaN	43310.629	36400.223	31380.596	35377.996	37574.707	37731.391	34340.098	37485.434	33164.172	34552.895	37150.059	NaN	55604.918	NaN	36190.66	37553.977	NaN	NaN	NaN	35401.805	43372.688	NaN	34813.961	32871.297	41183.387	44806.375	34389.301	48445.676	53787	NaN	33441.145	36178.164	34128.555	32967.113
2.6684	NaN	41856.695	37449.883	NaN	34697.98	42490.816	NaN	NaN	NaN	51559.191	NaN	37758.484	40481.621	NaN	NaN	NaN	47180.547	NaN	37401.805	33687.145	34253.172	35638.824	36539.637	NaN	35241.488	35520.688	33269.965	33791.699	NaN	NaN	48637.719	NaN	34942.977	33376.953	NaN	NaN	NaN	34514.836	37941.48	NaN	34879.551	33569.023	35634.148	38741.785	33193.703	NaN	54318.102	NaN	31845.109	35121.91	NaN	32643.193
2.8019	NaN	38185.832	NaN	NaN	NaN	51999.887	NaN	NaN	NaN	47348.602	NaN	37926.844	36893.27	NaN	NaN	NaN	39813.648	NaN	34228.348	33376.012	NaN	35619.941	35422.16	NaN	NaN	34985.215	NaN	NaN	NaN	NaN	46833.988	NaN	34480.809	33464.891	NaN	NaN	NaN	34290.836	36032.887	NaN	32754.299	34593.68	34819.102	36138.777	33963.266	NaN	46666.25	NaN	32263.352	NaN	NaN	32498.713
2.9353	NaN	37300.23	NaN	NaN	NaN	66189.242	NaN	NaN	NaN	51030.406	NaN	NaN	35581.125	NaN	NaN	NaN	38403.281	NaN	NaN	33212.551	NaN	NaN	NaN	NaN	NaN	34475.883	NaN	NaN	NaN	NaN	42499.875	NaN	38288.434	33095.625	NaN	NaN	NaN	NaN	35166.469	NaN	31510.068	NaN	35952.738	35867.73	32787.945	NaN	38934.453	NaN	32205.447	NaN	NaN	NaN
3.0687	NaN	39956.273	NaN	NaN	NaN	65907.672	NaN	NaN	NaN	66729.727	NaN	NaN	33440.289	NaN	NaN	NaN	36379.805	NaN	NaN	32745.756	NaN	NaN	NaN	NaN	NaN	34546.551	NaN	NaN	NaN	NaN	41495.516	NaN	NaN	NaN	NaN	NaN	NaN	NaN	35715.848	NaN	33132.203	NaN	34243.289	37298.941	32367.197	NaN	35320.418	NaN	31362.037	NaN	NaN	NaN
3.2021	NaN	NaN	NaN	NaN	NaN	53019.43	NaN	NaN	NaN	94197.117	NaN	NaN	NaN	NaN	NaN	NaN	35702.664	NaN	NaN	NaN	NaN	NaN	NaN	NaN	NaN	33341.977	NaN	NaN	NaN	NaN	NaN	NaN	NaN	NaN	NaN	NaN	NaN	NaN	35824.184	NaN	33102.047	NaN	NaN	NaN	NaN	NaN	35690.469	NaN	NaN	NaN	NaN	NaN
3.3356	NaN	NaN	NaN	NaN	NaN	41123.82	NaN	NaN	NaN	NaN	NaN	NaN	NaN	NaN	NaN	NaN	36053.754	NaN	NaN	NaN	NaN	NaN	NaN	NaN	NaN	31405.426	NaN	NaN	NaN	NaN	NaN	NaN	NaN	NaN	NaN	NaN	NaN	NaN	34704.719	NaN	34121.809	NaN	NaN	NaN	NaN	NaN	34994.008	NaN	NaN	NaN	NaN	NaN
3.469	NaN	NaN	NaN	NaN	NaN	38051.734	NaN	NaN	NaN	NaN	NaN	NaN	NaN	NaN	NaN	NaN	35296.281	NaN	NaN	NaN	NaN	NaN	NaN	NaN	NaN	31878.496	NaN	NaN	NaN	NaN	NaN	NaN	NaN	NaN	NaN	NaN	NaN	NaN	34304.25	NaN	33297.633	NaN	NaN	NaN	NaN	NaN	35078.977	NaN	NaN	NaN	NaN	NaN
3.6024	NaN	NaN	NaN	NaN	NaN	36965.793	NaN	NaN	NaN	NaN	NaN	NaN	NaN	NaN	NaN	NaN	35791.621	NaN	NaN	NaN	NaN	NaN	NaN	NaN	NaN	33316.078	NaN	NaN	NaN	NaN	NaN	NaN	NaN	NaN	NaN	NaN	NaN	NaN	32650.584	NaN	33849.918	NaN	NaN	NaN	NaN	NaN	NaN	NaN	NaN	NaN	NaN	NaN
3.7358	NaN	NaN	NaN	NaN	NaN	36914.664	NaN	NaN	NaN	NaN	NaN	NaN	NaN	NaN	NaN	NaN	34016.805	NaN	NaN	NaN	NaN	NaN	NaN	NaN	NaN	NaN	NaN	NaN	NaN	NaN	NaN	NaN	NaN	NaN	NaN	NaN	NaN	NaN	NaN	NaN	NaN	NaN	NaN	NaN	NaN	NaN	NaN	NaN	NaN	NaN	NaN	NaN
3.8692	NaN	NaN	NaN	NaN	NaN	34453.676	NaN	NaN	NaN	NaN	NaN	NaN	NaN	NaN	NaN	NaN	34354.102	NaN	NaN	NaN	NaN	NaN	NaN	NaN	NaN	NaN	NaN	NaN	NaN	NaN	NaN	NaN	NaN	NaN	NaN	NaN	NaN	NaN	NaN	NaN	NaN	NaN	NaN	NaN	NaN	NaN	NaN	NaN	NaN	NaN	NaN	NaN
4.0027	NaN	NaN	NaN	NaN	NaN	33967.398	NaN	NaN	NaN	NaN	NaN	NaN	NaN	NaN	NaN	NaN	NaN	NaN	NaN	NaN	NaN	NaN	NaN	NaN	NaN	NaN	NaN	NaN	NaN	NaN	NaN	NaN	NaN	NaN	NaN	NaN	NaN	NaN	NaN	NaN	NaN	NaN	NaN	NaN	NaN	NaN	NaN	NaN	NaN	NaN	NaN	NaN
4.1361	NaN	NaN	NaN	NaN	NaN	32762.867	NaN	NaN	NaN	NaN	NaN	NaN	NaN	NaN	NaN	NaN	NaN	NaN	NaN	NaN	NaN	NaN	NaN	NaN	NaN	NaN	NaN	NaN	NaN	NaN	NaN	NaN	NaN	NaN	NaN	NaN	NaN	NaN	NaN	NaN	NaN	NaN	NaN	NaN	NaN	NaN	NaN	NaN	NaN	NaN	NaN	NaN
4.2695	NaN	NaN	NaN	NaN	NaN	NaN	NaN	NaN	NaN	NaN	NaN	NaN	NaN	NaN	NaN	NaN	NaN	NaN	NaN	NaN	NaN	NaN	NaN	NaN	NaN	NaN	NaN	NaN	NaN	NaN	NaN	NaN	NaN	NaN	NaN	NaN	NaN	NaN	NaN	NaN	NaN	NaN	NaN	NaN	NaN	NaN	NaN	NaN	NaN	NaN	NaN	NaN
4.4029	NaN	NaN	NaN	NaN	NaN	NaN	NaN	NaN	NaN	NaN	NaN	NaN	NaN	NaN	NaN	NaN	NaN	NaN	NaN	NaN	NaN	NaN	NaN	NaN	NaN	NaN	NaN	NaN	NaN	NaN	NaN	NaN	NaN	NaN	NaN	NaN	NaN	NaN	NaN	NaN	NaN	NaN	NaN	NaN	NaN	NaN	NaN	NaN	NaN	NaN	NaN	NaN
4.5363	NaN	NaN	NaN	NaN	NaN	NaN	NaN	NaN	NaN	NaN	NaN	NaN	NaN	NaN	NaN	NaN	NaN	NaN	NaN	NaN	NaN	NaN	NaN	NaN	NaN	NaN	NaN	NaN	NaN	NaN	NaN	NaN	NaN	NaN	NaN	NaN	NaN	NaN	NaN	NaN	NaN	NaN	NaN	NaN	NaN	NaN	NaN	NaN	NaN	NaN	NaN	NaN
4.6698	NaN	NaN	NaN	NaN	NaN	NaN	NaN	NaN	NaN	NaN	NaN	NaN	NaN	NaN	NaN	NaN	NaN	NaN	NaN	NaN	NaN	NaN	NaN	NaN	NaN	NaN	NaN	NaN	NaN	NaN	NaN	NaN	NaN	NaN	NaN	NaN	NaN	NaN	NaN	NaN	NaN	NaN	NaN	NaN	NaN	NaN	NaN	NaN	NaN	NaN	NaN	NaN
4.8032	NaN	NaN	NaN	NaN	NaN	NaN	NaN	NaN	NaN	NaN	NaN	NaN	NaN	NaN	NaN	NaN	NaN	NaN	NaN	NaN	NaN	NaN	NaN	NaN	NaN	NaN	NaN	NaN	NaN	NaN	NaN	NaN	NaN	NaN	NaN	NaN	NaN	NaN	NaN	NaN	NaN	NaN	NaN	NaN	NaN	NaN	NaN	NaN	NaN	NaN	NaN	NaN
4.9366	NaN	NaN	NaN	NaN	NaN	NaN	NaN	NaN	NaN	NaN	NaN	NaN	NaN	NaN	NaN	NaN	NaN	NaN	NaN	NaN	NaN	NaN	NaN	NaN	NaN	NaN	NaN	NaN	NaN	NaN	NaN	NaN	NaN	NaN	NaN	NaN	NaN	NaN	NaN	NaN	NaN	NaN	NaN	NaN	NaN	NaN	NaN	NaN	NaN	NaN	NaN	NaN
5.07	NaN	NaN	NaN	NaN	NaN	NaN	NaN	NaN	NaN	NaN	NaN	NaN	NaN	NaN	NaN	NaN	NaN	NaN	NaN	NaN	NaN	NaN	NaN	NaN	NaN	NaN	NaN	NaN	NaN	NaN	NaN	NaN	NaN	NaN	NaN	NaN	NaN	NaN	NaN	NaN	NaN	NaN	NaN	NaN	NaN	NaN	NaN	NaN	NaN	NaN	NaN	NaN
5.2035	NaN	NaN	NaN	NaN	NaN	NaN	NaN	NaN	NaN	NaN	NaN	NaN	NaN	NaN	NaN	NaN	NaN	NaN	NaN	NaN	NaN	NaN	NaN	NaN	NaN	NaN	NaN	NaN	NaN	NaN	NaN	NaN	NaN	NaN	NaN	NaN	NaN	NaN	NaN	NaN	NaN	NaN	NaN	NaN	NaN	NaN	NaN	NaN	NaN	NaN	NaN	NaN
