x	Y_20180514_15323_13_1g	Y_20180514_15323_22_9g	Y_20180514_15323_24_14g	Y_20180514_15323_24_2g	Y_20180514_15323_24_4g	Y_20180514_15323_25_5g	Y_20180514_15323_26_3g	Y_20180514_15323_27_2g	Y_20180514_15323_28_14g	Y_20180514_15323_6_17g	Y_20180514_15323_9_13g
0	11928.0752	14661.9775	15526.9082	11596.9678	12315.9238	13095.2607	14308.125	14061.6572	16920.0645	13711.458	12171.042
0.1334	12036.0449	15440.0742	16277.9414	13163.2627	12602.5	13752.3584	15690.8115	15889.3525	16977.8613	13873.665	11969.0234
0.2668	13697.4814	16045.1348	16639.0684	14717.875	12473.6182	15274.6123	20284.9395	19760.2266	19177.3711	15243.4629	11986.7686
0.4003	16555.6934	19821.3125	20204.8184	17866.0312	13442.8594	20281.0684	27777.2285	26485.707	23092.3574	15821.3076	12800.8555
0.5337	21532.9648	21893.0801	22646.3262	27299.7734	15726.7939	29773.8535	39511.6016	35573.8359	23743.3809	17415.6719	13592.5332
0.6671	22935.2012	20126.6836	22691.7148	38947.9375	17665.0625	43314.9922	42580.7344	34525.0156	21176.291	17433.7578	15082.7451
0.8005	19422.6094	18244.8242	18428.9297	43760.4883	24593.7422	42620.3711	36889.5586	27190.6895	20730.5	20637.9102	17921.1641
0.934	16882.1934	17896.9023	15231.8936	34170.7891	36268.1602	32807.6289	29305.0195	23402.5703	19672.0273	28547.0293	22834.6504
1.0674	15997.1016	18381.5449	15167.8613	25099.2344	40772.7305	23871.7305	23881.9238	21859.0137	19539.3242	35885.3906	25583.457
1.2008	16002.874	18542.0273	15736.04	21067.9941	36295.3203	21737.373	21697.0879	19722.1934	18499.6289	38018.2812	24649.1133
1.3342	17158.1289	18031.6758	17018.0488	17677.8711	32164.9707	19150.0879	19377.5488	17702.1992	18842.3496	33367.6836	22840.3184
1.4676	17027.3906	17579.4062	18022.7441	17902.1348	31046.1758	19798.6309	19835.2109	17018.9941	17912.5117	28379.9883	23145.0723
1.6011	15602.1875	17444.5332	16791.2266	18195.6914	26991.2773	20223.082	18963.4375	16271.6396	17773.0645	29730.8809	23024.291
1.7345	14542.7412	19668.2012	16697.8867	18822.7852	23819.6582	19141.7676	18344.4199	15415.873	16801.1055	30211.7852	24126.8223
1.8679	14246.9941	20077.2578	15583.5557	17778.7637	21869.2676	18299.4883	17460.3926	14420.4902	15513.833	26685.7559	21591.7812
2.0013	13604.6074	17887.6973	15146.0225	16961.7246	19439.6484	16373.4736	17375.0117	13092.2617	14316.0059	22544.7051	18306.4258
2.1347	12860.8018	15686.0176	15676.4014	16568.3535	18674.418	15626.5674	15741.1289	12247.0215	14529.7441	22101.6074	17515.707
2.2682	12685.8828	14677.3555	15461.3848	15349.6582	18098.6445	14378.7871	15322.4092	12596.8955	15006.2139	19900.4492	15676.9863
2.4016	12092.6973	13719.9424	15996.4258	16490.8867	16940.0078	14429.6875	14136.4268	12512.8662	14401.0029	17357.0605	14000.4922
2.535	12589.9902	13275.4092	16180.0088	15700.6934	15890.7754	13563.1865	14144.8311	NaN	NaN	15557.3613	14627.1152
2.6684	13073.8467	13315.626	16294.2549	15309.1377	14509.7412	13304.7783	15231.7539	NaN	NaN	13993.6162	13899.7207
2.8019	NaN	NaN	15775.3789	NaN	14227.0771	12777.7354	NaN	NaN	NaN	13682.8037	13768.3584
2.9353	NaN	NaN	15613.0801	NaN	NaN	12141.8037	NaN	NaN	NaN	13084.3857	NaN
3.0687	NaN	NaN	16088.9727	NaN	NaN	NaN	NaN	NaN	NaN	12836.8438	NaN
3.2021	NaN	NaN	15700.8379	NaN	NaN	NaN	NaN	NaN	NaN	12722.1895	NaN
3.3355	NaN	NaN	NaN	NaN	NaN	NaN	NaN	NaN	NaN	NaN	NaN
3.469	NaN	NaN	NaN	NaN	NaN	NaN	NaN	NaN	NaN	NaN	NaN
3.6024	NaN	NaN	NaN	NaN	NaN	NaN	NaN	NaN	NaN	NaN	NaN
3.7358	NaN	NaN	NaN	NaN	NaN	NaN	NaN	NaN	NaN	NaN	NaN
3.8692	NaN	NaN	NaN	NaN	NaN	NaN	NaN	NaN	NaN	NaN	NaN
4.0027	NaN	NaN	NaN	NaN	NaN	NaN	NaN	NaN	NaN	NaN	NaN
4.1361	NaN	NaN	NaN	NaN	NaN	NaN	NaN	NaN	NaN	NaN	NaN
4.2695	NaN	NaN	NaN	NaN	NaN	NaN	NaN	NaN	NaN	NaN	NaN
4.4029	NaN	NaN	NaN	NaN	NaN	NaN	NaN	NaN	NaN	NaN	NaN
4.5363	NaN	NaN	NaN	NaN	NaN	NaN	NaN	NaN	NaN	NaN	NaN
4.6698	NaN	NaN	NaN	NaN	NaN	NaN	NaN	NaN	NaN	NaN	NaN
4.8032	NaN	NaN	NaN	NaN	NaN	NaN	NaN	NaN	NaN	NaN	NaN
4.9366	NaN	NaN	NaN	NaN	NaN	NaN	NaN	NaN	NaN	NaN	NaN
5.07	NaN	NaN	NaN	NaN	NaN	NaN	NaN	NaN	NaN	NaN	NaN
5.2035	NaN	NaN	NaN	NaN	NaN	NaN	NaN	NaN	NaN	NaN	NaN
5.3369	NaN	NaN	NaN	NaN	NaN	NaN	NaN	NaN	NaN	NaN	NaN
5.4703	NaN	NaN	NaN	NaN	NaN	NaN	NaN	NaN	NaN	NaN	NaN
5.6037	NaN	NaN	NaN	NaN	NaN	NaN	NaN	NaN	NaN	NaN	NaN
5.7371	NaN	NaN	NaN	NaN	NaN	NaN	NaN	NaN	NaN	NaN	NaN
5.8706	NaN	NaN	NaN	NaN	NaN	NaN	NaN	NaN	NaN	NaN	NaN
6.004	NaN	NaN	NaN	NaN	NaN	NaN	NaN	NaN	NaN	NaN	NaN
6.1374	NaN	NaN	NaN	NaN	NaN	NaN	NaN	NaN	NaN	NaN	NaN
6.2708	NaN	NaN	NaN	NaN	NaN	NaN	NaN	NaN	NaN	NaN	NaN
6.4042	NaN	NaN	NaN	NaN	NaN	NaN	NaN	NaN	NaN	NaN	NaN
6.5377	NaN	NaN	NaN	NaN	NaN	NaN	NaN	NaN	NaN	NaN	NaN
6.6711	NaN	NaN	NaN	NaN	NaN	NaN	NaN	NaN	NaN	NaN	NaN
