0.0000	31554.9473
0.1334	32032.2480
0.2668	31328.5078
0.4003	32201.0801
0.5337	33053.0195
0.6671	33586.2695
0.8005	33265.7734
0.9340	32918.5391
1.0674	32243.5762
1.2008	31790.7793
1.3342	32673.5273
1.4676	31726.8281
1.6011	32274.5332
1.7345	32293.4824
1.8679	30514.0527
2.0013	32664.0039
2.1347	33074.3984
2.2682	37345.9219
2.4016	50619.7461
2.5350	72285.1406
2.6684	88705.5859
2.8019	74139.8516
2.9353	49992.7891
3.0687	41768.5469
3.2021	38676.7695
