x	Y_20180514_15325_15_2g	Y_20180514_15325_16_8g	Y_20180514_15325_2_2g	Y_20180514_15325_2_4g	Y_20180514_15325_20_5g	Y_20180514_15325_24_3g	Y_20180514_15325_26_6g	Y_20180514_15325_26_8g	Y_20180514_15325_3_3g	Y_20180514_15325_30_5g	Y_20180514_15325_5_13g	Y_20180514_15325_6_6g	Y_20180514_15325_9_3g
0	14228.4717	14022.6357	13540.0254	14793.6543	16092.957	13184.7832	14604.5332	14500.3828	13853.2568	14255.8906	11565.668	12453.2217	15554.4961
0.1334	15119.3721	13816.0928	14091.2275	15135.7275	16729.0742	13802.5215	14899.9482	13945.7051	13852.7705	13562.1514	12118.4424	12602.1123	16894.5371
0.2668	14787.4639	14744.3115	16696.1543	16544.9199	18302.8496	14814.5918	16269.7285	13930.0332	14053.5156	14373.0908	12850.7422	13077.209	16573.5117
0.4003	16697.8555	16918.9414	18858.1465	20733.4199	23002.4473	17397.3887	18986.3418	15178.8154	14009.0059	14825.9814	14337.3916	14525.0117	18027.5273
0.5337	19923.1895	19041.5801	19088.6934	28909.5547	30695.5117	22668.8027	24884.2773	18833.4648	15129.2295	16250.5273	18459.7285	18332.043	20256.4414
0.6671	21776.7676	23799.8027	16873.1211	32031.1406	34363.7656	23518.416	28011.4668	21297.1914	15509.7461	20689.5508	21165.3477	24155.1113	23520.457
0.8005	19737.0449	23450.0645	15437.5791	26512.1777	29579.8379	20013.3809	23871.3066	21070.1973	17182.375	24456.873	19023.1152	24653.623	23904.2695
0.934	16386.9395	20710.1445	15704.0361	23897.6621	23267.9824	18288.7969	21194.5625	17155.748	21005.0488	25672.9766	17573.4082	19997.7949	21287.543
1.0674	14654.6797	17971.8867	15737.7188	22529.4492	23079.6895	16817.082	20141.2656	16399.1484	22966.1758	22150.7266	17523.5	16397.8867	19285.0957
1.2008	14414.5771	16154.9492	16209.1289	22058.2324	24829.6094	15206.707	18061.1543	16209.1592	21565.1211	20448.2461	17190.7305	14731.8428	17839.9902
1.3342	14359.2158	14731.5859	18081.457	20936.75	25248.0234	14426.4395	18506.8066	16723.0625	18538.8281	19880.8867	16385.9453	13245.9082	16834.9766
1.4676	14241.7402	15158.9883	20000.2012	19797.8613	23729.3652	14451.1152	17458.1309	18062.8223	16840.1914	20654.9375	18899.5156	13821.668	15724.0928
1.6011	14824.2588	15074.7754	19426.0137	18147.127	20809.7402	14579.6494	16734.8242	18404.8711	15295.6719	19868.6484	20042.4648	13473.792	14623.0771
1.7345	16541.8008	15700.5605	17587.1309	15269.3096	17238.041	14857.4258	14880.0479	16135.6875	14622.6318	18459.8945	20300.5977	13844.2188	14016.5732
1.8679	17843.7578	15444.9004	15352.3066	13630.2744	14653.0098	15344.4287	14649.3564	14063.0166	15443.0254	18236.3633	22152.082	14077.8633	13462.0635
2.0013	19101.7578	14904.6758	13343.3594	13794.5996	13098.5391	14758.2236	14339.0938	13463.8652	16085.4199	17058.2793	22312.0938	15004.834	13317.4873
2.1347	19962.9336	14471.9102	12941.3643	12998.0752	11940.7676	13950.2939	13393.957	13475.9873	16650.5898	16007.5908	17256.1387	16308.7607	13809.3076
2.2682	19808.6152	NaN	12362.1025	13241.9053	11426.1201	13757.6934	13109.6484	13653.4502	18303.8438	14845.9766	14191.1582	16507.8281	NaN
2.4016	NaN	NaN	12898.0693	12849.2725	11395.8213	13257.5459	12855.9443	13665.0615	17881.3555	14420.543	12911.0947	16640.2168	NaN
2.535	NaN	NaN	NaN	12650.4277	11631.2744	13396.5215	12777.5381	NaN	17655.6328	13551.5332	12371.1338	NaN	NaN
2.6684	NaN	NaN	NaN	13539.3174	12302.2832	NaN	12885.168	NaN	17089.2539	NaN	11584.3174	NaN	NaN
2.8019	NaN	NaN	NaN	13477.2803	NaN	NaN	NaN	NaN	17167.9668	NaN	NaN	NaN	NaN
2.9353	NaN	NaN	NaN	NaN	NaN	NaN	NaN	NaN	17532.2539	NaN	NaN	NaN	NaN
3.0687	NaN	NaN	NaN	NaN	NaN	NaN	NaN	NaN	NaN	NaN	NaN	NaN	NaN
3.2021	NaN	NaN	NaN	NaN	NaN	NaN	NaN	NaN	NaN	NaN	NaN	NaN	NaN
3.3355	NaN	NaN	NaN	NaN	NaN	NaN	NaN	NaN	NaN	NaN	NaN	NaN	NaN
3.469	NaN	NaN	NaN	NaN	NaN	NaN	NaN	NaN	NaN	NaN	NaN	NaN	NaN
3.6024	NaN	NaN	NaN	NaN	NaN	NaN	NaN	NaN	NaN	NaN	NaN	NaN	NaN
3.7358	NaN	NaN	NaN	NaN	NaN	NaN	NaN	NaN	NaN	NaN	NaN	NaN	NaN
3.8692	NaN	NaN	NaN	NaN	NaN	NaN	NaN	NaN	NaN	NaN	NaN	NaN	NaN
4.0027	NaN	NaN	NaN	NaN	NaN	NaN	NaN	NaN	NaN	NaN	NaN	NaN	NaN
4.1361	NaN	NaN	NaN	NaN	NaN	NaN	NaN	NaN	NaN	NaN	NaN	NaN	NaN
4.2695	NaN	NaN	NaN	NaN	NaN	NaN	NaN	NaN	NaN	NaN	NaN	NaN	NaN
4.4029	NaN	NaN	NaN	NaN	NaN	NaN	NaN	NaN	NaN	NaN	NaN	NaN	NaN
4.5363	NaN	NaN	NaN	NaN	NaN	NaN	NaN	NaN	NaN	NaN	NaN	NaN	NaN
4.6698	NaN	NaN	NaN	NaN	NaN	NaN	NaN	NaN	NaN	NaN	NaN	NaN	NaN
4.8032	NaN	NaN	NaN	NaN	NaN	NaN	NaN	NaN	NaN	NaN	NaN	NaN	NaN
4.9366	NaN	NaN	NaN	NaN	NaN	NaN	NaN	NaN	NaN	NaN	NaN	NaN	NaN
5.07	NaN	NaN	NaN	NaN	NaN	NaN	NaN	NaN	NaN	NaN	NaN	NaN	NaN
5.2035	NaN	NaN	NaN	NaN	NaN	NaN	NaN	NaN	NaN	NaN	NaN	NaN	NaN
5.3369	NaN	NaN	NaN	NaN	NaN	NaN	NaN	NaN	NaN	NaN	NaN	NaN	NaN
5.4703	NaN	NaN	NaN	NaN	NaN	NaN	NaN	NaN	NaN	NaN	NaN	NaN	NaN
5.6037	NaN	NaN	NaN	NaN	NaN	NaN	NaN	NaN	NaN	NaN	NaN	NaN	NaN
5.7371	NaN	NaN	NaN	NaN	NaN	NaN	NaN	NaN	NaN	NaN	NaN	NaN	NaN
5.8706	NaN	NaN	NaN	NaN	NaN	NaN	NaN	NaN	NaN	NaN	NaN	NaN	NaN
