0.00000,13335.378
0.13342,14304.891
0.26684,15192.045
0.40027,16078.031
0.53369,19225.195
0.66711,23873.820
0.80053,22911.885
0.93395,22909.410
1.06737,19707.889
1.20080,19793.498
1.33422,19669.316
1.46764,19221.500
1.60106,18671.088
1.73448,17637.672
1.86791,17706.059
2.00133,17398.896
2.13475,15267.132
2.26817,13824.226
2.40159,13256.711
2.53502,12125.365
2.66844,12398.543
2.80186,12534.987
