X,Y
0.00000,12287.141
0.13342,13248.297
0.26684,13898.598
0.40027,17419.217
0.53369,20863.037
0.66711,19376.078
0.80053,18138.686
0.93395,16785.934
1.06737,15807.231
1.20080,15046.703
1.33422,16555.717
1.46764,16510.588
1.60106,16203.996
1.73448,16078.177
1.86791,15715.857
2.00133,15956.342
2.13475,15915.426
2.26817,15033.097
2.40159,14532.063
2.53502,13969.961
2.66844,12269.650
2.80186,11919.618
2.93528,12646.031
3.06870,11669.990
