x	Y_20180514_15325_10_5g	Y_20180514_15325_12_1g	Y_20180514_15325_16_3g	Y_20180514_15325_16_5g	Y_20180514_15325_16_6g	Y_20180514_15325_17_10g	Y_20180514_15325_18_1g	Y_20180514_15325_22_5g	Y_20180514_15325_24_2g	Y_20180514_15325_25_5g	Y_20180514_15325_25_6g	Y_20180514_15325_27_2g	Y_20180514_15325_28_7g	Y_20180514_15325_31_3g	Y_20180514_15325_31_4g	Y_20180514_15325_4_3g	Y_20180514_15325_5_2g	Y_20180514_15325_7_7g
0	34620.0703	33422.5742	34029.2266	34830.9414	29386.2949	29733.4023	28988.2441	35890.7305	35753.0977	35891.3398	35142.8086	35376.1094	32305.1992	35071.7227	32326	32482.0449	33458.3867	31759.293
0.1334	33457.168	33625.7734	33938.1367	35083.0195	30198.5391	30059.4824	28493.8848	34660.1953	37233.6758	35378.4453	35896.5273	33745.6211	32243.168	34078.9492	31842.248	33015.9375	32232.1465	32449.3398
0.2668	32556.7012	33073.8828	34772.9141	32514.1035	29529.4941	31247.7324	27495.8965	34656.75	38337.3203	35237.8125	34650.6211	34834.8359	33272.0703	34332.3867	31844.25	33291.7812	34472.9727	31847.5
0.4003	34191.3867	33785.1641	32148.4883	34358.5391	29495.7305	32130.4824	26944.7832	33925.0117	36779.6719	35405.2422	37286.4453	34454.5938	32034.1562	36186.6523	31986.4902	32619.6484	32580.7148	31904.6934
0.5337	33836.375	35994.1445	33720.8359	34872.8242	29153.0879	31062.2188	26814.373	34180.3828	35756.0781	36261.8438	36156.0234	34583.2305	32201.3418	36217.5664	32702.7441	33140.5391	33375.6719	32257.9141
0.6671	33837.3477	35233.8789	32595.4727	35705.7969	30861.6152	31011.3438	26181.2441	34625.9766	36323.9297	36758.3672	36993.1133	35390.6797	32703.5195	36883.6172	32703.5938	32721.3145	32642.5039	32762.5938
0.8005	33668.2031	36181.3711	31599.4023	35969.418	31532.7188	30862.8223	27224.0371	34278.1445	36767.5273	36794.5781	36477.3711	34819.0938	33935.0781	36088.4023	32263.2422	32582.8828	32482.8867	33404.5312
0.934	34870.8828	34531.4258	31595.5176	34989.043	31590.9844	31307.6816	27321.3164	34625.1992	37804.0898	34142.2812	35350.7266	36659.4844	32104.0098	36224.1641	31991.0156	32565.2129	32509.9277	34193.8281
1.0674	33600.4258	36045.918	32399.0605	35608.4922	29623.8594	32619.4512	27920.3496	33933.9648	39306.875	37026.957	35384.5391	36539.8477	33766.7969	35706.582	32765.5918	34235.6641	33033.3594	32091.377
1.2008	33664.957	36096.7109	32623.4238	35478.3945	30775.7656	32655.8203	27049.6934	35431.4648	40396.7227	35433.9531	33554.7266	35675.418	33493.3438	34671.6758	33904.2109	32597.4883	31920.6719	33460.7852
1.3342	34503.2148	35235.8242	30976.3574	36876.4297	30966.4805	32706.8496	26336.1758	35145.0078	38357.0469	36965.0938	33449.7148	36393.8008	34814.7461	35994.6992	33300.7695	33504.4102	32400.1348	33591.7305
1.4676	32330.0859	34504.832	31390.041	37315.0859	29334.6035	31952.4297	27315.0195	35645.8867	38314.3398	35300.207	33870.7852	35448.3945	33980.9766	35127.4922	34495.6289	32123.3477	33139.1641	33482.8164
1.6011	31961.2246	34043.3555	32976.9844	36608.0586	30491.9941	32592.3418	27017.1953	34329.3047	38001.8906	36793.6016	33327.4883	36339.9297	36313.8008	34234.3594	34798.5273	31637.5156	32694.0332	34537.3906
1.7345	34168.0898	34900.8203	33362.9883	37823.9023	30274.9785	32292.959	27708.9531	34825.5586	38993.875	37140.6445	34429.0117	35572.1445	35197.9375	35206.707	33785.7266	32312.0547	32319.0547	34320.168
1.8679	34882.8711	33464.9297	33484.8516	40427.2773	29305.0762	31138.4395	27383.584	34443	39155.5195	35814.1836	35566.832	36055.5859	34660.8945	33514.9258	35176.1055	33463.8242	31330.8262	34557.2422
2.0013	34889.6562	34394.1875	34209.8594	39805.8008	29132.5938	33044.7383	27524.3906	34723.0703	40007.918	36188.2773	35653.0898	38033.8203	33942.8086	35344.9258	38599.2969	35594.2148	32017.2148	35071.043
2.1347	36343.1602	34535.0352	34944.4648	43345.5898	29687.9375	33255.3828	28857.8535	37080.4961	40104.6133	37614.9805	36126.8477	40679.5352	34887.3672	36402.2461	41974.6836	34607.9805	32219.3008	35033.5625
2.2682	39211.3008	33896.6367	36833.8711	51881.1055	30246.8281	38827.8906	31564.8965	39474.8789	42266.4727	39403.5898	36543.1875	44936.4453	35639.75	36845.3984	51095.125	34771.9336	35427.3867	37998.1797
2.4016	46715.2031	35850.3359	41768.5273	58926.8594	30003.4883	54292.9844	38356.3633	42941.2109	46756.8164	42180.0352	38958.7227	58161.625	35006.2891	40876.4648	76230.9141	37834.2852	37840.4258	43016.0977
2.535	62382.3008	43324.5039	59552.5312	65220.9531	32161.4336	84139.6406	55845.5977	59374.707	57540.668	48494.1172	42808.3789	82353.4375	39256.8125	53824.6836	96896.4531	41927.7422	48772.9766	56915.0469
2.6684	87581.6016	55669.5195	80967.0703	67909.1406	38386.9883	105448.3359	78839.7188	81204.75	86912.6875	65874.625	54523.1992	86767.1797	44247.1992	85341.1016	81879.7109	60569.1211	67506.7344	88610.3359
2.8019	83477.2656	78805.5625	81666.3047	58504.2266	53531.3516	92671.3203	74053.4531	85545.2188	142760.1719	98428.5234	73557.8984	65871.2734	62417.1562	135942.8125	54672.1211	78714.3594	88715.6406	103171.6094
2.9353	60135.4805	75566.3984	60722.5703	47852.3398	68687.4219	58735.3672	51133.5391	62095.8555	194316.4844	105038.2109	85346.25	46514.2227	100403.75	141974.8594	41886.9883	72075.3672	79082.2188	79097.6406
3.0687	46104.7734	56079.3555	42573.5156	42293.4609	63620.6367	45238.2617	34762.2383	44999.4258	167793.6406	76930.3828	68357.7188	40389.0625	128275.2734	93894.7109	36647.1719	53297.957	53153.0938	51356.3477
3.2021	38563.8984	41975.832	37118.9961	40503.9336	48298.3281	NaN	NaN	NaN	100045.2344	51005.4961	49393.7422	37270.1836	107086.7031	60594.2383	36399.8203	39380.3633	38681.1562	38443.5781
3.3355	37563.8164	40723.4141	37018.9531	NaN	40079.7344	NaN	NaN	NaN	56584.8008	NaN	41555.9961	NaN	66867.4844	45052.3906	37860.9648	37534.3984	26287.4688	NaN
3.469	37103.457	40255.0586	NaN	NaN	34042.7969	NaN	NaN	NaN	44656.2109	NaN	37953.168	NaN	47023.7969	39098.5977	NaN	36225.3867	NaN	NaN
3.6024	36706.9492	NaN	NaN	NaN	31807.332	NaN	NaN	NaN	NaN	NaN	NaN	NaN	41534.0195	37813.5391	NaN	36520.1016	NaN	NaN
3.7358	NaN	NaN	NaN	NaN	NaN	NaN	NaN	NaN	NaN	NaN	NaN	NaN	41258.1719	NaN	NaN	NaN	NaN	NaN
3.8692	NaN	NaN	NaN	NaN	NaN	NaN	NaN	NaN	NaN	NaN	NaN	NaN	41493.7227	NaN	NaN	NaN	NaN	NaN
4.0027	NaN	NaN	NaN	NaN	NaN	NaN	NaN	NaN	NaN	NaN	NaN	NaN	38888.207	NaN	NaN	NaN	NaN	NaN
4.1361	NaN	NaN	NaN	NaN	NaN	NaN	NaN	NaN	NaN	NaN	NaN	NaN	NaN	NaN	NaN	NaN	NaN	NaN
4.2695	NaN	NaN	NaN	NaN	NaN	NaN	NaN	NaN	NaN	NaN	NaN	NaN	NaN	NaN	NaN	NaN	NaN	NaN
4.4029	NaN	NaN	NaN	NaN	NaN	NaN	NaN	NaN	NaN	NaN	NaN	NaN	NaN	NaN	NaN	NaN	NaN	NaN
4.5363	NaN	NaN	NaN	NaN	NaN	NaN	NaN	NaN	NaN	NaN	NaN	NaN	NaN	NaN	NaN	NaN	NaN	NaN
4.6698	NaN	NaN	NaN	NaN	NaN	NaN	NaN	NaN	NaN	NaN	NaN	NaN	NaN	NaN	NaN	NaN	NaN	NaN
4.8032	NaN	NaN	NaN	NaN	NaN	NaN	NaN	NaN	NaN	NaN	NaN	NaN	NaN	NaN	NaN	NaN	NaN	NaN
4.9366	NaN	NaN	NaN	NaN	NaN	NaN	NaN	NaN	NaN	NaN	NaN	NaN	NaN	NaN	NaN	NaN	NaN	NaN
5.07	NaN	NaN	NaN	NaN	NaN	NaN	NaN	NaN	NaN	NaN	NaN	NaN	NaN	NaN	NaN	NaN	NaN	NaN
5.2035	NaN	NaN	NaN	NaN	NaN	NaN	NaN	NaN	NaN	NaN	NaN	NaN	NaN	NaN	NaN	NaN	NaN	NaN
5.3369	NaN	NaN	NaN	NaN	NaN	NaN	NaN	NaN	NaN	NaN	NaN	NaN	NaN	NaN	NaN	NaN	NaN	NaN
5.4703	NaN	NaN	NaN	NaN	NaN	NaN	NaN	NaN	NaN	NaN	NaN	NaN	NaN	NaN	NaN	NaN	NaN	NaN
5.6037	NaN	NaN	NaN	NaN	NaN	NaN	NaN	NaN	NaN	NaN	NaN	NaN	NaN	NaN	NaN	NaN	NaN	NaN
5.7371	NaN	NaN	NaN	NaN	NaN	NaN	NaN	NaN	NaN	NaN	NaN	NaN	NaN	NaN	NaN	NaN	NaN	NaN
5.8706	NaN	NaN	NaN	NaN	NaN	NaN	NaN	NaN	NaN	NaN	NaN	NaN	NaN	NaN	NaN	NaN	NaN	NaN
