x	Y_20180514_15338_c2_10_8g	Y_20180514_15338_c2_10_9g	Y_20180514_15338_c2_12_2g	Y_20180514_15338_c2_12_7g	Y_20180514_15338_c2_12_9g	Y_20180514_15338_c2_14_1g	Y_20180514_15338_c2_17_10g	Y_20180514_15338_c2_17_2g	Y_20180514_15338_c2_17_3g	Y_20180514_15338_c2_17_4g	Y_20180514_15338_c2_17_5g	Y_20180514_15338_c2_17_6g	Y_20180514_15338_c2_17_9g	Y_20180514_15338_c2_18_1g	Y_20180514_15338_c2_18_2g	Y_20180514_15338_c2_18_4g	Y_20180514_15338_c2_19_2g	Y_20180514_15338_c2_19_4g	Y_20180514_15338_c2_19_7g	Y_20180514_15338_c2_20_3g	Y_20180514_15338_c2_20_5g	Y_20180514_15338_c2_21_6g	Y_20180514_15338_c2_23_11g	Y_20180514_15338_c2_24_1g	Y_20180514_15338_c2_25_1g	Y_20180514_15338_c2_26_5g	Y_20180514_15338_c2_27_5g	Y_20180514_15338_c2_3_3g	Y_20180514_15338_c2_31_3g	Y_20180514_15338_c2_31_6g	Y_20180514_15338_c2_32_1g	Y_20180514_15338_c2_32_7g	Y_20180514_15338_c2_33_1g	Y_20180514_15338_c2_35_6g	Y_20180514_15338_c2_4_5g	Y_20180514_15338_c2_5_3g	Y_20180514_15338_c2_6_3g	Y_20180514_15338_c2_7_2g	Y_20180514_15338_c2_9_3g	Y_20180514_15338_c2_9_7g
0	13015.135	10196.938	11664.07	10716.642	10723.944	11026.924	9636.437	12705.204	9389.263	12677.197	9588.917	12980.113	11899.372	10281.007	10611.588	12075.32	11136.518	14412.253	12142.055	19730.527	13390.8	9521.827	10248.406	13273.936	13916.479	14357.275	11982.003	11424.013	9430.904	9946.932	10943.286	12323.451	11416.339	11436.936	10862.007	11019.741	10217.134	15178.856	11135.354	11999.82
0.1334	12713.966	10755.287	11493.26	10487.362	10806.74	10881.019	10115.744	12217.999	9611.45	12497.173	9340.388	12816.807	11937.105	10543.385	11611.828	12414.859	11600.473	12573.526	12707.681	18195.045	13621.266	10095.563	10535.241	13835.814	14762.019	14131.188	11543.36	12672.592	9717.438	10147.993	11059.342	10768.391	11098.135	12329.032	10659.926	11825.092	10522.839	14857.889	11050.06	12129.941
0.2668	11620.099	10201.744	10863.244	10074.849	10156.552	11918.65	10315.98	12567.43	9884.008	12077.704	9456.848	13925.407	11179.731	10473.385	12037.934	10750.241	12047.047	11757.706	12527.147	15899.147	14176.433	10905.134	11311.317	13894.251	15445.562	14572.448	11152.68	14211.667	9113.243	10567.86	11081.191	10346.352	10466.765	12884.985	10848.596	11814.372	11130.938	14220.924	12374.892	12105.282
0.4003	11634.96	10632.662	11146.169	10482.353	9915.491	14139.171	11445.252	12808.642	9888.861	11252.756	9685.091	14064.59	10398.06	11178.655	12722.011	11175.144	12941.281	11011.061	13055.394	16976.088	13132.224	13143.447	12713.248	14285.523	15935.32	14800.746	10964.184	15294.773	9460.934	11488.742	11194.703	10731.533	10524.535	12712.484	11068.861	12051.353	12223.005	13841.899	14274.597	11951.96
0.5337	11460.21	11698.894	12542.247	10507.848	10184.368	14189.024	12361.818	12085.628	10861.093	10777.523	9397.343	14913.23	10541.613	11841.348	13217.454	12589.316	13074.411	11778.662	13820.622	19019.34	13349.386	15376.57	13279.36	13835.591	16740.5	14873.539	10666.273	17629.025	10677.339	12742.469	12662.679	11306.079	12874.138	13698.691	11931.746	12846.964	13271.895	15425.427	16869.336	13675.727
0.6671	11949.307	12728.677	15239.934	11270.394	9723.13	16421.33	14147.691	13926.842	12019.813	10250.721	10015.41	14624.007	11232.51	11845.107	14370.381	14382.876	13514.633	13278.995	13490.874	18044.023	12880.786	16096.079	15981.212	15150.142	16257.524	14653.372	11697.74	20645.52	10275.648	12972.499	13806.866	13129.927	15679.529	13789.461	13267.385	13842.543	13326.782	15982.192	17498.268	17895.383
0.8005	14966.744	14438.499	19056.9	12551.926	10585.721	19434.996	16290.077	15271.404	13643.353	11196.259	10334.727	16050.64	12993.973	12064.137	14483.147	17238.781	14578.403	16955.896	13574.874	15380.63	13831.372	15053.391	17815.674	16647.398	16235.412	13960.782	13805.947	19454.375	11503.591	14893.845	14559.862	15801.071	18854.498	15296.656	14564.733	13885.524	13808.203	19787.643	17286.867	22477.904
0.934	18636.957	15059.878	21979.652	14124.911	11938.523	20448.219	17698.146	17516.043	16769.062	12708.301	11159.423	15545.587	14004.568	13460.91	14664.981	19042.793	14811.874	19448.365	13146.788	14470.237	14293.105	16059.551	16808.328	19268.682	17323.951	13964.234	17623.852	18470.598	12262.22	15628.796	16390.547	16566.977	18071.209	18712.312	18213.775	15059.985	14811.108	23302.115	18797.998	25615.906
1.0674	18559.621	14407.272	22102.059	17133.514	14714.646	20582.443	19209.588	22994.049	17383.543	14602.865	12690.25	15100.018	15879.527	13975.332	15496.102	18126.484	15718.671	20409.355	13342.442	14181.018	15125.312	15893.253	15998.193	22546.01	16426.211	14919.959	19667.23	16575	14984.501	18100.203	17630.781	17583.367	16446.361	20370.295	20997.078	15146.485	15405.883	21609.375	17964.754	26126.285
1.2008	18289.027	14187.728	21690.133	17677.523	16057.756	18013.166	21495.057	23757.088	16515.189	16331.136	14150.413	16355.954	16264.417	14465.76	16076.104	17222.611	17407.33	18630.834	14889.954	14292.85	16183.64	15351.238	15564.494	22300.334	15576.742	15149.939	18911.188	15562.671	17225.211	21288.014	18389.904	16867.164	15778.864	19868.838	22525.664	15150.439	15786.67	18490.961	17163.051	24181.494
1.3342	16615.924	14006.405	22773.826	16213.435	16161.464	17051.26	19092.172	21150.732	16188.842	18408.748	15652.677	16491.348	17744.27	13757.368	16899.068	15285.57	20136.34	18640.51	15489.46	14499.074	17887.805	15945.449	16110.051	20387.826	15668.626	15698.121	17385.639	14579.46	17493.283	20990.443	19608.041	16275.654	17432.193	19157	21965.416	14652.605	15266.304	17644.754	16759.947	22645.551
1.4676	16626.658	14426.522	22808.223	15736.108	15115.27	16770.029	17566.377	18110.33	15373.445	17580.367	17340.643	17435.363	21752.584	13197.237	16627.18	14212.379	23181.297	18218.857	14694.312	13618.086	18447.205	16192.033	15346.546	18091.996	16012.6	15813.958	17001.205	15105.906	15146.868	19340.158	19318.207	15112.928	18151.986	17492.104	20312.297	13762.129	18070.318	15781.883	16319.819	20457.139
1.6011	16976.016	14671.951	23410.521	15022.153	16376.984	17241.746	15982.29	15692.512	15878.43	17500.166	17593.262	17520.977	24157.605	12926.313	17171.748	15776.942	23135.238	17481.9	14230.535	13348.52	17128.721	15609.19	14849.876	17747.764	17218.52	15629.612	16771.668	15512.418	14576.8	17354.342	18146.188	15727.023	18671.336	17829.709	17612.768	13927.691	19179.609	16437.287	16219.36	19213.465
1.7345	17371.812	14342.462	21334.818	15149.863	16359.68	17934.66	15021.628	15308.933	14053.523	17401.496	17954.203	18041.131	25573.088	13051.886	16695.111	16413.648	22138.219	16524.25	14389.81	13280.254	15906.322	15558.76	14820.342	17725.029	17668.135	14508.843	17284.488	15093.229	13978.765	17978.48	16996.422	15811.144	20343.322	17646.137	15740.093	12994.754	18840.113	16633.91	16970.752	16709.102
1.8679	17256.451	14123.683	20514.342	15063.567	15445.731	17394.176	14119.124	14722.165	14063.848	17380.281	17957.881	19070.447	21502.275	13136.911	15901.867	16571.326	20893.814	16663.428	13142.065	12339.157	15022.456	15614.569	15102.871	17743.373	17207.674	14224.909	16834.537	13928.422	13848.521	16436.625	16523.691	16199.176	18326.422	17859.473	16360.997	12817.181	18936.471	16467.307	15417.458	18435.543
2.0013	16221.875	14444.1	19899.291	14204.315	15552.988	17109.023	13998.569	13403.028	13827.503	18545.609	17793.59	18995.512	19395.096	13072.204	16274.187	17408.994	20735.508	14783.153	12970.384	12375.807	14510.443	15952.601	14776.181	16856.238	17301.359	14230.319	17163.674	13428.535	14004.029	16016.761	16814.033	15374.561	16221.845	17662.107	16483.043	12508.781	18713.775	15379.223	15827.837	17946.113
2.1348	16983.418	14325.442	18733.049	14984.967	15990.601	16582.746	13647.485	12880.743	14032.008	19611.371	18567.391	17995.109	18129.336	12863.993	15779.473	17135.602	20370.916	14846.358	12463.005	12639.421	13937.048	14426.536	13653.234	16152.183	17548.461	13260.084	16962.746	13378.675	13939.048	16544.471	16473.193	16052.714	15273.569	17440.65	17627.707	12002.843	17957.77	13864.544	14199.716	17370.633
2.2682	16110.575	12569.347	16950.562	16611.1	15555.848	16539.283	13153.462	13191.195	13748.607	19327.141	17303.676	16130.919	18314.383	13417.601	16032.22	16124.305	20381.035	14083.227	11708.331	12290.576	13574.87	14227.609	13603.082	15535.71	16437.951	13037.434	15007.036	12811.735	14057.249	17041.117	15934.618	15686.993	13456.308	16344.168	17052.355	NaN	19026.414	13184.803	14054.68	16712.666
2.4016	15283.102	12341.863	16177.175	15348.796	15007.084	16699.086	13187.737	12851.803	13250.739	19768.174	16901.137	15206.054	17660.812	12975.938	14917.377	15915.472	19988.529	13403.962	11924.079	11830.604	13017.579	13388.043	13930.763	15526.855	15278.242	12988.046	14678.434	12924.549	13722.779	16772.709	15579.669	15304.884	13424.906	15009.104	15733.717	NaN	19013.973	12694.692	14673.364	15166.969
2.535	13522.543	11884.386	16071.852	14370.74	14631.794	15173.796	12658.253	NaN	13625.374	19040.199	16802.744	14503.247	16622.006	NaN	14735.77	16310.224	19197.682	13107.683	11289.858	11587.2	13037.918	14033.019	13586.194	15359.655	14702.774	12743.362	14510.981	13063.087	13259.713	16080.021	15246.807	15639.909	13226.802	14453.093	14601.118	NaN	17928.123	11636.495	13571.456	15960.611
2.6684	13790.371	10640.629	15702.578	13936.32	13841.546	14330.947	11802.225	NaN	13247.784	20180.801	15748.703	14838.29	16474.547	NaN	13755.695	16249.748	17996.578	12423.057	11035.231	10899.46	12192.521	13825.725	14051.352	15075.349	14054.257	12276.811	15687.303	12615.691	13010.473	16801.223	14765.786	15186.484	12683.67	14414.788	14327.264	NaN	17629.627	11147.94	14147.756	15484.123
2.8019	13690.428	10812.02	14628.244	12973.671	12989.093	14499.324	11846.094	NaN	12613.894	19484.131	15794.716	14436.771	15524.4	NaN	12579.487	15152.979	17729.588	12333.384	NaN	10608.704	NaN	NaN	14657.55	14228.595	13030.608	11938.902	17095.707	NaN	12406.085	15625.504	14304.787	14591.031	12555.42	14147.311	13818.928	NaN	17219.408	10774.207	14802.584	15356.739
2.9353	13657.027	10839.537	15806.072	12566.612	13450.691	13704.603	12177.364	NaN	12381.022	19421.307	15200.065	14218.361	15819.952	NaN	12037.245	15539.16	16284.7	12316.05	NaN	11431.181	NaN	NaN	15628.075	14675.931	13465.957	11412.889	16994.141	NaN	12763.521	14438.291	13120.503	13334.003	12740.823	14111.541	13155.479	NaN	16844.021	10149.856	14005.094	15501.837
3.0687	NaN	NaN	15816.656	12839.19	13469.606	14563.402	12407.678	NaN	12917.198	19247.02	14876.637	13811.48	16481.08	NaN	12589.753	15114.064	15361.104	12607.412	NaN	NaN	NaN	NaN	16706.342	14231.812	13549.935	NaN	NaN	NaN	11945.794	14884.001	12745.15	13375.643	12784.099	13822.562	13132.939	NaN	15967.973	9781.257	13714.037	15949.02
3.2021	NaN	NaN	16390.703	NaN	13183.288	NaN	11594.416	NaN	NaN	18148.484	14591.699	12995.849	17566.395	NaN	12114.806	NaN	14749.354	13136.413	NaN	NaN	NaN	NaN	16357.357	13848.77	12775.37	NaN	NaN	NaN	12317.889	NaN	12935.086	13032.384	13586.486	NaN	13154.056	NaN	15546.269	9851.087	14484.083	15424.095
3.3356	NaN	NaN	NaN	NaN	13335.321	NaN	11356.079	NaN	NaN	16720.266	14003.353	NaN	15580.094	NaN	11941.948	NaN	14046.783	NaN	NaN	NaN	NaN	NaN	NaN	13936.75	11392.139	NaN	NaN	NaN	12324.869	NaN	NaN	12792.747	13601.546	NaN	13231.126	NaN	14862.13	NaN	14526.978	15976.25
3.469	NaN	NaN	NaN	NaN	13212.277	NaN	11122.679	NaN	NaN	14072.705	13396.456	NaN	14575.729	NaN	NaN	NaN	14801.165	NaN	NaN	NaN	NaN	NaN	NaN	14117.572	NaN	NaN	NaN	NaN	11775.083	NaN	NaN	NaN	13518.39	NaN	NaN	NaN	14870.515	NaN	13914.188	16812.676
3.6024	NaN	NaN	NaN	NaN	13628.822	NaN	10793.122	NaN	NaN	13456.138	12241.202	NaN	15312.945	NaN	NaN	NaN	14681.16	NaN	NaN	NaN	NaN	NaN	NaN	14310.226	NaN	NaN	NaN	NaN	12379.115	NaN	NaN	NaN	13837.904	NaN	NaN	NaN	15620.893	NaN	13641.64	16740.664
3.7358	NaN	NaN	NaN	NaN	13080.031	NaN	9868.854	NaN	NaN	13426.385	11843.053	NaN	14949.208	NaN	NaN	NaN	14464.437	NaN	NaN	NaN	NaN	NaN	NaN	13887.673	NaN	NaN	NaN	NaN	NaN	NaN	NaN	NaN	NaN	NaN	NaN	NaN	NaN	NaN	12639.021	15091.007
3.8692	NaN	NaN	NaN	NaN	NaN	NaN	9229.587	NaN	NaN	12544.021	11352.437	NaN	14095.31	NaN	NaN	NaN	NaN	NaN	NaN	NaN	NaN	NaN	NaN	NaN	NaN	NaN	NaN	NaN	NaN	NaN	NaN	NaN	NaN	NaN	NaN	NaN	NaN	NaN	NaN	14246.534
4.0027	NaN	NaN	NaN	NaN	NaN	NaN	9258.656	NaN	NaN	12589.813	11530.877	NaN	14209.186	NaN	NaN	NaN	NaN	NaN	NaN	NaN	NaN	NaN	NaN	NaN	NaN	NaN	NaN	NaN	NaN	NaN	NaN	NaN	NaN	NaN	NaN	NaN	NaN	NaN	NaN	13521.001
4.1361	NaN	NaN	NaN	NaN	NaN	NaN	NaN	NaN	NaN	12999.511	10840.707	NaN	12916.618	NaN	NaN	NaN	NaN	NaN	NaN	NaN	NaN	NaN	NaN	NaN	NaN	NaN	NaN	NaN	NaN	NaN	NaN	NaN	NaN	NaN	NaN	NaN	NaN	NaN	NaN	NaN
4.2695	NaN	NaN	NaN	NaN	NaN	NaN	NaN	NaN	NaN	12775.7	NaN	NaN	12481.075	NaN	NaN	NaN	NaN	NaN	NaN	NaN	NaN	NaN	NaN	NaN	NaN	NaN	NaN	NaN	NaN	NaN	NaN	NaN	NaN	NaN	NaN	NaN	NaN	NaN	NaN	NaN
4.4029	NaN	NaN	NaN	NaN	NaN	NaN	NaN	NaN	NaN	12974.136	NaN	NaN	11833.242	NaN	NaN	NaN	NaN	NaN	NaN	NaN	NaN	NaN	NaN	NaN	NaN	NaN	NaN	NaN	NaN	NaN	NaN	NaN	NaN	NaN	NaN	NaN	NaN	NaN	NaN	NaN
4.5363	NaN	NaN	NaN	NaN	NaN	NaN	NaN	NaN	NaN	12909.036	NaN	NaN	10686.548	NaN	NaN	NaN	NaN	NaN	NaN	NaN	NaN	NaN	NaN	NaN	NaN	NaN	NaN	NaN	NaN	NaN	NaN	NaN	NaN	NaN	NaN	NaN	NaN	NaN	NaN	NaN
4.6698	NaN	NaN	NaN	NaN	NaN	NaN	NaN	NaN	NaN	14068.025	NaN	NaN	10403.45	NaN	NaN	NaN	NaN	NaN	NaN	NaN	NaN	NaN	NaN	NaN	NaN	NaN	NaN	NaN	NaN	NaN	NaN	NaN	NaN	NaN	NaN	NaN	NaN	NaN	NaN	NaN
4.8032	NaN	NaN	NaN	NaN	NaN	NaN	NaN	NaN	NaN	NaN	NaN	NaN	11056.33	NaN	NaN	NaN	NaN	NaN	NaN	NaN	NaN	NaN	NaN	NaN	NaN	NaN	NaN	NaN	NaN	NaN	NaN	NaN	NaN	NaN	NaN	NaN	NaN	NaN	NaN	NaN
4.9366	NaN	NaN	NaN	NaN	NaN	NaN	NaN	NaN	NaN	NaN	NaN	NaN	NaN	NaN	NaN	NaN	NaN	NaN	NaN	NaN	NaN	NaN	NaN	NaN	NaN	NaN	NaN	NaN	NaN	NaN	NaN	NaN	NaN	NaN	NaN	NaN	NaN	NaN	NaN	NaN
5.07	NaN	NaN	NaN	NaN	NaN	NaN	NaN	NaN	NaN	NaN	NaN	NaN	NaN	NaN	NaN	NaN	NaN	NaN	NaN	NaN	NaN	NaN	NaN	NaN	NaN	NaN	NaN	NaN	NaN	NaN	NaN	NaN	NaN	NaN	NaN	NaN	NaN	NaN	NaN	NaN
5.2035	NaN	NaN	NaN	NaN	NaN	NaN	NaN	NaN	NaN	NaN	NaN	NaN	NaN	NaN	NaN	NaN	NaN	NaN	NaN	NaN	NaN	NaN	NaN	NaN	NaN	NaN	NaN	NaN	NaN	NaN	NaN	NaN	NaN	NaN	NaN	NaN	NaN	NaN	NaN	NaN
