0.0000	12242.6943
0.1334	12363.2129
0.2668	12974.4258
0.4003	14180.5840
0.5337	15699.1133
0.6671	16098.4551
0.8005	16214.4277
0.9340	16422.4883
1.0674	16333.9424
1.2008	15951.3389
1.3342	17131.1348
1.4676	16962.7793
1.6011	15228.2725
1.7345	13815.5352
1.8679	13548.6299
2.0013	12885.1230
2.1347	12364.9951
2.2682	12240.7148
