0.0000	14054.2715
0.1334	14141.5244
0.2668	15684.3711
0.4003	17167.1855
0.5337	17766.5039
0.6671	16642.2734
0.8005	17227.8223
0.9340	17576.9629
1.0674	16579.5918
1.2008	16418.0742
1.3342	14992.5547
1.4676	13596.6807
1.6011	12963.9648
1.7345	12859.2197
1.8679	13209.7227
