0.00000,13652.592
0.13342,13579.206
0.26684,14322.824
0.40027,16240.196
0.53369,17123.600
0.66711,16503.613
0.80053,16387.209
0.93395,15674.024
1.06737,15416.318
1.20080,16001.685
1.33422,16519.244
1.46764,17298.859
1.60106,17078.232
1.73448,16930.842
1.86791,17188.545
2.00133,17602.193
2.13475,16286.646
2.26817,15804.839
2.40159,15413.174
2.53502,14375.299
2.66844,14207.175
2.80186,14907.380
2.93528,13342.007
3.06870,12728.021
3.20212,13346.818
3.33555,12540.520
3.46897,12558.079
