0.00000,13471.273
0.13342,13757.769
0.26684,15044.334
0.40027,17818.447
0.53369,19605.426
0.66711,21116.615
0.80053,21552.820
0.93395,20732.484
1.06737,19678.914
1.20080,18433.543
1.33422,17754.238
1.46764,18122.158
1.60106,16700.027
1.73448,14664.559
1.86791,13710.735
2.00133,12673.976
2.13475,13001.168
