x	Y_20180514_15338_c2_1_3g	Y_20180514_15338_c2_11_8g	Y_20180514_15338_c2_12_12g	Y_20180514_15338_c2_12_15g	Y_20180514_15338_c2_12_16g	Y_20180514_15338_c2_12_3g	Y_20180514_15338_c2_12_8g	Y_20180514_15338_c2_13_10g	Y_20180514_15338_c2_13_1g	Y_20180514_15338_c2_14_11g	Y_20180514_15338_c2_14_2g	Y_20180514_15338_c2_14_3g	Y_20180514_15338_c2_14_4g	Y_20180514_15338_c2_16_10g	Y_20180514_15338_c2_16_1g	Y_20180514_15338_c2_16_2g	Y_20180514_15338_c2_16_4g	Y_20180514_15338_c2_17_2g	Y_20180514_15338_c2_17_7g	Y_20180514_15338_c2_18_6g	Y_20180514_15338_c2_19_1g	Y_20180514_15338_c2_19_8g	Y_20180514_15338_c2_2_1g	Y_20180514_15338_c2_2_3g	Y_20180514_15338_c2_20_1g	Y_20180514_15338_c2_20_2g	Y_20180514_15338_c2_23_12g	Y_20180514_15338_c2_23_1g	Y_20180514_15338_c2_23_6g	Y_20180514_15338_c2_23_9g	Y_20180514_15338_c2_25_3g	Y_20180514_15338_c2_25_4g	Y_20180514_15338_c2_26_2g	Y_20180514_15338_c2_27_2g	Y_20180514_15338_c2_27_3g	Y_20180514_15338_c2_29_2g	Y_20180514_15338_c2_3_4g	Y_20180514_15338_c2_3_7g	Y_20180514_15338_c2_30_1g	Y_20180514_15338_c2_32_2g	Y_20180514_15338_c2_33_12g	Y_20180514_15338_c2_33_2g	Y_20180514_15338_c2_33_6g	Y_20180514_15338_c2_33_8g	Y_20180514_15338_c2_34_2g	Y_20180514_15338_c2_34_5g	Y_20180514_15338_c2_35_4g	Y_20180514_15338_c2_36_2g	Y_20180514_15338_c2_36_4g	Y_20180514_15338_c2_36_7g	Y_20180514_15338_c2_36_9g	Y_20180514_15338_c2_4_11g	Y_20180514_15338_c2_4_2g	Y_20180514_15338_c2_4_3g	Y_20180514_15338_c2_5_3g	Y_20180514_15338_c2_5_4g	Y_20180514_15338_c2_5_8g	Y_20180514_15338_c2_6_6g	Y_20180514_15338_c2_6_8g	Y_20180514_15338_c2_7_11g	Y_20180514_15338_c2_7_7g	Y_20180514_15338_c2_8_10g	Y_20180514_15338_c2_8_3g	Y_20180514_15338_c2_8_5g	Y_20180514_15338_c2_8_9g	Y_20180514_15338_c2_9_11g	Y_20180514_15338_c2_9_12g	Y_20180514_15338_c2_9_6g	Y_20180514_15338_c2_9_7g	Y_20180514_15338_c1_1_10g	Y_20180514_15338_c1_10_1g	Y_20180514_15338_c1_10_7g	Y_20180514_15338_c1_11_2g	Y_20180514_15338_c1_11_3g	Y_20180514_15338_c1_11_4g	Y_20180514_15338_c1_11_7g	Y_20180514_15338_c1_12_2g	Y_20180514_15338_c1_13_1g	Y_20180514_15338_c1_14_1g	Y_20180514_15338_c1_14_4g	Y_20180514_15338_c1_14_5g	Y_20180514_15338_c1_14_9g	Y_20180514_15338_c1_15_4g	Y_20180514_15338_c1_17_1g	Y_20180514_15338_c1_17_8g	Y_20180514_15338_c1_18_5g	Y_20180514_15338_c1_18_8g	Y_20180514_15338_c1_18_9g	Y_20180514_15338_c1_19_18g	Y_20180514_15338_c1_20_6g	Y_20180514_15338_c1_4_2g	Y_20180514_15338_c1_4_5g	Y_20180514_15338_c1_5_2g	Y_20180514_15338_c1_7_11g	Y_20180514_15338_c1_7_4g	Y_20180514_15338_c1_7_5g	Y_20180514_15338_c1_8_15g	Y_20180514_15338_c1_8_1g	Y_20180514_15338_c1_8_7g	Y_20180514_15338_c1_9_10g	Y_20180514_15338_c1_9_6g
0	16790.0957	13103.2715	14233.8633	12723.3184	13619.084	16474.9512	14558.96	15440.4014	11375.8877	13961.2646	13467.208	14246.4766	14244.6602	15711.6797	15439.3086	17142.3574	16149	13679.8789	14355.7139	13593.9141	12677.627	15243.5928	14253.916	15247.7246	15120.4443	14029.0166	12002.3311	14391.9268	13445.959	12926.3408	16172.8389	15804.6807	14007.2715	15216.9414	14850.2109	13874.249	12806.7344	10850.2119	13574.0996	14579.8652	14244.5146	15994.8809	14596.8916	15820.4238	11755.8066	14471.5029	14355.835	14595.0703	14127.3652	13913.3574	17469.0742	13112.0977	12931.9707	15947.4199	16279.127	12243.4102	13745.4521	14350.5996	12515.7725	10541.3457	12469.8018	16021.1621	14029.127	15053.2295	14720.7422	13308.9785	11633.0752	13372.8184	13925.3047	13914.5645	14851.5986	14252.6689	14839.8809	14266.8232	15748.1797	14224.8623	14580.7295	15560.7041	15071.1309	12153.7578	13998.5283	12768.1562	12064.1279	11324.9004	13861.1377	14608.709	15576.7852	15414.4736	11713.4551	18266.9902	12274.6396	13916.7568	10974.3564	13197.5039	18491.4004	10961.9766	14489.3887	13122.1836	14506.7002	13648.1523	14330.0576
0.1334	16769.7012	13530.5479	14690.7432	13244.8652	13251.1602	15775.1758	15312.7441	15834.7959	12246.9502	14257.0957	13470.4355	13400.29	14089.5225	16526.8359	14907.2393	17997.1699	16066.7725	13650.0078	15538.8359	13309.582	13732.6729	15945.9316	15464.4883	14653.0205	15080.1006	14856.0322	14100.8906	14703.1357	12800.7285	13284.5947	17503.2656	16672.7656	15192.0674	14182.8984	14912.7021	14455.2266	12938.2695	11393.4092	14899.1621	14652.8223	14415.1602	15652.3164	16894.6992	16989.8145	11471.7588	14544.3545	15107.2539	15345.4902	14130.2334	15030.7568	22202.123	12945.3945	14662.0928	16905.3691	17952.7578	12496.0645	15256.2031	13711.0713	13364.1953	10381.8311	12600.9502	16368.625	13190.6484	15214.7607	16591.0918	13477.0498	11684.749	13177.4131	15477.7031	14003.4033	14181.3242	14233.667	17132.0898	14223.6709	15702.4883	14732.1641	15325.4131	15162.7334	15305.4795	13233.2129	14338.5693	12681.1953	12533.3193	13984.542	14259.5166	15153.1963	16348.4805	16071.8691	12565.8066	19305.6543	12035.0283	15349.3633	11530.2529	13468.7051	18455.7383	11078.7178	14140.6494	13373.2041	15681.5889	14335.0654	15876.9482
0.2668	16614.9512	14010.3027	14891.2227	13817.1885	14877.4072	17332.4395	15846.751	15505.6592	12683.2568	14677.8281	14176.5312	12938.3408	14354.0977	16939.7793	15032.0078	19001.627	16247.8047	14049.4238	14966.4844	14929.2227	13532.7988	15629.1807	18915.0215	15351.4727	15858.21	15229.9385	16199.5615	16518.0977	14316.8467	13546.876	19220.291	16763.3086	16382.1631	14508.5566	15216.6787	15663.1396	12881.2412	12204.4453	14770.9932	15863.2178	16606.7695	16470.9082	21056.9512	17187.3281	11594.3379	15397.4951	17729.9844	15897.6748	14965.541	15986.1885	25961.5938	14213.7324	16023.3311	17374.9258	18418.4531	15232.6094	17922.2559	14420.2373	14837.3584	10243.5488	12520.4102	16613.7227	13633.4336	16282.0645	16040.0879	13609.5508	11525.1504	13704.127	15404.3535	14336.7627	13807.0137	13706.0684	21172.9668	14460.252	17517.2109	14841.29	15166.3037	15177.7314	15794.7207	14014.5703	13891.5996	12675.0137	12767.2549	17572.9688	14074.6328	15642.9463	16708.4082	16722.9062	12423.3213	24052.7246	12306.9512	17107.8242	11193.8076	14468.8613	18853.0703	10836.6152	15197.3369	13983.71	15025.5166	14206.3545	15541.5273
0.4003	16336.7061	15576.0762	16419.1797	15091.7041	17319.5762	21513.9434	16340.7139	15996.0547	13570.4277	17300.7051	14345.3145	14550.3955	15286.082	18299.2598	15153.2148	20618.8066	18158.082	14397.1904	16693.5195	14596.8154	13916.5264	15626.2939	22358.8789	15541.4121	16035.3887	16023.2119	22454.1035	21305.2734	17188.043	16151.6006	22208.4805	18947.6113	20737.8574	15495.0771	16125.8672	16708.2852	14338.5352	13360.0059	17222.2734	17777.1562	19125.0508	19660.2773	23858.6191	16344.6436	12007.752	16793.0977	19522.2676	17068.4062	16010.2256	20620.0527	25812.8496	16815.6699	17670.5156	17201.168	20827.3281	21401.9492	21850.6836	16184.9502	15777.5488	10626.4893	13315.4775	16715.8906	14193.5732	19030.9805	18032.8848	15339.7891	12544.3486	13655.4727	15747.4082	15027.4521	13707.0771	13516.9248	22882.0352	13392.4629	20282.6621	15748.6953	15365.3369	15606.0439	15465.8682	15648.2559	15062.6865	13891.1191	12606.6846	16844.373	14760.3691	22070.748	17309.8613	19461.9141	12661.916	32572.4766	13006.8672	19731.5195	11649.3906	14657.1934	18257.9746	11748.1426	15818.2822	14645.3809	15057.9209	15153.1719	15296.3848
0.5337	19360.2266	17022.3477	19428.7988	17092.1211	22260.5156	26958.9824	17248.1094	16154.4463	15887.3467	18366.3105	16039.3369	17686.1895	18163.668	22179.1836	14586.3125	22721.502	20200.2734	16479.1289	20287.0859	15551.0205	16046.6875	16705.1191	23621.8926	16921.0703	17495.0859	18283.4043	27601.2773	23489.8555	18953.9688	20293.7109	29470.7363	22691.2012	25158.5488	17769.6973	18848.123	18096.4492	18723.0547	15382.6582	21074.4551	19313.8984	22108.7871	25709.791	21716.9668	17000.6562	14154.9541	18082.6289	19562.3379	20353.1895	17767.3145	26620.3945	23833.209	18111.1621	21969.2168	19459.5273	24403.668	24773.8574	22198.7461	17168.8066	15964.3223	11954.9844	13148.2041	19860.8184	16730.8594	25763.7227	20034.0762	18080.9512	14368.3633	13488.2197	19243.7344	17385.5449	12796.3066	13407.0352	19710.5195	14022.9756	24659.1465	18353.1387	16321.6299	17514.0312	16801.9531	16544.8867	17552.1621	18705.8477	12666.0986	14973.1836	18053.5234	29338.7871	19316.5762	20535.4141	15246.6562	36596.082	14401.0654	20640.8848	12106.6562	16352.3672	20663.9824	12978.5967	19155.9609	15651.2197	15700.1133	16209.5283	15165.5693
0.6671	22670.2168	18476.623	23726.2676	22488.875	22929.0859	26426.8184	18999.2773	18006.248	19643.9512	19326.334	20622.0938	19887.5078	21854.2812	28095.834	16433.7031	27983.1055	25951.9023	19902.793	25701.9102	17275.0898	19340.8984	19838.1074	21445.4121	22436.5762	22991.9844	16840.6523	26365.7012	22735.873	17146.9844	20110.8398	32730.7793	22901.5059	24470.0215	20435.0684	21709.5898	22011.5117	22988.1172	17807.3965	27054.8945	19365.8984	22649.0098	34803.4023	19398.7031	18707.0391	15253.6553	19841.2754	16376.7363	25943.6328	20125.3691	29229.6914	24082.9805	18066.2969	24936.9551	23085.6172	25778.8438	24006.3105	19335.4375	17137.0176	15105.6465	14394.1318	13672.418	21677.6855	20501.3457	30983.7324	23508.3223	18019.3711	16732.7363	13905.4541	22134.7402	21147.9316	14201.4287	14725.4551	18001.1094	17083.6875	26128.8574	18898.6016	18981.5039	21487.6562	19074.7832	19331.1309	24765.7129	22248.7031	13917.8496	15002.4658	24449.5664	34756.3164	19653.8184	18675.8691	21555.3984	34120.8477	16100.3311	19332.7559	12889.5654	21474.3047	24459.9629	14185.5908	23361.5391	17356.9844	18036.6543	14977.2354	16872.1523
0.8005	22677.4453	17309.6289	26350.2188	24172.4082	20097.3203	22617.3027	24762.293	19298.5117	20154.0449	19819.6836	23246.2402	20108.4727	24135.8516	31197.9023	18408.9824	36189.5117	27380.2871	20722.8281	27730.875	19537.248	19223.2559	20593.4902	18048.4688	27895.5664	25200.9531	15086.4756	24522.7012	20247.209	15929.6543	21360.3359	25747.2578	20119.4395	19910.2305	23380.6055	24970.3672	25393.1699	24466.4355	18428.5996	28946.2871	20024.4512	20035.5273	38044.5938	17465.2773	22316.8164	16952.3359	20182.5527	14477.0537	26012.1602	19264.2949	24605.5234	26018.6699	16698.7363	25100.8594	26221.3477	21363.2109	22893.4395	15935.2324	16845.002	14877.1973	17712.0078	16534.2266	19070.2949	24528.2188	30925.9375	29476.7715	17195.8398	18161.5879	15938.9014	21010.7461	21363.2656	14688.6455	16526.1426	16198.2354	20955.2871	25447.3262	16659.7773	21376.1582	24692.3164	19206.625	24325.3438	27139.5156	20776.0195	16752.0586	13276.7734	28640.1699	35243.5391	19013.9277	17318.9707	23997.332	29690.6172	17001.4648	17486.0273	14647.0234	25260.8086	30652.1484	15938.4941	25328.8301	18069.0918	21963.1406	14294.3408	19121.6641
0.934	20735.3906	18501.3887	21737.5762	22321.0293	17796.3633	20968.5859	31007.6328	17231.7637	17912.2441	17832.4102	23664.0234	18871.5254	21437.3105	27434.7812	25714.6758	37640.8164	23840.582	19774.7832	24490.0488	20649.6484	16672.3906	22444.0859	16377.8535	29187.6816	22523.6973	13710.2578	21944.5449	20272.2129	15947.2861	19521.5605	22255.7188	17859.8477	18309.3457	23812.6953	23725.1387	24744.3672	22872.7441	15336.1162	24866.0488	21106.4043	16963.5859	31328.5117	17461.2031	25541.5879	15420.7305	17991.6758	15227.123	20915.4688	17518.3672	20372.5117	29489.0391	15720.9932	22217.6992	23075.7109	19006.375	21386.5391	16267.5244	17499.877	14907.6377	21733.9629	17353.8086	17216.752	23455.916	28347.1016	30179.6367	16078.0547	17580.3633	16412.707	19039.3105	19340.709	15772.9131	18268.207	15622.6787	24685.7578	28674.7988	15500.3994	18708.0547	23950.9629	18806.0098	28209.9551	24047.2051	16643.1797	19578.0273	14358.8945	28426.0742	29303.5977	16359.9912	15257.3379	22621.457	23022.4512	15054.3164	16437.7227	14901.2324	23390.3926	31798.5254	15917.4814	22146.5156	16716.3984	21740.2871	13869.3711	21067.1797
1.0674	17847.4355	19528.293	18446.2598	20113.2227	16464.3281	19443.0918	30159.8086	15870.168	17188.7188	17705.4121	17497.8047	17551.7441	19673.9805	23095.6484	40966.3594	34794.7227	21337.1602	18104.2734	20199.6973	17778.166	14885.9316	21496.5586	17263.293	24580.293	22110.7598	13286.7158	20589.0078	21240.0371	16294.291	16708.0332	19129.7285	15536.3652	18338.0488	19857.4609	22862.2676	21501.6406	20870.1406	15163.9404	22805.5645	19425.5605	16045.5547	26886.6445	17303.4219	26373.5352	14068.7676	16345.6553	16841.1484	17845.9883	16724.1465	18990.9824	29833.1133	15196.7607	22064.2969	19819.0078	16944.4336	20727.1211	15839.0664	19777.7656	15235.0244	22241.3613	16681.2305	19219.6055	19451.0723	25864.2559	25166.3359	15298.6738	16982.7129	16470.998	17365.4082	16897.2637	18480.0723	17361.3125	17018.8105	21761.1816	31342.127	16099.2422	16910.6562	23004.5137	18032.498	27235.7891	22811.0703	15412.9287	21938.4668	13827.6641	28039.5078	25205.6406	15895.9463	15711.0459	20004.0781	19881.5508	13012.79	14877.2598	14046.5898	20619.2715	29795.6953	16648.5234	18592.6133	15535.2666	18435.916	14355.3711	21312.3555
1.2008	14665.748	21759.873	17831.2734	18279.4707	16626.7695	20319.2363	25444.8398	14643.6289	16527.625	17464.293	15559.3691	15771.2031	17627.6562	18923.5508	46747.3672	29041.5195	22340.5234	17411.2812	18314.2754	15683.5205	16678.9219	19112.3906	16666.1387	20163.8457	20275.5664	14444.0176	17302.4277	20778.1895	18518.3398	16890.1621	18768.0801	14820.0078	19087.0781	17480.9922	23077.6328	17260.0664	19574.209	15564.9893	21700.7383	15685.6494	15397.2012	23831.8594	18613.1699	23926.3711	13879.9756	15613.5918	18878.9883	16846.707	16064.7393	18190.7383	27009.5508	14256.6807	21754.6406	18449.2871	16466.8379	19784.3672	16679.5527	19981.459	14508.0059	20592.1797	16600.1797	19797.0469	16279.1699	22591.668	22554.9395	15911.458	16326.835	15686.8125	16529.1934	16182.9639	21044.4355	16153.7158	16688.9688	17819.2852	32300.8262	16654.6895	16123.8477	20517.9629	17310.5117	23123.2266	24366.6094	16085.0215	19388.2617	12861.3467	25640.1094	23719.3594	15549.0156	17530.332	16666.5898	18191.1738	12952.0928	14570.7285	12892.498	18254.3242	24229.1973	17504.9316	16228.6562	15649.8008	19107.1152	15148.5566	18746.4355
1.3342	14922.4131	22872.5605	18408.7988	17318.8301	16387.166	19857.293	22174.9688	13292.2637	15904.2119	19130.9102	15570.9697	14598.9795	17511.5762	18592.8379	41077.8711	24433.4707	23740.8359	17523.2266	17847.416	15629.0576	16916.8418	17005.1387	18675.0273	19441.9238	18676.4336	14302.4941	16089.9736	22186.377	21059.8809	16668.6504	17252.9531	16724.6797	16576.5312	16882.4941	22961.752	16836.1836	18808.9688	17915.6914	21743.6504	13918.5889	15884.2451	20841.9062	18302.0488	22968.6953	14710.4941	15111.7988	18761.002	17247.8984	15295.8828	18332.2188	22086.1816	14260.5811	20750.0918	17923.4902	16380.1084	18529.1562	15774.3018	19012.7949	15821.2568	18421.6973	16927.6152	21640.7695	15402.0732	20752.0645	20939.4062	16971.8652	17380.7617	15503.1875	15118.8145	14777.3877	22099.291	14252.0225	16131.0625	16687.7422	27423.4629	15700.3223	17654.2207	18703.2637	17420.1445	21023.6035	26469.5137	17668.502	17882.793	12727.1807	25906.7852	23042.1348	17150.3125	18589.8828	16848.5723	18085.6641	12752.0918	14408.0068	12019.0244	15648.3574	19550.998	16919.3848	15660.1963	15249.9473	19256.1113	16202.7285	18027.916
1.4676	15516.0771	19675.9238	17422.7637	15855.3936	16823.5312	18762.2598	20779.4941	12534.0986	16904.6953	20184.8574	17323.3789	14709.249	17920.4648	16725.9062	40037.7344	20186.7539	21574.668	17480.1934	17639.9746	17244.4844	17344.6836	16074.8896	19587.7031	20799.2344	17534.8281	14413.8584	14205.707	19510.2676	20106.8613	16788.2754	17544.9727	19222.8066	14531.9209	18193.7773	20988.7305	15511.2148	17479.9219	17398.6191	25326.877	14240.7803	15959.6543	19702.3965	17944.6445	20656.4609	16502.6836	13741.2588	18855.4492	16530.6465	15809.833	18919.668	17343.293	14114.3926	19323.416	18688.8027	18362.6777	16956.0117	14855.6934	16049.7285	17443.7266	18249.8105	16570.2559	22190.0469	14879.6455	20464.1191	17483.6504	16615.6543	18806.4844	16367.7734	14312.0752	13844.9717	20044.1816	13745.9023	16198.3789	16798.1758	21207.4219	15566.6885	19392.3242	15736.7598	18137.0352	20984.6836	24157.5801	21443.4727	18264.6641	13764.7119	26864.9199	23912.3613	19059.1641	18518.9961	16962.1758	16059.2119	12935.0723	14708.4629	12138.8447	14149.3711	18627.4434	16579.5234	15694.3818	15131.292	20669.4375	14790.6787	16471.666
1.6011	16374.1367	18716.584	17398.8906	16065.5547	17470.5664	18186.4043	19037.1133	13033.2295	16623.8145	18683.918	18736.457	16017.3896	17070.5488	15954.5049	39804.5195	17653.6035	19786.4004	17798.4219	16272.3125	18042.3691	17462.6914	16893.5527	19163.1855	20892.0352	16304.9502	15071.0244	14090.3545	18122.1465	17662.4551	15168.4307	17680.6367	19110.4102	13695.5342	19357.8516	19904.2695	14424.9365	17265.3281	14522.04	23248.627	13752.7822	16483.5	17702.293	16321.8027	17867.0566	18091.041	13033.8887	17114.1445	16690.543	18787.7891	20724.4961	15439.6172	13329.4473	22567.4746	20588.5527	22152.6211	15898.252	14431.6816	15455.5117	17205.2949	17354.9688	15360.3379	21254.4922	14733.5518	18640.7344	15572.417	15929.6113	19606.5703	15900.0498	14817.0947	14563.292	20362.8379	14889.2998	14565.5586	18369.6914	18918.1621	16535.6543	21978.1758	16473.2969	20149.1289	22641.5879	21592.8965	22843.1152	20108.1992	13996.9512	28412.8281	22701.2539	18896.2168	17739.207	16892.8906	15335.9893	13846.0303	15316.418	12350.4824	14145.5195	17435.5801	15630.6104	16904.3574	15305.4072	20088.8867	13416.123	16934.1094
1.7345	15035.7197	18098.8184	16888.5352	16009.5391	19391.8789	15760.9775	18856.1055	12741.0098	15265.0234	17438.5547	18580.5	16031.0684	17943.9004	17551.4629	35812.0234	16264.7725	18139.7832	18107.6777	14292.1221	18900.7812	18111.7715	16211.2363	17013.0254	20926.3965	15981.4229	14509.5312	13079.6348	15754.2354	14865.8672	14112.2061	17941.6953	17466.3047	12926.1895	19500.4531	17119.3145	14513.4746	16880.5508	12403.3428	22975.9141	13612.1729	18008.8984	15817.9131	15049.374	16718.6152	22022.5547	14306.2676	15989.5801	17194.6406	19421.7363	20159.3418	14781.0059	12783.3955	22548.707	23934.5312	24213.4531	15103.9473	13389.4795	14582.1367	15694.6016	15646.6143	15406.9688	19955.168	15602.292	16770.3477	16361.9766	15015.3789	17478.3691	15759.6895	14331.5244	14851.6592	20715.4824	15441.3379	14127.1602	17900.207	19287.5078	18160.2148	21842.9355	17540.2129	21762.1289	24317.4434	19551.5469	22055.2363	20333.2988	13080.9131	27263.2832	20328.9102	17555.0312	17435.1719	16720.541	13683.5869	13860.167	16261.5693	12251.0273	13348.4404	18006.2305	15445.5566	17153.9629	16189.4912	19798.8223	12828.3809	16808.0078
1.8679	13447.8906	16792.8828	16503.2324	15481.8936	21591.7031	15816.6729	17373.2617	13147.0635	14121.0059	16993.7578	18856.0762	14946.3428	19407.7539	17232.2676	31554.1035	15595.1084	16676.3086	18264.8535	13299.6553	17356.6348	18390.5645	15747.2412	16479.9863	21784.9395	16224.334	14789.5176	12922.3848	15228.6729	13813.9189	13113.3613	15971.4199	15743.9414	12990.915	18067.6934	14307.5283	15148.332	14956.6074	12095.4111	25600.7969	13578.1104	18772.0098	15764.9141	14117.2568	15285.1709	22370	14489.5303	14531.4873	17138.5273	17170.9531	20120.5059	14670.1836	12239.8584	18419.5879	24242.2969	22485.0527	12907.8008	12555.2871	13318.2969	14808.2334	14708.8281	15604.8574	16838.2227	16605.2109	15893.7969	17267.332	15392.0928	15646.6016	16501.2012	14094.2246	14794.4307	18199.2246	16532.377	14341.8027	18299.6875	18460.5	17064.8145	19549.6758	16136.7354	21873.6777	22152.9355	17143.8633	18896.2051	19483.4258	12188.6162	24245.9531	19993.7383	15668.627	17493.0254	15826.6182	NaN	14963.623	15697.0684	12436.5928	13635.7266	17555.6621	16472.5195	16088.5439	14966.0381	16257.0098	12993.3125	17602.2812
2.0013	13295.2051	14693.2412	14878.5859	15382.8525	20707.4316	14432.6553	17336.0566	13808.7178	12539.374	15891.4414	17739.2109	14344.3369	19300.6387	15904.8174	24521.8457	15028.1377	16708.8633	15902.248	12677.6133	16262.085	16999.3672	14827.9746	14804.3389	25693.8359	16162.21	13974.915	13277.2842	15290.7959	13749.7129	12623.7832	15499.8086	15753.3096	13466.249	17037.3242	13559.2002	15922.3506	13798.999	11722.8994	23083.8184	12898.666	17122.6699	14701.1562	13423.835	14432.9619	19541.8945	14961.293	14230.7666	16388.959	17707.7773	18459.6934	NaN	12128.3066	16116.583	20101.2871	19004.668	12332.0244	12679.8486	NaN	14349.6123	13759.2783	14295.1631	15185.1816	17261.416	15201.9932	18563.502	15279.4297	13567.5225	16617.5703	14914.3057	15247.833	17225.4766	16544.332	13849.6025	17521.418	17605.9844	15744	17100.2031	15245.2197	19626.2266	20076.6641	14782.4443	16017.6143	19882.5098	13207.7773	22442.5781	17184.125	14848.7393	16152.6084	16186.3643	NaN	15527.9707	14352.0244	11516.0381	12809.6689	16820.8145	16121.8623	15349.3193	14862.1104	14852.1318	12326.9229	17726.6367
2.1347	12618.9678	13403.0664	14176.2373	16303.7158	18007.3848	14072.5049	17314.834	14138.8945	12282.8516	14877.4434	15969.4277	13225.1484	19690.3086	13992.4736	21912.3477	15579.2783	16519.7129	14175.5557	12578.0098	16356.1641	15973.7432	13303.7285	14280.5146	26695.959	14191.7119	13234.5771	12647.5576	14771.8389	12515.2129	NaN	13992.0078	15165.041	14860.7295	16541.1797	12770.6738	16052.1865	13315.3037	11759.6846	18596.4844	13191.7949	15492.25	13248.0625	13508.0137	15124.8398	17570.5039	14117.709	13604.3633	15050.9521	17211.4961	16125.9414	NaN	13070.3926	13890.7354	16590.502	17336.5977	12706.416	12885.0576	NaN	15722.2295	14046.6777	13562.6377	14666.6885	16064.124	NaN	19679.0273	15806.9668	13125.4443	16422.9258	14517.1318	14814.4775	15426.3838	15203.0371	12808.043	16848.1113	16600.2422	14759.0713	14777.0938	13200.9023	17345.1875	18245.7461	13575.4746	14764.0254	19478.9141	12682.4609	19677.8164	17478.8066	15691.6074	15603.7266	14555.8184	NaN	14279.7451	13601.6064	11142.1279	11856.5908	15174.9189	15251.4014	15222.7969	14840.1162	13207.0068	12298.5283	15245.2334
2.2682	12360.0859	11576.3213	13989.6777	16533.6777	16008.4141	13466.8916	16782.5	13061.3115	12115.0732	14973.6094	14607.5469	11811.4941	19673.9629	13422.5693	18039.166	15794.0693	15220.9766	13585.7422	12555.9082	16324.2432	15829.584	12794.4668	13844.2285	21725	14083.9102	NaN	13400.4209	13884.5195	13240.9766	NaN	14573.2041	14334.5928	NaN	15114.1514	12834.7666	14757.2393	13197.8447	12461.3701	16777.3281	13167.2676	15494.2285	13316.1729	13394.248	14847.459	15220.4482	12845.5029	12811.1523	13639.4443	17370.502	14614.0742	NaN	12764.4258	13318.7451	15036.3467	15795.3428	NaN	12551.999	NaN	18128.707	14498.3262	13171.7207	14073.1328	15760.9062	NaN	19704.3164	NaN	13058.6719	15457.9551	14360.1455	13371.3311	14335.4668	14415.8008	NaN	15970.1846	16154.7139	14055.2373	13429.2949	12312.6094	NaN	16754.4434	14339.9053	13951.7656	22280.1602	NaN	17682.2793	16714.6484	14311.4424	15752.1104	14740.5049	NaN	12911.624	12455.8145	10938.001	12027.5918	14997.666	14207.332	15151.2627	16627.7891	13074.5547	12057.6602	14421.1855
2.4016	11895.7422	11717.1035	13867.7656	15982.5391	14099.126	14244.123	16700.4961	13706.0596	12317.21	14995.084	13634.918	11006.2178	19338.4395	NaN	16973.9043	16289.6943	15170.1074	13495.0244	12875.3711	15790.1895	15044.8779	13167.0947	13934.9375	17374.8145	13022.2188	NaN	14080.2236	13634.6064	13076.9619	NaN	14498.8643	NaN	NaN	14581.7793	12880.1855	13500.2402	12958.4102	12234.4053	15900.3398	13345.3359	14974.0742	13814.9404	14116.9541	15023.7168	14271.7246	11663.0332	13643.3975	14544.6182	16658.8633	NaN	NaN	13765.9531	12629.4502	14418.3877	15973.6846	NaN	NaN	NaN	17682.0742	15880.1709	12869.5361	13664.8223	15103.5723	NaN	18445.1348	NaN	13030.7578	13187.5723	13166.8613	12998.6182	14166.6172	14016.7539	NaN	15250.2305	NaN	13678.4658	12868.7695	12399.3643	NaN	16791.4766	16012.4688	NaN	22902.1914	NaN	18036.4922	16150.0156	NaN	15777.7363	14349.4277	NaN	11831.0693	NaN	10850.5	12258.7715	15252.4912	13510.2402	14760.3984	15932.3721	12387.0166	12718.5293	13264.2529
2.535	NaN	12218.5166	13441.4395	14204.0957	13425.9678	14197.3301	16808.6953	14108.2715	12375.9473	14907.0557	12812.5625	11092.1045	17097.0391	NaN	15370.332	16381.5039	14901.0322	13280.3633	NaN	16202.6836	14674.5225	14078.373	NaN	16234.4375	13098.9697	NaN	NaN	13721.2256	NaN	NaN	14800.501	NaN	NaN	14135.251	NaN	12748.5566	12860.2803	11961.6152	15524.5107	13002.9697	15093.1562	13372.0713	NaN	15124.832	NaN	NaN	13123.4326	15083.4863	15612.2275	NaN	NaN	NaN	11803.0273	14082.0059	NaN	NaN	NaN	NaN	16114.4238	NaN	13127.8281	13573.5908	14403.8896	NaN	16484.0781	NaN	NaN	13028.1729	13199.583	NaN	12926.1094	13525.5957	NaN	14671.8125	NaN	NaN	13894.251	NaN	NaN	16461.1484	NaN	NaN	20675.084	NaN	17324.7207	NaN	NaN	NaN	14411.8643	NaN	NaN	NaN	10468.9082	11654.915	15069.0264	13263.7871	14481.4912	14916.9951	13451.168	NaN	12746.2715
2.6684	NaN	12348.6514	12689.5625	13202.3281	13487.8486	NaN	NaN	13286.7559	NaN	15330.1143	12656.3584	NaN	NaN	NaN	14954.459	NaN	14868.2432	13313.5391	NaN	NaN	14934.1426	NaN	NaN	15603.3271	13174.4121	NaN	NaN	NaN	NaN	NaN	NaN	NaN	NaN	14673.3232	NaN	13940.7588	NaN	12545.3691	14592.6064	13753.1201	14632.2021	13212.6035	NaN	15216.7119	NaN	NaN	NaN	14752.4199	14656.4805	NaN	NaN	NaN	12007.3213	13943	NaN	NaN	NaN	NaN	14145.6016	NaN	NaN	14205.6211	NaN	NaN	NaN	NaN	NaN	13293.6582	13720.1045	NaN	13831.3301	13043.6162	NaN	13736.335	NaN	NaN	13899.2129	NaN	NaN	16505.9238	NaN	NaN	17998.4062	NaN	NaN	NaN	NaN	NaN	NaN	NaN	NaN	NaN	10401.2324	12339.3652	14841.6484	12786.5469	NaN	NaN	NaN	NaN	13428.0381
2.8019	NaN	NaN	NaN	NaN	NaN	NaN	NaN	NaN	NaN	14832.5244	NaN	NaN	NaN	NaN	14149.5146	NaN	15620.9482	13224.1514	NaN	NaN	14804.3096	NaN	NaN	NaN	12355.0645	NaN	NaN	NaN	NaN	NaN	NaN	NaN	NaN	NaN	NaN	14078.0635	NaN	NaN	15455.6982	12943.1455	NaN	13900.6914	NaN	15366.5322	NaN	NaN	NaN	15412.499	15154.5488	NaN	NaN	NaN	11584.3457	14045.8057	NaN	NaN	NaN	NaN	13514.0625	NaN	NaN	NaN	NaN	NaN	NaN	NaN	NaN	12964.6709	13924.3906	NaN	13032.0762	13268.5879	NaN	NaN	NaN	NaN	13311.7656	NaN	NaN	17174.5	NaN	NaN	15870.4023	NaN	NaN	NaN	NaN	NaN	NaN	NaN	NaN	NaN	NaN	12349.4912	16305.4941	13015.1104	NaN	NaN	NaN	NaN	13437.3271
2.9353	NaN	NaN	NaN	NaN	NaN	NaN	NaN	NaN	NaN	14790.7432	NaN	NaN	NaN	NaN	NaN	NaN	NaN	NaN	NaN	NaN	NaN	NaN	NaN	NaN	NaN	NaN	NaN	NaN	NaN	NaN	NaN	NaN	NaN	NaN	NaN	NaN	NaN	NaN	NaN	13379.7256	NaN	NaN	NaN	14743.7891	NaN	NaN	NaN	15658.9824	14066.6719	NaN	NaN	NaN	NaN	14352.2852	NaN	NaN	NaN	NaN	12533.7998	NaN	NaN	NaN	NaN	NaN	NaN	NaN	NaN	NaN	NaN	NaN	NaN	13662.5811	NaN	NaN	NaN	NaN	NaN	NaN	NaN	NaN	NaN	NaN	15516.8506	NaN	NaN	NaN	NaN	NaN	NaN	NaN	NaN	NaN	NaN	NaN	15447.2051	12240.3506	NaN	NaN	NaN	NaN	NaN
3.0687	NaN	NaN	NaN	NaN	NaN	NaN	NaN	NaN	NaN	14816.3018	NaN	NaN	NaN	NaN	NaN	NaN	NaN	NaN	NaN	NaN	NaN	NaN	NaN	NaN	NaN	NaN	NaN	NaN	NaN	NaN	NaN	NaN	NaN	NaN	NaN	NaN	NaN	NaN	NaN	NaN	NaN	NaN	NaN	14729.4189	NaN	NaN	NaN	NaN	NaN	NaN	NaN	NaN	NaN	NaN	NaN	NaN	NaN	NaN	12608.2822	NaN	NaN	NaN	NaN	NaN	NaN	NaN	NaN	NaN	NaN	NaN	NaN	NaN	NaN	NaN	NaN	NaN	NaN	NaN	NaN	NaN	NaN	NaN	NaN	NaN	NaN	NaN	NaN	NaN	NaN	NaN	NaN	NaN	NaN	NaN	NaN	13121.7461	NaN	NaN	NaN	NaN	NaN
3.2021	NaN	NaN	NaN	NaN	NaN	NaN	NaN	NaN	NaN	NaN	NaN	NaN	NaN	NaN	NaN	NaN	NaN	NaN	NaN	NaN	NaN	NaN	NaN	NaN	NaN	NaN	NaN	NaN	NaN	NaN	NaN	NaN	NaN	NaN	NaN	NaN	NaN	NaN	NaN	NaN	NaN	NaN	NaN	NaN	NaN	NaN	NaN	NaN	NaN	NaN	NaN	NaN	NaN	NaN	NaN	NaN	NaN	NaN	13061.7764	NaN	NaN	NaN	NaN	NaN	NaN	NaN	NaN	NaN	NaN	NaN	NaN	NaN	NaN	NaN	NaN	NaN	NaN	NaN	NaN	NaN	NaN	NaN	NaN	NaN	NaN	NaN	NaN	NaN	NaN	NaN	NaN	NaN	NaN	NaN	NaN	NaN	NaN	NaN	NaN	NaN	NaN
3.3355	NaN	NaN	NaN	NaN	NaN	NaN	NaN	NaN	NaN	NaN	NaN	NaN	NaN	NaN	NaN	NaN	NaN	NaN	NaN	NaN	NaN	NaN	NaN	NaN	NaN	NaN	NaN	NaN	NaN	NaN	NaN	NaN	NaN	NaN	NaN	NaN	NaN	NaN	NaN	NaN	NaN	NaN	NaN	NaN	NaN	NaN	NaN	NaN	NaN	NaN	NaN	NaN	NaN	NaN	NaN	NaN	NaN	NaN	12732.4912	NaN	NaN	NaN	NaN	NaN	NaN	NaN	NaN	NaN	NaN	NaN	NaN	NaN	NaN	NaN	NaN	NaN	NaN	NaN	NaN	NaN	NaN	NaN	NaN	NaN	NaN	NaN	NaN	NaN	NaN	NaN	NaN	NaN	NaN	NaN	NaN	NaN	NaN	NaN	NaN	NaN	NaN
3.469	NaN	NaN	NaN	NaN	NaN	NaN	NaN	NaN	NaN	NaN	NaN	NaN	NaN	NaN	NaN	NaN	NaN	NaN	NaN	NaN	NaN	NaN	NaN	NaN	NaN	NaN	NaN	NaN	NaN	NaN	NaN	NaN	NaN	NaN	NaN	NaN	NaN	NaN	NaN	NaN	NaN	NaN	NaN	NaN	NaN	NaN	NaN	NaN	NaN	NaN	NaN	NaN	NaN	NaN	NaN	NaN	NaN	NaN	11920.1191	NaN	NaN	NaN	NaN	NaN	NaN	NaN	NaN	NaN	NaN	NaN	NaN	NaN	NaN	NaN	NaN	NaN	NaN	NaN	NaN	NaN	NaN	NaN	NaN	NaN	NaN	NaN	NaN	NaN	NaN	NaN	NaN	NaN	NaN	NaN	NaN	NaN	NaN	NaN	NaN	NaN	NaN
3.6024	NaN	NaN	NaN	NaN	NaN	NaN	NaN	NaN	NaN	NaN	NaN	NaN	NaN	NaN	NaN	NaN	NaN	NaN	NaN	NaN	NaN	NaN	NaN	NaN	NaN	NaN	NaN	NaN	NaN	NaN	NaN	NaN	NaN	NaN	NaN	NaN	NaN	NaN	NaN	NaN	NaN	NaN	NaN	NaN	NaN	NaN	NaN	NaN	NaN	NaN	NaN	NaN	NaN	NaN	NaN	NaN	NaN	NaN	NaN	NaN	NaN	NaN	NaN	NaN	NaN	NaN	NaN	NaN	NaN	NaN	NaN	NaN	NaN	NaN	NaN	NaN	NaN	NaN	NaN	NaN	NaN	NaN	NaN	NaN	NaN	NaN	NaN	NaN	NaN	NaN	NaN	NaN	NaN	NaN	NaN	NaN	NaN	NaN	NaN	NaN	NaN
3.7358	NaN	NaN	NaN	NaN	NaN	NaN	NaN	NaN	NaN	NaN	NaN	NaN	NaN	NaN	NaN	NaN	NaN	NaN	NaN	NaN	NaN	NaN	NaN	NaN	NaN	NaN	NaN	NaN	NaN	NaN	NaN	NaN	NaN	NaN	NaN	NaN	NaN	NaN	NaN	NaN	NaN	NaN	NaN	NaN	NaN	NaN	NaN	NaN	NaN	NaN	NaN	NaN	NaN	NaN	NaN	NaN	NaN	NaN	NaN	NaN	NaN	NaN	NaN	NaN	NaN	NaN	NaN	NaN	NaN	NaN	NaN	NaN	NaN	NaN	NaN	NaN	NaN	NaN	NaN	NaN	NaN	NaN	NaN	NaN	NaN	NaN	NaN	NaN	NaN	NaN	NaN	NaN	NaN	NaN	NaN	NaN	NaN	NaN	NaN	NaN	NaN
3.8692	NaN	NaN	NaN	NaN	NaN	NaN	NaN	NaN	NaN	NaN	NaN	NaN	NaN	NaN	NaN	NaN	NaN	NaN	NaN	NaN	NaN	NaN	NaN	NaN	NaN	NaN	NaN	NaN	NaN	NaN	NaN	NaN	NaN	NaN	NaN	NaN	NaN	NaN	NaN	NaN	NaN	NaN	NaN	NaN	NaN	NaN	NaN	NaN	NaN	NaN	NaN	NaN	NaN	NaN	NaN	NaN	NaN	NaN	NaN	NaN	NaN	NaN	NaN	NaN	NaN	NaN	NaN	NaN	NaN	NaN	NaN	NaN	NaN	NaN	NaN	NaN	NaN	NaN	NaN	NaN	NaN	NaN	NaN	NaN	NaN	NaN	NaN	NaN	NaN	NaN	NaN	NaN	NaN	NaN	NaN	NaN	NaN	NaN	NaN	NaN	NaN
4.0027	NaN	NaN	NaN	NaN	NaN	NaN	NaN	NaN	NaN	NaN	NaN	NaN	NaN	NaN	NaN	NaN	NaN	NaN	NaN	NaN	NaN	NaN	NaN	NaN	NaN	NaN	NaN	NaN	NaN	NaN	NaN	NaN	NaN	NaN	NaN	NaN	NaN	NaN	NaN	NaN	NaN	NaN	NaN	NaN	NaN	NaN	NaN	NaN	NaN	NaN	NaN	NaN	NaN	NaN	NaN	NaN	NaN	NaN	NaN	NaN	NaN	NaN	NaN	NaN	NaN	NaN	NaN	NaN	NaN	NaN	NaN	NaN	NaN	NaN	NaN	NaN	NaN	NaN	NaN	NaN	NaN	NaN	NaN	NaN	NaN	NaN	NaN	NaN	NaN	NaN	NaN	NaN	NaN	NaN	NaN	NaN	NaN	NaN	NaN	NaN	NaN
4.1361	NaN	NaN	NaN	NaN	NaN	NaN	NaN	NaN	NaN	NaN	NaN	NaN	NaN	NaN	NaN	NaN	NaN	NaN	NaN	NaN	NaN	NaN	NaN	NaN	NaN	NaN	NaN	NaN	NaN	NaN	NaN	NaN	NaN	NaN	NaN	NaN	NaN	NaN	NaN	NaN	NaN	NaN	NaN	NaN	NaN	NaN	NaN	NaN	NaN	NaN	NaN	NaN	NaN	NaN	NaN	NaN	NaN	NaN	NaN	NaN	NaN	NaN	NaN	NaN	NaN	NaN	NaN	NaN	NaN	NaN	NaN	NaN	NaN	NaN	NaN	NaN	NaN	NaN	NaN	NaN	NaN	NaN	NaN	NaN	NaN	NaN	NaN	NaN	NaN	NaN	NaN	NaN	NaN	NaN	NaN	NaN	NaN	NaN	NaN	NaN	NaN
4.2695	NaN	NaN	NaN	NaN	NaN	NaN	NaN	NaN	NaN	NaN	NaN	NaN	NaN	NaN	NaN	NaN	NaN	NaN	NaN	NaN	NaN	NaN	NaN	NaN	NaN	NaN	NaN	NaN	NaN	NaN	NaN	NaN	NaN	NaN	NaN	NaN	NaN	NaN	NaN	NaN	NaN	NaN	NaN	NaN	NaN	NaN	NaN	NaN	NaN	NaN	NaN	NaN	NaN	NaN	NaN	NaN	NaN	NaN	NaN	NaN	NaN	NaN	NaN	NaN	NaN	NaN	NaN	NaN	NaN	NaN	NaN	NaN	NaN	NaN	NaN	NaN	NaN	NaN	NaN	NaN	NaN	NaN	NaN	NaN	NaN	NaN	NaN	NaN	NaN	NaN	NaN	NaN	NaN	NaN	NaN	NaN	NaN	NaN	NaN	NaN	NaN
4.4029	NaN	NaN	NaN	NaN	NaN	NaN	NaN	NaN	NaN	NaN	NaN	NaN	NaN	NaN	NaN	NaN	NaN	NaN	NaN	NaN	NaN	NaN	NaN	NaN	NaN	NaN	NaN	NaN	NaN	NaN	NaN	NaN	NaN	NaN	NaN	NaN	NaN	NaN	NaN	NaN	NaN	NaN	NaN	NaN	NaN	NaN	NaN	NaN	NaN	NaN	NaN	NaN	NaN	NaN	NaN	NaN	NaN	NaN	NaN	NaN	NaN	NaN	NaN	NaN	NaN	NaN	NaN	NaN	NaN	NaN	NaN	NaN	NaN	NaN	NaN	NaN	NaN	NaN	NaN	NaN	NaN	NaN	NaN	NaN	NaN	NaN	NaN	NaN	NaN	NaN	NaN	NaN	NaN	NaN	NaN	NaN	NaN	NaN	NaN	NaN	NaN
4.5363	NaN	NaN	NaN	NaN	NaN	NaN	NaN	NaN	NaN	NaN	NaN	NaN	NaN	NaN	NaN	NaN	NaN	NaN	NaN	NaN	NaN	NaN	NaN	NaN	NaN	NaN	NaN	NaN	NaN	NaN	NaN	NaN	NaN	NaN	NaN	NaN	NaN	NaN	NaN	NaN	NaN	NaN	NaN	NaN	NaN	NaN	NaN	NaN	NaN	NaN	NaN	NaN	NaN	NaN	NaN	NaN	NaN	NaN	NaN	NaN	NaN	NaN	NaN	NaN	NaN	NaN	NaN	NaN	NaN	NaN	NaN	NaN	NaN	NaN	NaN	NaN	NaN	NaN	NaN	NaN	NaN	NaN	NaN	NaN	NaN	NaN	NaN	NaN	NaN	NaN	NaN	NaN	NaN	NaN	NaN	NaN	NaN	NaN	NaN	NaN	NaN
4.6698	NaN	NaN	NaN	NaN	NaN	NaN	NaN	NaN	NaN	NaN	NaN	NaN	NaN	NaN	NaN	NaN	NaN	NaN	NaN	NaN	NaN	NaN	NaN	NaN	NaN	NaN	NaN	NaN	NaN	NaN	NaN	NaN	NaN	NaN	NaN	NaN	NaN	NaN	NaN	NaN	NaN	NaN	NaN	NaN	NaN	NaN	NaN	NaN	NaN	NaN	NaN	NaN	NaN	NaN	NaN	NaN	NaN	NaN	NaN	NaN	NaN	NaN	NaN	NaN	NaN	NaN	NaN	NaN	NaN	NaN	NaN	NaN	NaN	NaN	NaN	NaN	NaN	NaN	NaN	NaN	NaN	NaN	NaN	NaN	NaN	NaN	NaN	NaN	NaN	NaN	NaN	NaN	NaN	NaN	NaN	NaN	NaN	NaN	NaN	NaN	NaN
4.8032	NaN	NaN	NaN	NaN	NaN	NaN	NaN	NaN	NaN	NaN	NaN	NaN	NaN	NaN	NaN	NaN	NaN	NaN	NaN	NaN	NaN	NaN	NaN	NaN	NaN	NaN	NaN	NaN	NaN	NaN	NaN	NaN	NaN	NaN	NaN	NaN	NaN	NaN	NaN	NaN	NaN	NaN	NaN	NaN	NaN	NaN	NaN	NaN	NaN	NaN	NaN	NaN	NaN	NaN	NaN	NaN	NaN	NaN	NaN	NaN	NaN	NaN	NaN	NaN	NaN	NaN	NaN	NaN	NaN	NaN	NaN	NaN	NaN	NaN	NaN	NaN	NaN	NaN	NaN	NaN	NaN	NaN	NaN	NaN	NaN	NaN	NaN	NaN	NaN	NaN	NaN	NaN	NaN	NaN	NaN	NaN	NaN	NaN	NaN	NaN	NaN
4.9366	NaN	NaN	NaN	NaN	NaN	NaN	NaN	NaN	NaN	NaN	NaN	NaN	NaN	NaN	NaN	NaN	NaN	NaN	NaN	NaN	NaN	NaN	NaN	NaN	NaN	NaN	NaN	NaN	NaN	NaN	NaN	NaN	NaN	NaN	NaN	NaN	NaN	NaN	NaN	NaN	NaN	NaN	NaN	NaN	NaN	NaN	NaN	NaN	NaN	NaN	NaN	NaN	NaN	NaN	NaN	NaN	NaN	NaN	NaN	NaN	NaN	NaN	NaN	NaN	NaN	NaN	NaN	NaN	NaN	NaN	NaN	NaN	NaN	NaN	NaN	NaN	NaN	NaN	NaN	NaN	NaN	NaN	NaN	NaN	NaN	NaN	NaN	NaN	NaN	NaN	NaN	NaN	NaN	NaN	NaN	NaN	NaN	NaN	NaN	NaN	NaN
5.07	NaN	NaN	NaN	NaN	NaN	NaN	NaN	NaN	NaN	NaN	NaN	NaN	NaN	NaN	NaN	NaN	NaN	NaN	NaN	NaN	NaN	NaN	NaN	NaN	NaN	NaN	NaN	NaN	NaN	NaN	NaN	NaN	NaN	NaN	NaN	NaN	NaN	NaN	NaN	NaN	NaN	NaN	NaN	NaN	NaN	NaN	NaN	NaN	NaN	NaN	NaN	NaN	NaN	NaN	NaN	NaN	NaN	NaN	NaN	NaN	NaN	NaN	NaN	NaN	NaN	NaN	NaN	NaN	NaN	NaN	NaN	NaN	NaN	NaN	NaN	NaN	NaN	NaN	NaN	NaN	NaN	NaN	NaN	NaN	NaN	NaN	NaN	NaN	NaN	NaN	NaN	NaN	NaN	NaN	NaN	NaN	NaN	NaN	NaN	NaN	NaN
5.2035	NaN	NaN	NaN	NaN	NaN	NaN	NaN	NaN	NaN	NaN	NaN	NaN	NaN	NaN	NaN	NaN	NaN	NaN	NaN	NaN	NaN	NaN	NaN	NaN	NaN	NaN	NaN	NaN	NaN	NaN	NaN	NaN	NaN	NaN	NaN	NaN	NaN	NaN	NaN	NaN	NaN	NaN	NaN	NaN	NaN	NaN	NaN	NaN	NaN	NaN	NaN	NaN	NaN	NaN	NaN	NaN	NaN	NaN	NaN	NaN	NaN	NaN	NaN	NaN	NaN	NaN	NaN	NaN	NaN	NaN	NaN	NaN	NaN	NaN	NaN	NaN	NaN	NaN	NaN	NaN	NaN	NaN	NaN	NaN	NaN	NaN	NaN	NaN	NaN	NaN	NaN	NaN	NaN	NaN	NaN	NaN	NaN	NaN	NaN	NaN	NaN
5.3369	NaN	NaN	NaN	NaN	NaN	NaN	NaN	NaN	NaN	NaN	NaN	NaN	NaN	NaN	NaN	NaN	NaN	NaN	NaN	NaN	NaN	NaN	NaN	NaN	NaN	NaN	NaN	NaN	NaN	NaN	NaN	NaN	NaN	NaN	NaN	NaN	NaN	NaN	NaN	NaN	NaN	NaN	NaN	NaN	NaN	NaN	NaN	NaN	NaN	NaN	NaN	NaN	NaN	NaN	NaN	NaN	NaN	NaN	NaN	NaN	NaN	NaN	NaN	NaN	NaN	NaN	NaN	NaN	NaN	NaN	NaN	NaN	NaN	NaN	NaN	NaN	NaN	NaN	NaN	NaN	NaN	NaN	NaN	NaN	NaN	NaN	NaN	NaN	NaN	NaN	NaN	NaN	NaN	NaN	NaN	NaN	NaN	NaN	NaN	NaN	NaN
5.4703	NaN	NaN	NaN	NaN	NaN	NaN	NaN	NaN	NaN	NaN	NaN	NaN	NaN	NaN	NaN	NaN	NaN	NaN	NaN	NaN	NaN	NaN	NaN	NaN	NaN	NaN	NaN	NaN	NaN	NaN	NaN	NaN	NaN	NaN	NaN	NaN	NaN	NaN	NaN	NaN	NaN	NaN	NaN	NaN	NaN	NaN	NaN	NaN	NaN	NaN	NaN	NaN	NaN	NaN	NaN	NaN	NaN	NaN	NaN	NaN	NaN	NaN	NaN	NaN	NaN	NaN	NaN	NaN	NaN	NaN	NaN	NaN	NaN	NaN	NaN	NaN	NaN	NaN	NaN	NaN	NaN	NaN	NaN	NaN	NaN	NaN	NaN	NaN	NaN	NaN	NaN	NaN	NaN	NaN	NaN	NaN	NaN	NaN	NaN	NaN	NaN
5.6037	NaN	NaN	NaN	NaN	NaN	NaN	NaN	NaN	NaN	NaN	NaN	NaN	NaN	NaN	NaN	NaN	NaN	NaN	NaN	NaN	NaN	NaN	NaN	NaN	NaN	NaN	NaN	NaN	NaN	NaN	NaN	NaN	NaN	NaN	NaN	NaN	NaN	NaN	NaN	NaN	NaN	NaN	NaN	NaN	NaN	NaN	NaN	NaN	NaN	NaN	NaN	NaN	NaN	NaN	NaN	NaN	NaN	NaN	NaN	NaN	NaN	NaN	NaN	NaN	NaN	NaN	NaN	NaN	NaN	NaN	NaN	NaN	NaN	NaN	NaN	NaN	NaN	NaN	NaN	NaN	NaN	NaN	NaN	NaN	NaN	NaN	NaN	NaN	NaN	NaN	NaN	NaN	NaN	NaN	NaN	NaN	NaN	NaN	NaN	NaN	NaN
5.7371	NaN	NaN	NaN	NaN	NaN	NaN	NaN	NaN	NaN	NaN	NaN	NaN	NaN	NaN	NaN	NaN	NaN	NaN	NaN	NaN	NaN	NaN	NaN	NaN	NaN	NaN	NaN	NaN	NaN	NaN	NaN	NaN	NaN	NaN	NaN	NaN	NaN	NaN	NaN	NaN	NaN	NaN	NaN	NaN	NaN	NaN	NaN	NaN	NaN	NaN	NaN	NaN	NaN	NaN	NaN	NaN	NaN	NaN	NaN	NaN	NaN	NaN	NaN	NaN	NaN	NaN	NaN	NaN	NaN	NaN	NaN	NaN	NaN	NaN	NaN	NaN	NaN	NaN	NaN	NaN	NaN	NaN	NaN	NaN	NaN	NaN	NaN	NaN	NaN	NaN	NaN	NaN	NaN	NaN	NaN	NaN	NaN	NaN	NaN	NaN	NaN
5.8706	NaN	NaN	NaN	NaN	NaN	NaN	NaN	NaN	NaN	NaN	NaN	NaN	NaN	NaN	NaN	NaN	NaN	NaN	NaN	NaN	NaN	NaN	NaN	NaN	NaN	NaN	NaN	NaN	NaN	NaN	NaN	NaN	NaN	NaN	NaN	NaN	NaN	NaN	NaN	NaN	NaN	NaN	NaN	NaN	NaN	NaN	NaN	NaN	NaN	NaN	NaN	NaN	NaN	NaN	NaN	NaN	NaN	NaN	NaN	NaN	NaN	NaN	NaN	NaN	NaN	NaN	NaN	NaN	NaN	NaN	NaN	NaN	NaN	NaN	NaN	NaN	NaN	NaN	NaN	NaN	NaN	NaN	NaN	NaN	NaN	NaN	NaN	NaN	NaN	NaN	NaN	NaN	NaN	NaN	NaN	NaN	NaN	NaN	NaN	NaN	NaN
