0.0000	31825.0723
0.1334	31254.7617
0.2668	32369.0684
0.4003	35105.1719
0.5337	37734.3594
0.6671	48384.7266
0.8005	73669.7734
0.9340	90366.6328
1.0674	77584.9766
1.2008	54593.7305
1.3342	42595.0508
1.4676	36685.0156
1.6011	35875.6602
