0.0000	12871.0547
0.1334	14125.4473
0.2668	15753.7617
0.4003	18586.7617
0.5337	16790.5410
0.6671	16490.3789
0.8005	17073.5898
0.9340	16575.4688
1.0674	16299.1494
1.2008	15877.3076
1.3342	15247.8438
1.4676	15579.4092
1.6011	14904.0186
1.7345	15220.6445
1.8679	14540.4902
2.0013	14531.2090
2.1347	13664.8301
2.2682	13325.1553
2.4016	13232.8984
2.5350	13953.5303
2.6684	13211.4346
2.8019	12991.2910
