0.0000	36472.9062
0.1334	35459.1914
0.2668	34521.7305
0.4003	36690.7578
0.5337	37121.4492
0.6671	36294.8203
0.8005	35612.8398
0.9340	36067.4375
1.0674	36593.3984
1.2008	36118.3477
1.3342	34567.7266
1.4676	34775.9180
1.6011	34552.0742
1.7345	34412.8164
1.8679	33780.2617
2.0013	35127.9727
2.1347	35190.6914
2.2682	36086.2812
2.4016	36666.9297
2.5350	36907.0469
2.6684	39498.0117
2.8019	46527.1875
2.9353	59191.8555
3.0687	63808.8008
3.2021	50882.5195
3.3355	41864.3789
3.4690	37568.8906
3.6024	36988.6992
3.7358	35567.5156
3.8692	36493.2461
