0.0000	32570.3789
0.1334	32936.5508
0.2668	33956.7617
0.4003	33371.8672
0.5337	33506.1602
0.6671	33693.6289
0.8005	32722.6777
0.9340	32783.8633
1.0674	31788.7285
1.2008	32376.3887
1.3342	32644.7246
1.4676	32208.1211
1.6011	31791.6426
1.7345	30533.5488
1.8679	31389.6992
2.0013	32266.8301
2.1347	31165.6816
2.2682	33579.6641
2.4016	35782.7617
2.5350	38136.3828
2.6684	42511.2070
2.8019	53661.7734
2.9353	71147.1797
3.0687	102771.4219
3.2021	94701.7578
3.3355	64949.8867
3.4690	46582.1562
3.6024	41144.9023
3.7358	37536.7344
3.8692	36421.3203
