X,Y
0.00000,14067.140
0.13342,14180.926
0.26684,15653.533
0.40027,19672.982
0.53369,24264.379
0.66711,25790.693
0.80053,26029.150
0.93395,23334.305
1.06737,22921.797
1.20080,19652.982
1.33422,16838.869
1.46764,15652.582
1.60106,15795.395
1.73448,17813.127
1.86791,18611.162
2.00133,19369.857
2.13475,17468.959
2.26817,14996.028
2.40159,13780.021
2.53502,13390.100
