0.00000,12550.147
0.13342,14222.297
0.26684,16024.201
0.40027,20180.771
0.53369,21242.926
0.66711,21479.070
0.80053,20498.977
0.93395,20316.002
1.06737,19994.920
1.20080,18473.238
1.33422,18654.607
1.46764,19446.672
1.60106,18402.490
1.73448,16401.531
1.86791,15832.728
2.00133,15538.615
2.13475,15278.514
2.26817,14633.336
2.40159,14877.827
2.53502,13744.298
2.66844,13403.618
2.80186,13002.146
2.93528,13436.627
3.06870,14210.815
3.20212,14263.567
3.33555,14030.355
3.46897,14236.542
3.60239,14913.117
3.73581,13590.322
3.86923,13348.726
4.00266,13275.044
4.13608,12416.888
4.26950,12081.374
4.40292,12218.938
4.53634,11971.182
4.66976,11477.205
4.80319,11837.735
4.93661,11978.763
5.07003,12062.337
5.20345,11654.896
