0.00000,38171.449
0.13342,38767.184
0.26684,41607.941
0.40027,45858.449
0.53369,62878.016
0.66711,97047.422
0.80053,151634.250
0.93395,151011.219
1.06737,101062.469
1.20080,65868.680
1.33422,52373.410
