x	Y_20180514_15338_c2_17_2g	Y_20180514_15338_c2_18_2g	Y_20180514_15338_c2_19_2g	Y_20180514_15338_c2_19_4g	Y_20180514_15338_c2_23_11g	Y_20180514_15338_c2_27_5g	Y_20180514_15338_c2_3_3g	Y_20180514_15338_c2_32_1g	Y_20180514_15338_c2_35_6g	Y_20180514_15338_c2_5_3g	Y_20180514_15338_c2_7_2g
0	12705.204	10611.588	11136.518	14412.253	10248.406	11982.003	11424.013	10943.286	11436.936	11019.741	15178.856
0.1334	12217.999	11611.828	11600.473	12573.526	10535.241	11543.36	12672.592	11059.342	12329.032	11825.092	14857.889
0.2668	12567.43	12037.934	12047.047	11757.706	11311.317	11152.68	14211.667	11081.191	12884.985	11814.372	14220.924
0.4003	12808.642	12722.011	12941.281	11011.061	12713.248	10964.184	15294.773	11194.703	12712.484	12051.353	13841.899
0.5337	12085.628	13217.454	13074.411	11778.662	13279.36	10666.273	17629.025	12662.679	13698.691	12846.964	15425.427
0.6671	13926.842	14370.381	13514.633	13278.995	15981.212	11697.74	20645.52	13806.866	13789.461	13842.543	15982.192
0.8005	15271.404	14483.147	14578.403	16955.896	17815.674	13805.947	19454.375	14559.862	15296.656	13885.524	19787.643
0.934	17516.043	14664.981	14811.874	19448.365	16808.328	17623.852	18470.598	16390.547	18712.312	15059.985	23302.115
1.0674	22994.049	15496.102	15718.671	20409.355	15998.193	19667.23	16575	17630.781	20370.295	15146.485	21609.375
1.2008	23757.088	16076.104	17407.33	18630.834	15564.494	18911.188	15562.671	18389.904	19868.838	15150.439	18490.961
1.3342	21150.732	16899.068	20136.34	18640.51	16110.051	17385.639	14579.46	19608.041	19157	14652.605	17644.754
1.4676	18110.33	16627.18	23181.297	18218.857	15346.546	17001.205	15105.906	19318.207	17492.104	13762.129	15781.883
1.6011	15692.512	17171.748	23135.238	17481.9	14849.876	16771.668	15512.418	18146.188	17829.709	13927.691	16437.287
1.7345	15308.933	16695.111	22138.219	16524.25	14820.342	17284.488	15093.229	16996.422	17646.137	12994.754	16633.91
1.8679	14722.165	15901.867	20893.814	16663.428	15102.871	16834.537	13928.422	16523.691	17859.473	12817.181	16467.307
2.0013	13403.028	16274.187	20735.508	14783.153	14776.181	17163.674	13428.535	16814.033	17662.107	12508.781	15379.223
2.1348	12880.743	15779.473	20370.916	14846.358	13653.234	16962.746	13378.675	16473.193	17440.65	12002.843	13864.544
2.2682	13191.195	16032.22	20381.035	14083.227	13603.082	15007.036	12811.735	15934.618	16344.168	NaN	13184.803
2.4016	12851.803	14917.377	19988.529	13403.962	13930.763	14678.434	12924.549	15579.669	15009.104	NaN	12694.692
2.535	NaN	14735.77	19197.682	13107.683	13586.194	14510.981	13063.087	15246.807	14453.093	NaN	11636.495
2.6684	NaN	13755.695	17996.578	12423.057	14051.352	15687.303	12615.691	14765.786	14414.788	NaN	11147.94
2.8019	NaN	12579.487	17729.588	12333.384	14657.55	17095.707	NaN	14304.787	14147.311	NaN	10774.207
2.9353	NaN	12037.245	16284.7	12316.05	15628.075	16994.141	NaN	13120.503	14111.541	NaN	10149.856
3.0687	NaN	12589.753	15361.104	12607.412	16706.342	NaN	NaN	12745.15	13822.562	NaN	9781.257
3.2021	NaN	12114.806	14749.354	13136.413	16357.357	NaN	NaN	12935.086	NaN	NaN	9851.087
3.3356	NaN	11941.948	14046.783	NaN	NaN	NaN	NaN	NaN	NaN	NaN	NaN
3.469	NaN	NaN	14801.165	NaN	NaN	NaN	NaN	NaN	NaN	NaN	NaN
3.6024	NaN	NaN	14681.16	NaN	NaN	NaN	NaN	NaN	NaN	NaN	NaN
3.7358	NaN	NaN	14464.437	NaN	NaN	NaN	NaN	NaN	NaN	NaN	NaN
3.8692	NaN	NaN	NaN	NaN	NaN	NaN	NaN	NaN	NaN	NaN	NaN
4.0027	NaN	NaN	NaN	NaN	NaN	NaN	NaN	NaN	NaN	NaN	NaN
4.1361	NaN	NaN	NaN	NaN	NaN	NaN	NaN	NaN	NaN	NaN	NaN
4.2695	NaN	NaN	NaN	NaN	NaN	NaN	NaN	NaN	NaN	NaN	NaN
4.4029	NaN	NaN	NaN	NaN	NaN	NaN	NaN	NaN	NaN	NaN	NaN
4.5363	NaN	NaN	NaN	NaN	NaN	NaN	NaN	NaN	NaN	NaN	NaN
4.6698	NaN	NaN	NaN	NaN	NaN	NaN	NaN	NaN	NaN	NaN	NaN
4.8032	NaN	NaN	NaN	NaN	NaN	NaN	NaN	NaN	NaN	NaN	NaN
4.9366	NaN	NaN	NaN	NaN	NaN	NaN	NaN	NaN	NaN	NaN	NaN
5.07	NaN	NaN	NaN	NaN	NaN	NaN	NaN	NaN	NaN	NaN	NaN
5.2035	NaN	NaN	NaN	NaN	NaN	NaN	NaN	NaN	NaN	NaN	NaN
