x	Y_20180130_15100b_1_10g	Y_20180130_15100b_1_12g	Y_20180130_15100b_1_13g	Y_20180130_15100b_1_2g	Y_20180130_15100b_1_5g	Y_20180130_15100b_1_8g	Y_20180130_15100b_10_12g	Y_20180130_15100b_10_13g	Y_20180130_15100b_10_14g	Y_20180130_15100b_10_7g	Y_20180130_15100b_11_11g	Y_20180130_15100b_11_2g	Y_20180130_15100b_12_15g	Y_20180130_15100b_12_1g	Y_20180130_15100b_12_8g	Y_20180130_15100b_13_10g	Y_20180130_15100b_13_14g	Y_20180130_15100b_13_2g	Y_20180130_15100b_13_4g	Y_20180130_15100b_14_10g	Y_20180130_15100b_14_9g	Y_20180130_15100b_15_12g	Y_20180130_15100b_15_15_1g	Y_20180130_15100b_15_15_2g	Y_20180130_15100b_15_2g	Y_20180130_15100b_15_7g	Y_20180130_15100b_16_12g	Y_20180130_15100b_16_5g	Y_20180130_15100b_17_3g	Y_20180130_15100b_17_4g	Y_20180130_15100b_17_7g	Y_20180130_15100b_18_10g	Y_20180130_15100b_18_11g	Y_20180130_15100b_18_14g	Y_20180130_15100b_18_18g	Y_20180130_15100b_18_2g	Y_20180130_15100b_18_8g	Y_20180130_15100b_18_9g	Y_20180130_15100b_19_13g	Y_20180130_15100b_19_1g	Y_20180130_15100b_2_1g	Y_20180130_15100b_2_7g	Y_20180130_15100b_2_8g	Y_20180130_15100b_2_9g	Y_20180130_15100b_20_14g	Y_20180130_15100b_20_5_2g	Y_20180130_15100b_21_15g	Y_20180130_15100b_21_16g	Y_20180130_15100b_21_1g	Y_20180130_15100b_21_8g	Y_20180130_15100b_22_17g	Y_20180130_15100b_22_19g	Y_20180130_15100b_24_13g	Y_20180130_15100b_24_4g	Y_20180130_15100b_3_10g	Y_20180130_15100b_3_11g	Y_20180130_15100b_4_12g	Y_20180130_15100b_4_17g	Y_20180130_15100b_4_19g	Y_20180130_15100b_4_24g	Y_20180130_15100b_4_4g	Y_20180130_15100b_4_7g	Y_20180130_15100b_5_15g	Y_20180130_15100b_5_17g	Y_20180130_15100b_5_20g	Y_20180130_15100b_5_24g	Y_20180130_15100b_5_3g	Y_20180130_15100b_6_2g	Y_20180130_15100b_6_3g	Y_20180130_15100b_6_4g	Y_20180130_15100b_6_5g	Y_20180130_15100b_6_8g	Y_20180130_15100b_7_13g	Y_20180130_15100b_7_15g	Y_20180130_15100b_7_16g	Y_20180130_15100b_7_2g	Y_20180130_15100b_7_7g	Y_20180130_15100b_8_1g	Y_20180130_15100b_8_3g	Y_20180130_15100b_8_6g	Y_20180130_15100b_8_7g	Y_20180130_15100b_8_9g	Y_20180130_15100b_9_11g	Y_20180130_15100b_9_6g	Y_20180130_15100b_9_7g
0	11906.161	12367.412	11205.619	11234.469	11744.3	11869.2	15711.844	12504.521	13737.777	14213.363	15203.645	12957.908	14536.585	13109.888	13904.81	13519.77	12837.442	12986.8	12784.119	13184.922	13287.463	13316.423	14380.064	12543.355	11941.734	13248.478	14659.788	11926.554	11351.776	12778.318	12140.82	13208.753	12551.048	13568.132	12952.065	13280.345	13418.499	13976.979	12994.212	10493.114	12849.725	15312.062	12620.468	15153.056	14786.455	11955.557	13010.461	15525.213	11745.263	12684.952	13297.83	13217.943	13860.354	14964.465	13540.2	13366.2	13634.647	12727.458	13422.7	14828.952	11777.552	13993.633	12261.67	11990.302	12895.206	13952.012	14374.313	13746.343	13140.932	13583.284	11999.837	13889.63	13329.646	14845.951	12274.272	14708.507	11828.227	11527.277	13194.844	13541.194	14484.37	14927.896	13321.939	13462.069	14810.299
0.1334	11770.418	12070.854	11146.308	12175.125	13152.863	12897.406	16286.502	13021.057	14098.317	14923.965	16893.182	13727.49	14602.859	13787.938	14169.492	14003.996	13631.363	14504.799	13775.067	16192.496	13924.875	13437.99	15396.213	12574.627	12646.907	14340.131	14036.998	11562.577	12730.145	14118.093	12805.87	14550.075	13693.479	13739.713	13600.141	13546.187	14373.358	14044.424	13905.648	11243.762	12724.594	17411.07	13638.98	15457.07	15068.959	12643.708	13864.066	17129.816	12774.272	13667.146	13344.432	14280.063	14334.768	15372.217	13755.037	13344.664	14554.776	13709.672	13272.475	16170.845	13039.723	13666.776	12530.233	12395.35	13432.614	14131.204	14205.846	15609.225	13244.214	13852.697	12192.822	14404.586	13598.776	18392.977	12902.859	13889.604	13240.698	12147.016	14141.802	13638.271	14027.845	15227.928	14466.325	15079.162	16564.479
0.2668	12709.344	13672.021	12308.519	12401.219	15803.495	13183.375	19216.205	15171.948	16099.225	17140.445	19305.262	14528.292	16833.537	15498.16	14424.472	16655.941	14262.751	18266.75	13967.837	18007.061	14952.685	14073.721	16123.277	13252.873	14621.804	16409.801	15484.575	12511.386	13860.562	15661.45	15376.858	17093.627	15645.238	15754.902	15589.795	14900.227	15858.024	14533.069	14128.31	11821.04	14467.946	20632.527	15251.297	16521.361	16903.176	14640.212	15673.211	19266.068	14540.807	16742.75	15161.355	16488.221	16608.246	16946.76	13873.061	13646.705	15362.25	17235.502	13582.615	19940.479	16221.892	14075.284	13420.369	13862.242	15056.077	16258.215	15674.062	20077.037	14848.415	14743.051	13667.49	16283.837	15402.207	21457.316	14170.219	15272.575	15773.019	14001.369	17252.26	15708.161	14982.45	18156.285	17521.988	16973.359	19921.271
0.4003	13914.613	15082.214	14174.113	13376.791	15077.807	14861.61	19673.457	16964.764	19574.562	21311.141	23618.896	16371.607	18731.771	18064.297	17418.693	19279.221	16112.467	22697	15809.361	21161.602	17465.037	15110.104	18594.834	14741.709	17901.855	20679.16	17976.916	13086.271	15349.744	16817.752	18972.957	18229.838	18745.383	17704.168	19122.014	17879.293	17663.895	16232.346	15993.249	11868.956	17272.881	20738.328	16766.117	18071.178	18680.955	16956.965	18231.035	17437.777	17024.201	19018.51	15913.757	18988.262	18552.266	19649.484	15483.326	13656.875	17401.795	24275.787	13876.751	23984.012	18895.609	15664.68	16595.098	15654.603	15878.604	16611.975	18063.027	21778.498	18105.314	17160.545	16333.711	21028.104	16824.129	23869.674	16915.039	18201.051	17998.701	17144.176	21209.25	18480.119	15632.473	22008.951	21386.615	20421.861	19831.16
0.5337	15568.304	16635.49	15024.923	13748.934	14193.692	15356.2	18362.33	16842.637	19875.418	23642.977	22088.191	19773.709	22377.156	19664.25	19306.24	18222.498	17013.297	23341.428	19235.283	21333.088	20492.986	16395.988	18886.096	18068.473	19513.42	24244.777	20673.248	14915.481	14302.302	15569.852	22867.85	16180.265	19621.846	22673.82	21506.74	20063.252	16151.513	18221.139	18563.336	12336.129	19698.043	18420.162	19526.555	16936.945	21670.027	16800.377	18698.707	16039.894	19271.027	16304.473	16467.025	19494.676	18976.848	22735.211	18605.184	15940.995	23203.277	27336.988	14431.075	23673.85	19957.221	17902.203	17698.551	16987.801	20187.945	16314.082	19641.555	18968.66	20343.432	18511.061	17819.791	24680.934	19694.91	23646.643	19036.496	22137.906	17902.35	18478.863	23716.365	22303.545	19146.045	22748.299	21050.238	20662.012	19544.547
0.6671	15758.182	15457.646	14846.101	14168.488	13917.642	15096.474	18376.482	16080.946	17317.518	21885.992	19323.656	22745.934	23778.908	19374.613	18439.748	16726.396	14527.75	20472.666	23959.879	18848.02	18860.42	17714.738	17716.758	19022.18	18568.352	21980.479	20893.557	16308.37	14137.934	13746.28	24941.699	14330.69	19219.24	23139.719	19394.141	20807.818	15349.888	19486.15	18414.846	12288.395	17829.508	16426.449	19905.867	15783.336	20802.686	15460.312	17168.994	14263.853	19521.756	14584.338	15261.256	17897.146	19273.125	21220.902	23524	14971.113	26438.926	23847.752	16507.777	22199.967	17954.084	18067.039	16974.961	16975.078	23117.738	16167.544	16794.648	17227.416	20316.082	17563.176	16021.735	21742.256	21691.328	18785.721	18414.85	25060.016	19134.602	15807.832	20430.807	24968.006	18931.436	20117.648	18448.996	19769.617	18381.529
0.8005	15623.302	13506.238	13037.544	13158.273	13673.875	14030.167	18013.15	14811.207	16752.648	19400.293	18439.473	23156.43	19579.051	17659.654	14545.932	15346.639	14849.979	16906.566	21639.225	19414.461	18083.766	18139.957	16390.191	17627.686	15300.409	19244.301	19833.895	15808.871	13749.403	14082.744	22239.52	13637.357	17086.943	19598.684	17801.453	17907.199	15304.664	17439.619	17725.029	11753.486	16265.181	15269.088	17169.068	15741.62	19777.4	13984.564	16011.834	13273.878	17715.203	13285.617	15429.777	16307.01	17899.088	18508.23	23140.186	14301.593	25153.732	20570.791	16856.252	19377.801	17105.631	16453.721	16367.869	15869.242	22288.699	16615.727	14669.654	16228.441	18674.404	15918.236	15737.96	19029.871	20227.043	14845.024	16530.002	23424.189	16341.417	13525.142	17302.422	23410.658	17327.482	17644.035	16169.063	17771.293	17864.773
0.934	14840.433	13067.371	12118.758	11815.9	13555.29	13452.085	19965.857	14749.648	17203.203	18243.355	17082.273	21605.709	17664.428	15266.034	12899.884	14992.558	14425.264	16003.5	18642.402	18282.793	15852.637	16160.829	15131.917	16474.213	13547.978	17505.801	18545.99	14478.642	13656.547	14211.135	20256.604	13844.592	16221.101	16562.863	18221.502	16514.355	14829.529	16343.397	15781.477	11942.892	14416.905	15451.046	17359.871	15352.945	17831.543	13930.494	15697.256	13331.537	17659.354	12510.392	14514.258	15308.144	18139.246	18240.941	20450.016	13620.381	22729.223	17979.119	16072.482	18435.268	15848.448	13948.705	15629.338	15012.316	21742.07	16859.668	14609.546	15771.233	16423.516	15587.689	16439.049	18002.711	16566.629	13544.712	15196.101	20864.895	14907.472	13119.22	16002.6	20489.533	15482.951	16903.773	16054.739	17693.277	16460.055
1.0674	14084.25	12958.509	11621.977	13137.072	14081.161	13759.72	19706.697	14071.279	18912.844	16936.318	16036.319	19172.4	16793.496	15278.303	13080.942	15476.424	12928.547	15765.441	17210.406	17984.373	14450.186	15574.994	14277.229	14938.503	12845.019	16535.186	18308.633	14174.966	13446.181	12559.68	17739.152	12942.324	16423.352	15745.403	17717.582	16980.568	13315.501	16497.588	14414.496	12316.875	14311.876	17857.248	19178.408	15792.104	16653.842	13623.734	15878.182	13227.666	17969.346	12399.821	13146.458	14324.554	17825.785	15893.717	19681.152	13391.655	23861.383	18082.758	16525.369	16923.379	15810.05	13437.769	15159.155	14624.964	19681.816	16762.65	12962.003	15260.172	16588.139	14962.604	16349.172	17695.572	15129.659	12762.378	15329.828	19299.145	14740.381	13625.887	15770.429	17837.316	15140.768	18223.148	17431.002	18346.164	14371.081
1.2008	13538.353	12337.141	11879.092	12610.933	13639.706	15288.716	19583.434	14128.748	18734.273	17773.637	15691.403	18888.424	16834.57	15221.017	12502.05	15311.154	13998.7	13372.419	16315.741	16846.301	14240.975	15792.962	14101.707	13964.184	13408.287	15860.313	18141.504	13788.665	13451.207	12329.544	14992.653	13468.745	17696.93	15762.923	17212.252	17871.35	13265.627	17624.992	13126.072	11630.804	14977.086	21521.018	18122.57	15770.089	16449.121	13887.133	16245.562	14249.792	18727.34	12495.392	14104.837	14706.566	16904.436	15750.447	17996.08	13004.331	25117.547	18582.699	14784.572	16017.379	16154.543	13006.955	15054.186	13840.194	18053.592	15950.93	13748.482	13620	17850.225	15600.575	17459.322	16958.246	14558.423	13301.384	14145.971	20155.277	15106.295	14588.532	16159.155	19018.561	15009.26	19630.629	16189.419	19793.451	15112.455
1.3342	13796.258	12498.479	11975.888	12080.109	14245.407	14196.542	18338.115	13595.312	18224.768	16796.283	17923.336	17331.326	16231.869	15574.201	13565.174	15904.654	14724.526	13845.083	16408.014	15343.759	13331.536	14844.889	13730.145	13328.027	13926.618	15904.409	17513.312	14245.507	14275.404	12660.143	14670.126	14392.577	17843.486	16017.539	15564.207	18015.799	12784.97	15199.025	13225.404	11410.591	15684.648	20772.684	15537.053	16437.164	15496.107	13637.367	15730.047	13725.386	18872.723	12895.146	13419.175	13142.809	15234.059	16990.639	18320.434	13838.55	24074.176	17366.75	15751.666	15629.403	13941.255	13608.807	15358.561	14775.571	17119.402	15737.352	13277.661	13816.64	21100.793	15106.254	15960.941	15467.049	14695.476	13582.748	16982.602	20279.721	14399.227	14428.856	15544.385	20392.799	16191.883	20819.715	15793.194	18239.332	16735.967
1.4676	14523.671	12724.613	11969.054	12115.167	13455.878	13564.197	18293.422	14239.491	17744.168	15029.989	19083.41	15986.584	16113.337	14433.621	14121.457	16685.406	15370.951	13252.09	16700.068	14702.844	13591.091	14675.979	13428.542	12759.713	14831.017	15527.398	15510.739	14967.536	12542.732	11832.554	14031.683	17390.057	17186.123	16337.993	15181.514	17048.738	11994.706	13335.454	13158.646	11629.454	16260.854	17937.012	14521.816	18664.58	14405.64	13157.992	16796.311	14286.705	17096.262	13351.602	13891.396	12758.33	14879.375	19567.697	17556.08	13638.038	22094.26	16452.141	15187.045	16907.426	13563.736	14136.087	15798.209	14789.864	16702.121	15168.823	13910.65	13075.676	23618.189	14275.193	15962.642	15560.726	14641.416	14265.144	18709.438	19480.23	13184.102	12796.851	15141.879	20461.578	17902.379	19569.227	16469.082	17330.34	17139.887
1.6011	15945.152	13166.472	12016.177	12035.646	12785.349	14172.702	18010.92	15675.363	15753.236	14236.352	17899.021	15422.852	15545.476	13500.589	13267.048	17370.285	16628.756	12944.868	16235.691	14630.498	13363.735	14510.666	13665.612	12704.441	16315.241	14682.749	14448.603	14512.649	11917.863	12489.329	13819.357	17103.855	16401.354	15630.34	14538.117	16538.531	11555.398	13453.188	12687.183	11598.678	17320.373	16920.145	13880.162	16856.055	13978.238	12814.318	20587.873	14924.104	15811.81	13128.072	15088.147	13299.885	13665.095	21278.119	17803.309	14397.014	22312.096	15768.954	13979.373	16210.807	14373.861	15526.132	16505.684	15106.674	17588.467	14641.208	15063.697	13048.167	21469.465	14152.327	15083.213	13777.624	14490.535	14448.191	18219.027	17415.584	12244.122	12715.482	14822.248	18709.807	19316.029	19941.395	15219.107	16403.316	16708.139
1.7345	15790.817	15536.5	11410.44	12394.718	12406.369	13119.796	17517.801	15677.015	14214.021	13575.127	16215.352	14056.479	16413.242	13210.076	13076.543	16852.951	15560.406	12205.902	17168.889	15562.732	13652.943	14398.492	14183.54	13159.858	16610.93	13392.408	13237.738	14539.295	11326.121	13296.993	13741.139	15622.454	15504.501	14683.885	13371.239	15999.703	11416.052	12575.212	12539.391	11329.381	16198.007	15616.332	14620.643	15441.825	12485.516	12769.135	25724.389	14712.1	14795.497	12850.536	15823.684	14313.499	13147.331	22297.576	16410.992	14958.213	21356.387	15348.442	14052.297	15206.124	13592.466	16246.955	16071.048	14161.446	17306.928	15156.386	16786.516	11606.995	18024.691	14803.271	14551.792	14773.453	15490.232	13743.779	16094.254	17172.654	12638.044	12531.41	12671.126	17007.062	18518.115	19882.443	15547.314	15809.505	15036.545
1.8679	15889.231	15392.784	11420.33	11999.925	13037.146	12051.381	18069.912	13599.214	13927.407	13228.958	15736.454	14414.186	18014.004	12422.385	12432.457	17122.266	14856.77	12577.059	16920.854	17113.543	13303.772	14926.191	14217.111	13552.941	15489.432	13441.409	13552.051	13849.56	11053.349	12554.962	14370.502	13563.756	14780.232	14425.822	13082.262	14295.607	11956.543	12500.671	11862.601	11119.887	15642.138	13240.671	14414.371	13923.132	12282.011	12593.935	27231.189	14121.521	14680.538	13049.989	16084.506	14267.882	13091.392	24239.289	18640.775	15356.261	19297.164	13622.298	13881.026	13545.433	12768.687	14915.292	16286.076	14566.669	15274.268	16565.68	18700.924	11727.929	15727.849	13959.682	14078.203	13996.248	16112.319	14789.082	13430.462	18388.863	12229.601	14704.541	12186.348	17708.934	17138.264	20449.195	14776.285	15749.907	13855.47
2.0013	15420.688	14299.558	11245.796	12727.529	11974.195	11552.324	16121.426	13508.976	13144.924	12829.187	14325.946	14537.146	18038.959	13201.609	12207.218	17049.572	13591.008	11899.914	14671.167	16811.924	12883.241	14552.402	13767.343	14379.404	12992.646	12965.822	13269.066	13617.777	11356.838	12472.654	14709.715	12775.594	13800.185	14269.647	11828.407	13785.065	11793.521	12929.355	11644.43	10587.073	14522.203	13348.791	13803.948	13346.619	12406.917	12714.336	24920.176	13626.989	13893.711	12203.798	16715.371	14149.134	12369.184	23634.203	16464.836	15890.304	17673.729	13596.098	13853.665	12269.354	12214.221	13959.514	14381.557	14429.514	13982.366	17452.01	16100.897	11495.823	14000.024	13503.314	12786.702	14793.27	15736.031	14077.382	12343.395	18055.693	11340.584	14715.419	12240.094	17708.762	15376.862	19544.32	13540.143	15021.081	13978.526
2.1348	15315.379	12768.978	10801.56	11873.976	NaN	12097.372	14511.884	13032.198	12967.162	12849.434	13998.464	13755.969	16429.52	12690.196	12378.988	16752.25	12888.104	11738.849	13625.726	16579.436	13111.949	14619.581	12489.045	14474.598	12510.444	11997.369	12849.252	13697.751	11638.964	NaN	13907.451	NaN	12665.174	13717.794	12356.184	13657.136	12005.3	12423.05	11447.886	11116.705	14809.736	13282.068	13527.426	13646.48	12276.772	NaN	20442.195	14017.257	13469.546	11985.669	15553.498	13576.812	12325.378	19793.463	14255.521	14335.006	16702.951	14032.993	14480.215	12215.072	11970.945	13380.207	13162.257	13586.08	13369.372	17910.232	14184.271	NaN	13480.284	12885.853	12505.941	14749.993	14108.576	13565.963	12255.996	18187.217	11202.527	13977.217	12759.461	14387.21	13744.033	16787.463	13352.376	13664.781	NaN
2.2682	14692.743	12529.108	11193.718	12050.344	NaN	12122.802	14417.016	NaN	13222.782	12868.265	13058.484	12818.586	14769.959	NaN	12312.02	15179.465	12622.216	NaN	12807.367	15979.207	13198.136	14850.541	12272.924	13269.717	12451.381	11830.375	13196.067	13591.728	11695.926	NaN	12613.363	NaN	12678.77	12273.513	12116.414	12295.048	12012.13	12582.928	11779.406	11740.841	13628.299	12841.933	13822.352	13131.604	12766.787	NaN	16290.797	12667.829	12675.047	12114.223	16149.267	13157.776	12236.319	16427.691	12636.474	13474.815	14857.824	NaN	15924.325	11747.779	11911.766	13463.785	12312.496	13396.323	12581.789	17331.439	14755.498	NaN	12839.63	12675.852	12401.753	12918.679	14247.488	13382.521	12049.619	16250.91	11722.25	12939.065	12853.736	13267.278	13742.638	15630.552	12963.252	13527.653	NaN
2.4016	14193.538	12418.67	10700.778	12828.164	NaN	11745.077	NaN	NaN	NaN	12376.839	13030.197	12162.914	13168.572	NaN	11894.35	NaN	12688.476	NaN	NaN	13908.233	12758.212	13351.853	12198.476	11927.477	NaN	NaN	12854.15	13951.479	NaN	NaN	12710.183	NaN	NaN	12260.869	12811.622	11076.637	12317.552	12593.077	11626.948	11185.562	14717.545	12899.208	13216.739	13117.359	12656.799	NaN	14076.993	NaN	13200.217	12491.722	15371.037	11905.603	11802.478	14422.009	12639.408	12871.348	14525.446	NaN	16108.755	12164.102	11783.522	13364.616	NaN	13211.287	12377.083	16041.389	13346.252	NaN	NaN	NaN	11759.284	12306.967	13760.68	NaN	NaN	14163.806	11892.688	12434.535	NaN	13007.794	12621.946	14297.725	13097.647	13258.341	NaN
2.535	13167.548	11829.913	NaN	12456.125	NaN	NaN	NaN	NaN	NaN	NaN	NaN	11853.81	13419.726	NaN	NaN	NaN	NaN	NaN	NaN	12752.661	12967.279	13284.443	NaN	11387.897	NaN	NaN	NaN	14700.25	NaN	NaN	12689.629	NaN	NaN	12488.944	NaN	10870.611	NaN	NaN	NaN	NaN	NaN	13311.192	12929.617	NaN	NaN	NaN	13308.167	NaN	13619.94	12766.854	NaN	12404.262	12034.369	13500.15	12562.868	13110.337	14223.541	NaN	15544.112	NaN	11946.431	NaN	NaN	NaN	12522.747	14593.916	13209.594	NaN	NaN	NaN	11536.835	NaN	13446.552	NaN	NaN	12250.248	12453.302	NaN	NaN	12985.101	11996.09	14563.328	12962.717	NaN	NaN
2.6684	12622.581	11238.883	NaN	12045.052	NaN	NaN	NaN	NaN	NaN	NaN	NaN	12480.298	12596.208	NaN	NaN	NaN	NaN	NaN	NaN	11933.753	NaN	12402.021	NaN	11965.617	NaN	NaN	NaN	14536.455	NaN	NaN	12986.461	NaN	NaN	12876.486	NaN	NaN	NaN	NaN	NaN	NaN	NaN	NaN	NaN	NaN	NaN	NaN	12517.041	NaN	13910.168	NaN	NaN	NaN	12061.55	NaN	12463.428	NaN	NaN	NaN	16405.277	NaN	NaN	NaN	NaN	NaN	12481.472	15203.763	13926.159	NaN	NaN	NaN	NaN	NaN	NaN	NaN	NaN	12739.602	11713.916	NaN	NaN	12323.346	12383.814	13973.602	12319.336	NaN	NaN
2.8019	12492.719	NaN	NaN	NaN	NaN	NaN	NaN	NaN	NaN	NaN	NaN	12030.484	12771.317	NaN	NaN	NaN	NaN	NaN	NaN	NaN	NaN	NaN	NaN	12257.719	NaN	NaN	NaN	NaN	NaN	NaN	12552.316	NaN	NaN	13121.82	NaN	NaN	NaN	NaN	NaN	NaN	NaN	NaN	NaN	NaN	NaN	NaN	NaN	NaN	NaN	NaN	NaN	NaN	11730.195	NaN	NaN	NaN	NaN	NaN	NaN	NaN	NaN	NaN	NaN	NaN	NaN	15159.035	NaN	NaN	NaN	NaN	NaN	NaN	NaN	NaN	NaN	NaN	NaN	NaN	NaN	12784.329	NaN	NaN	NaN	NaN	NaN
2.9353	NaN	NaN	NaN	NaN	NaN	NaN	NaN	NaN	NaN	NaN	NaN	12294.434	NaN	NaN	NaN	NaN	NaN	NaN	NaN	NaN	NaN	NaN	NaN	NaN	NaN	NaN	NaN	NaN	NaN	NaN	NaN	NaN	NaN	NaN	NaN	NaN	NaN	NaN	NaN	NaN	NaN	NaN	NaN	NaN	NaN	NaN	NaN	NaN	NaN	NaN	NaN	NaN	11302.519	NaN	NaN	NaN	NaN	NaN	NaN	NaN	NaN	NaN	NaN	NaN	NaN	14102.249	NaN	NaN	NaN	NaN	NaN	NaN	NaN	NaN	NaN	NaN	NaN	NaN	NaN	NaN	NaN	NaN	NaN	NaN	NaN
3.0687	NaN	NaN	NaN	NaN	NaN	NaN	NaN	NaN	NaN	NaN	NaN	11752.274	NaN	NaN	NaN	NaN	NaN	NaN	NaN	NaN	NaN	NaN	NaN	NaN	NaN	NaN	NaN	NaN	NaN	NaN	NaN	NaN	NaN	NaN	NaN	NaN	NaN	NaN	NaN	NaN	NaN	NaN	NaN	NaN	NaN	NaN	NaN	NaN	NaN	NaN	NaN	NaN	NaN	NaN	NaN	NaN	NaN	NaN	NaN	NaN	NaN	NaN	NaN	NaN	NaN	14870.76	NaN	NaN	NaN	NaN	NaN	NaN	NaN	NaN	NaN	NaN	NaN	NaN	NaN	NaN	NaN	NaN	NaN	NaN	NaN
3.2021	NaN	NaN	NaN	NaN	NaN	NaN	NaN	NaN	NaN	NaN	NaN	NaN	NaN	NaN	NaN	NaN	NaN	NaN	NaN	NaN	NaN	NaN	NaN	NaN	NaN	NaN	NaN	NaN	NaN	NaN	NaN	NaN	NaN	NaN	NaN	NaN	NaN	NaN	NaN	NaN	NaN	NaN	NaN	NaN	NaN	NaN	NaN	NaN	NaN	NaN	NaN	NaN	NaN	NaN	NaN	NaN	NaN	NaN	NaN	NaN	NaN	NaN	NaN	NaN	NaN	NaN	NaN	NaN	NaN	NaN	NaN	NaN	NaN	NaN	NaN	NaN	NaN	NaN	NaN	NaN	NaN	NaN	NaN	NaN	NaN
3.3356	NaN	NaN	NaN	NaN	NaN	NaN	NaN	NaN	NaN	NaN	NaN	NaN	NaN	NaN	NaN	NaN	NaN	NaN	NaN	NaN	NaN	NaN	NaN	NaN	NaN	NaN	NaN	NaN	NaN	NaN	NaN	NaN	NaN	NaN	NaN	NaN	NaN	NaN	NaN	NaN	NaN	NaN	NaN	NaN	NaN	NaN	NaN	NaN	NaN	NaN	NaN	NaN	NaN	NaN	NaN	NaN	NaN	NaN	NaN	NaN	NaN	NaN	NaN	NaN	NaN	NaN	NaN	NaN	NaN	NaN	NaN	NaN	NaN	NaN	NaN	NaN	NaN	NaN	NaN	NaN	NaN	NaN	NaN	NaN	NaN
3.469	NaN	NaN	NaN	NaN	NaN	NaN	NaN	NaN	NaN	NaN	NaN	NaN	NaN	NaN	NaN	NaN	NaN	NaN	NaN	NaN	NaN	NaN	NaN	NaN	NaN	NaN	NaN	NaN	NaN	NaN	NaN	NaN	NaN	NaN	NaN	NaN	NaN	NaN	NaN	NaN	NaN	NaN	NaN	NaN	NaN	NaN	NaN	NaN	NaN	NaN	NaN	NaN	NaN	NaN	NaN	NaN	NaN	NaN	NaN	NaN	NaN	NaN	NaN	NaN	NaN	NaN	NaN	NaN	NaN	NaN	NaN	NaN	NaN	NaN	NaN	NaN	NaN	NaN	NaN	NaN	NaN	NaN	NaN	NaN	NaN
3.6024	NaN	NaN	NaN	NaN	NaN	NaN	NaN	NaN	NaN	NaN	NaN	NaN	NaN	NaN	NaN	NaN	NaN	NaN	NaN	NaN	NaN	NaN	NaN	NaN	NaN	NaN	NaN	NaN	NaN	NaN	NaN	NaN	NaN	NaN	NaN	NaN	NaN	NaN	NaN	NaN	NaN	NaN	NaN	NaN	NaN	NaN	NaN	NaN	NaN	NaN	NaN	NaN	NaN	NaN	NaN	NaN	NaN	NaN	NaN	NaN	NaN	NaN	NaN	NaN	NaN	NaN	NaN	NaN	NaN	NaN	NaN	NaN	NaN	NaN	NaN	NaN	NaN	NaN	NaN	NaN	NaN	NaN	NaN	NaN	NaN
3.7358	NaN	NaN	NaN	NaN	NaN	NaN	NaN	NaN	NaN	NaN	NaN	NaN	NaN	NaN	NaN	NaN	NaN	NaN	NaN	NaN	NaN	NaN	NaN	NaN	NaN	NaN	NaN	NaN	NaN	NaN	NaN	NaN	NaN	NaN	NaN	NaN	NaN	NaN	NaN	NaN	NaN	NaN	NaN	NaN	NaN	NaN	NaN	NaN	NaN	NaN	NaN	NaN	NaN	NaN	NaN	NaN	NaN	NaN	NaN	NaN	NaN	NaN	NaN	NaN	NaN	NaN	NaN	NaN	NaN	NaN	NaN	NaN	NaN	NaN	NaN	NaN	NaN	NaN	NaN	NaN	NaN	NaN	NaN	NaN	NaN
3.8692	NaN	NaN	NaN	NaN	NaN	NaN	NaN	NaN	NaN	NaN	NaN	NaN	NaN	NaN	NaN	NaN	NaN	NaN	NaN	NaN	NaN	NaN	NaN	NaN	NaN	NaN	NaN	NaN	NaN	NaN	NaN	NaN	NaN	NaN	NaN	NaN	NaN	NaN	NaN	NaN	NaN	NaN	NaN	NaN	NaN	NaN	NaN	NaN	NaN	NaN	NaN	NaN	NaN	NaN	NaN	NaN	NaN	NaN	NaN	NaN	NaN	NaN	NaN	NaN	NaN	NaN	NaN	NaN	NaN	NaN	NaN	NaN	NaN	NaN	NaN	NaN	NaN	NaN	NaN	NaN	NaN	NaN	NaN	NaN	NaN
4.0027	NaN	NaN	NaN	NaN	NaN	NaN	NaN	NaN	NaN	NaN	NaN	NaN	NaN	NaN	NaN	NaN	NaN	NaN	NaN	NaN	NaN	NaN	NaN	NaN	NaN	NaN	NaN	NaN	NaN	NaN	NaN	NaN	NaN	NaN	NaN	NaN	NaN	NaN	NaN	NaN	NaN	NaN	NaN	NaN	NaN	NaN	NaN	NaN	NaN	NaN	NaN	NaN	NaN	NaN	NaN	NaN	NaN	NaN	NaN	NaN	NaN	NaN	NaN	NaN	NaN	NaN	NaN	NaN	NaN	NaN	NaN	NaN	NaN	NaN	NaN	NaN	NaN	NaN	NaN	NaN	NaN	NaN	NaN	NaN	NaN
4.1361	NaN	NaN	NaN	NaN	NaN	NaN	NaN	NaN	NaN	NaN	NaN	NaN	NaN	NaN	NaN	NaN	NaN	NaN	NaN	NaN	NaN	NaN	NaN	NaN	NaN	NaN	NaN	NaN	NaN	NaN	NaN	NaN	NaN	NaN	NaN	NaN	NaN	NaN	NaN	NaN	NaN	NaN	NaN	NaN	NaN	NaN	NaN	NaN	NaN	NaN	NaN	NaN	NaN	NaN	NaN	NaN	NaN	NaN	NaN	NaN	NaN	NaN	NaN	NaN	NaN	NaN	NaN	NaN	NaN	NaN	NaN	NaN	NaN	NaN	NaN	NaN	NaN	NaN	NaN	NaN	NaN	NaN	NaN	NaN	NaN
4.2695	NaN	NaN	NaN	NaN	NaN	NaN	NaN	NaN	NaN	NaN	NaN	NaN	NaN	NaN	NaN	NaN	NaN	NaN	NaN	NaN	NaN	NaN	NaN	NaN	NaN	NaN	NaN	NaN	NaN	NaN	NaN	NaN	NaN	NaN	NaN	NaN	NaN	NaN	NaN	NaN	NaN	NaN	NaN	NaN	NaN	NaN	NaN	NaN	NaN	NaN	NaN	NaN	NaN	NaN	NaN	NaN	NaN	NaN	NaN	NaN	NaN	NaN	NaN	NaN	NaN	NaN	NaN	NaN	NaN	NaN	NaN	NaN	NaN	NaN	NaN	NaN	NaN	NaN	NaN	NaN	NaN	NaN	NaN	NaN	NaN
4.4029	NaN	NaN	NaN	NaN	NaN	NaN	NaN	NaN	NaN	NaN	NaN	NaN	NaN	NaN	NaN	NaN	NaN	NaN	NaN	NaN	NaN	NaN	NaN	NaN	NaN	NaN	NaN	NaN	NaN	NaN	NaN	NaN	NaN	NaN	NaN	NaN	NaN	NaN	NaN	NaN	NaN	NaN	NaN	NaN	NaN	NaN	NaN	NaN	NaN	NaN	NaN	NaN	NaN	NaN	NaN	NaN	NaN	NaN	NaN	NaN	NaN	NaN	NaN	NaN	NaN	NaN	NaN	NaN	NaN	NaN	NaN	NaN	NaN	NaN	NaN	NaN	NaN	NaN	NaN	NaN	NaN	NaN	NaN	NaN	NaN
4.5363	NaN	NaN	NaN	NaN	NaN	NaN	NaN	NaN	NaN	NaN	NaN	NaN	NaN	NaN	NaN	NaN	NaN	NaN	NaN	NaN	NaN	NaN	NaN	NaN	NaN	NaN	NaN	NaN	NaN	NaN	NaN	NaN	NaN	NaN	NaN	NaN	NaN	NaN	NaN	NaN	NaN	NaN	NaN	NaN	NaN	NaN	NaN	NaN	NaN	NaN	NaN	NaN	NaN	NaN	NaN	NaN	NaN	NaN	NaN	NaN	NaN	NaN	NaN	NaN	NaN	NaN	NaN	NaN	NaN	NaN	NaN	NaN	NaN	NaN	NaN	NaN	NaN	NaN	NaN	NaN	NaN	NaN	NaN	NaN	NaN
4.6698	NaN	NaN	NaN	NaN	NaN	NaN	NaN	NaN	NaN	NaN	NaN	NaN	NaN	NaN	NaN	NaN	NaN	NaN	NaN	NaN	NaN	NaN	NaN	NaN	NaN	NaN	NaN	NaN	NaN	NaN	NaN	NaN	NaN	NaN	NaN	NaN	NaN	NaN	NaN	NaN	NaN	NaN	NaN	NaN	NaN	NaN	NaN	NaN	NaN	NaN	NaN	NaN	NaN	NaN	NaN	NaN	NaN	NaN	NaN	NaN	NaN	NaN	NaN	NaN	NaN	NaN	NaN	NaN	NaN	NaN	NaN	NaN	NaN	NaN	NaN	NaN	NaN	NaN	NaN	NaN	NaN	NaN	NaN	NaN	NaN
4.8032	NaN	NaN	NaN	NaN	NaN	NaN	NaN	NaN	NaN	NaN	NaN	NaN	NaN	NaN	NaN	NaN	NaN	NaN	NaN	NaN	NaN	NaN	NaN	NaN	NaN	NaN	NaN	NaN	NaN	NaN	NaN	NaN	NaN	NaN	NaN	NaN	NaN	NaN	NaN	NaN	NaN	NaN	NaN	NaN	NaN	NaN	NaN	NaN	NaN	NaN	NaN	NaN	NaN	NaN	NaN	NaN	NaN	NaN	NaN	NaN	NaN	NaN	NaN	NaN	NaN	NaN	NaN	NaN	NaN	NaN	NaN	NaN	NaN	NaN	NaN	NaN	NaN	NaN	NaN	NaN	NaN	NaN	NaN	NaN	NaN
4.9366	NaN	NaN	NaN	NaN	NaN	NaN	NaN	NaN	NaN	NaN	NaN	NaN	NaN	NaN	NaN	NaN	NaN	NaN	NaN	NaN	NaN	NaN	NaN	NaN	NaN	NaN	NaN	NaN	NaN	NaN	NaN	NaN	NaN	NaN	NaN	NaN	NaN	NaN	NaN	NaN	NaN	NaN	NaN	NaN	NaN	NaN	NaN	NaN	NaN	NaN	NaN	NaN	NaN	NaN	NaN	NaN	NaN	NaN	NaN	NaN	NaN	NaN	NaN	NaN	NaN	NaN	NaN	NaN	NaN	NaN	NaN	NaN	NaN	NaN	NaN	NaN	NaN	NaN	NaN	NaN	NaN	NaN	NaN	NaN	NaN
5.07	NaN	NaN	NaN	NaN	NaN	NaN	NaN	NaN	NaN	NaN	NaN	NaN	NaN	NaN	NaN	NaN	NaN	NaN	NaN	NaN	NaN	NaN	NaN	NaN	NaN	NaN	NaN	NaN	NaN	NaN	NaN	NaN	NaN	NaN	NaN	NaN	NaN	NaN	NaN	NaN	NaN	NaN	NaN	NaN	NaN	NaN	NaN	NaN	NaN	NaN	NaN	NaN	NaN	NaN	NaN	NaN	NaN	NaN	NaN	NaN	NaN	NaN	NaN	NaN	NaN	NaN	NaN	NaN	NaN	NaN	NaN	NaN	NaN	NaN	NaN	NaN	NaN	NaN	NaN	NaN	NaN	NaN	NaN	NaN	NaN
5.2035	NaN	NaN	NaN	NaN	NaN	NaN	NaN	NaN	NaN	NaN	NaN	NaN	NaN	NaN	NaN	NaN	NaN	NaN	NaN	NaN	NaN	NaN	NaN	NaN	NaN	NaN	NaN	NaN	NaN	NaN	NaN	NaN	NaN	NaN	NaN	NaN	NaN	NaN	NaN	NaN	NaN	NaN	NaN	NaN	NaN	NaN	NaN	NaN	NaN	NaN	NaN	NaN	NaN	NaN	NaN	NaN	NaN	NaN	NaN	NaN	NaN	NaN	NaN	NaN	NaN	NaN	NaN	NaN	NaN	NaN	NaN	NaN	NaN	NaN	NaN	NaN	NaN	NaN	NaN	NaN	NaN	NaN	NaN	NaN	NaN
5.3369	NaN	NaN	NaN	NaN	NaN	NaN	NaN	NaN	NaN	NaN	NaN	NaN	NaN	NaN	NaN	NaN	NaN	NaN	NaN	NaN	NaN	NaN	NaN	NaN	NaN	NaN	NaN	NaN	NaN	NaN	NaN	NaN	NaN	NaN	NaN	NaN	NaN	NaN	NaN	NaN	NaN	NaN	NaN	NaN	NaN	NaN	NaN	NaN	NaN	NaN	NaN	NaN	NaN	NaN	NaN	NaN	NaN	NaN	NaN	NaN	NaN	NaN	NaN	NaN	NaN	NaN	NaN	NaN	NaN	NaN	NaN	NaN	NaN	NaN	NaN	NaN	NaN	NaN	NaN	NaN	NaN	NaN	NaN	NaN	NaN
