x
0
0.1334
0.2668
0.4003
0.5337
0.6671
0.8005
0.934
1.0674
1.2008
1.3342
1.4676
1.6011
1.7345
1.8679
2.0013
2.1348
2.2682
2.4016
2.535
2.6684
2.8019
2.9353
3.0687
3.2021
3.3356
3.469
3.6024
3.7358
3.8692
4.0027
4.1361
4.2695
4.4029
4.5363
4.6698
4.8032
4.9366
5.07
5.2035
5.3369
5.4703
