x	Y_20180130_15109_12_8g	Y_20180130_15109_13_1g	Y_20180130_15109_17_12g_left	Y_20180130_15109_21_10g	Y_20180130_15109_21_11g	Y_20180130_15109_23_3g	Y_20180130_15109_34_5g	Y_20180130_15109_7_6g_left	Y_20180130_15109_43_5g	Y_20180130_15109_1_2g_right	Y_20180130_15109_5_8g	Y_20180130_15109_6_11g	Y_20180130_15109_6_16g	Y_20180130_15109_6_2g_right	Y_20180130_15109_7_6g_right	Y_20180130_15109_15_2g_right	Y_20180130_15109_16_3g_right
0	11252.858	10632.522	9979.865	13048.138	11587.783	13652.592	10502.243	11480.717	12382.876	11228.579	10185.023	11738.807	14440	11991.277	13152.8	13673.386	11812.108
0.1334	13131.575	11629.691	11024.97	14681.043	11607.165	13579.206	11114.052	12227.187	12559.526	12670.24	10703.581	12964.855	14555.594	13378.298	12239.167	14307.892	11785.321
0.2668	15839.571	12215.244	11342.675	16398.836	13339.032	14322.824	12009.907	13520.57	13440.949	14087.743	12110.672	15219.626	15347.843	13737.487	14528.172	17177.234	13398.122
0.4003	20071.555	13682.604	13300.797	18488.041	16307.235	16240.196	14691.706	16682.717	16401.596	17712.572	15034.568	18126.365	18075.152	16674.307	16635.641	21276.252	15131.088
0.5337	20594.738	16262.247	18113.873	19290.396	18562.832	17123.6	15460.591	21220.664	20529.793	19722.688	17382.871	18604.836	22378.854	19397.15	22568.045	25793.377	16926.475
0.6671	18123.338	19765.74	24231.059	17592.455	18471.127	16503.613	15719.195	22508.736	23283.373	18744.383	19632.344	17265.395	24254.262	20882.527	22396.816	26542.662	16975.57
0.8005	17628.373	24901.582	23592.197	16156.27	17270.113	16387.209	15729.652	20472.133	22949.486	19762.814	19723.947	16795.268	21766.332	19841.629	18036.102	23116.779	16787.453
0.934	17363.193	27248.156	21695.975	15478.162	16397.283	15674.024	16605.389	20599.277	20624.1	18880.547	18701.271	17526.688	20969.918	17897.93	16676.15	21186.461	16811.918
1.0674	17203.207	25763.854	20203.039	16445.676	15890.746	15416.318	15575.232	20542.197	19077.695	19183.055	18781.598	16295.613	20762.047	16214.777	15956.804	19865.797	17351.561
1.2008	17178.18	23565.078	19637.336	15931.912	15107.802	16001.685	15026.009	22238.184	19002.02	19397.502	19059.805	15355.263	19636.84	15783.105	15603.882	19231.758	16808.854
1.3342	17832.594	21377.832	18452.258	15779.343	14063.392	16519.244	14229.264	21417.219	18792.178	18532.641	19431.838	15170.058	18131.449	15731.589	14717.309	18145.504	15465.917
1.4676	18404.949	20666.533	17079.016	16305.046	14971.13	17298.859	14634.033	21052.732	20097.02	18215.303	18319.227	14073.37	19126.641	17456.07	14303.398	17732.234	14980.507
1.6011	17824.027	20042.471	16890.49	15142.328	15985.535	17078.232	15055.763	18807.631	19098.359	19071.73	17725.785	13633.86	22875.777	16378.239	13893.353	16011.754	15703.998
1.7345	16180.874	18576.479	16483.891	15217.712	16215.494	16930.842	15180.536	17598.111	18369.926	19849.529	14887.883	13845.184	20436.99	17770.865	14830.961	15031.179	14588.272
1.8679	16261.977	18397.93	16067.817	16281.702	16084.897	17188.545	14139.906	16386.078	18129.41	20329.955	14020.902	13741.791	19082.691	18594.354	14532.509	14549.713	14959.852
2.0013	16874.195	18995.127	15983.015	14465.812	16744.445	17602.193	13633.057	15356.939	17138.512	17174.576	14413.513	14849.926	17933.246	18294.207	14959.838	15039.954	14254.248
2.1348	17313.641	17593.328	16751.25	14079.409	15845.781	16286.646	12831.765	15720.891	16846.588	16784.639	13467.497	14774.56	17036.516	16721.613	15492.56	15416.573	14479.454
2.2682	17623.912	15707.259	17458.238	12267.791	15509.618	15804.839	13263.152	17461.104	16310.724	15043.123	13742.927	14958.157	17173.875	17133.16	17055.246	16050.553	16090.897
2.4016	16778.053	14390.784	19415.961	11880.384	15113.266	15413.174	13922.848	16569.096	15954.334	15032.794	13637.652	15302.218	15684.626	17488.273	17160.145	17646.055	15385.892
2.535	17197.119	14660.754	19491.707	12188.825	16094.895	14375.299	13829.155	15671.162	16311.497	13996.876	14058.575	14737.674	15757.166	18883.311	15459.547	18224.686	15589.786
2.6684	16423.375	14949.372	19043.428	12008.742	14251.544	14207.175	14343.088	15010.624	16144.109	14271.938	12918.946	14163.658	17402.08	17829.504	14135.881	18631.949	15700.675
2.8019	15138.565	15034.361	16722.975	11380.803	13679.267	14907.38	15714.438	14061.947	16097.427	13627.973	13006.155	13372.633	19545.477	17344.689	12819.906	17786.756	15097.251
2.9353	14173.302	15426.863	15127.374	11637.946	14074.387	13342.007	16587.793	13177.174	14654.227	12930.933	12970.013	13157.043	20812.148	14973.253	12440.434	16360.413	14097.547
3.0687	12705.992	15249.768	14234.163	11396.926	12771.43	12728.021	16558.988	12799.257	13930.017	12943.878	12627.976	13378.009	18889.883	14194.389	12186.638	14705.938	13450.047
3.2021	12052.896	14210.142	13439.749	11830.102	12868.179	13346.818	16586.961	12253.346	12962.909	12618.281	11713.113	13883.241	15115.024	14646.222	12667.902	13004.465	12189.099
3.3356	11499.724	12831.946	12476.553	NaN	12076.159	12540.52	15043.757	12509.374	12544.541	12688.175	11684.368	13752.345	14288.442	13118.575	12702.509	12708.232	12051.825
3.469	11421.128	12792.735	12489.79	NaN	12615.433	12558.079	14347.259	13077.57	12733.651	12681.941	11868.321	NaN	13634.714	NaN	NaN	12688.775	11403.108
3.6024	11521.761	12768.445	13655.773	NaN	NaN	NaN	14125.404	12827.98	12993.44	NaN	NaN	NaN	13609.274	NaN	NaN	NaN	11415.456
3.7358	11400.847	12525.04	12124.132	NaN	NaN	NaN	NaN	12359.509	NaN	NaN	NaN	NaN	13706.348	NaN	NaN	NaN	NaN
3.8692	NaN	12195.573	12507.741	NaN	NaN	NaN	NaN	NaN	NaN	NaN	NaN	NaN	NaN	NaN	NaN	NaN	NaN
4.0027	NaN	NaN	NaN	NaN	NaN	NaN	NaN	NaN	NaN	NaN	NaN	NaN	NaN	NaN	NaN	NaN	NaN
4.1361	NaN	NaN	NaN	NaN	NaN	NaN	NaN	NaN	NaN	NaN	NaN	NaN	NaN	NaN	NaN	NaN	NaN
4.2695	NaN	NaN	NaN	NaN	NaN	NaN	NaN	NaN	NaN	NaN	NaN	NaN	NaN	NaN	NaN	NaN	NaN
4.4029	NaN	NaN	NaN	NaN	NaN	NaN	NaN	NaN	NaN	NaN	NaN	NaN	NaN	NaN	NaN	NaN	NaN
4.5363	NaN	NaN	NaN	NaN	NaN	NaN	NaN	NaN	NaN	NaN	NaN	NaN	NaN	NaN	NaN	NaN	NaN
4.6698	NaN	NaN	NaN	NaN	NaN	NaN	NaN	NaN	NaN	NaN	NaN	NaN	NaN	NaN	NaN	NaN	NaN
4.8032	NaN	NaN	NaN	NaN	NaN	NaN	NaN	NaN	NaN	NaN	NaN	NaN	NaN	NaN	NaN	NaN	NaN
4.9366	NaN	NaN	NaN	NaN	NaN	NaN	NaN	NaN	NaN	NaN	NaN	NaN	NaN	NaN	NaN	NaN	NaN
5.07	NaN	NaN	NaN	NaN	NaN	NaN	NaN	NaN	NaN	NaN	NaN	NaN	NaN	NaN	NaN	NaN	NaN
5.2035	NaN	NaN	NaN	NaN	NaN	NaN	NaN	NaN	NaN	NaN	NaN	NaN	NaN	NaN	NaN	NaN	NaN
5.3369	NaN	NaN	NaN	NaN	NaN	NaN	NaN	NaN	NaN	NaN	NaN	NaN	NaN	NaN	NaN	NaN	NaN
5.4703	NaN	NaN	NaN	NaN	NaN	NaN	NaN	NaN	NaN	NaN	NaN	NaN	NaN	NaN	NaN	NaN	NaN
5.6037	NaN	NaN	NaN	NaN	NaN	NaN	NaN	NaN	NaN	NaN	NaN	NaN	NaN	NaN	NaN	NaN	NaN
5.7371	NaN	NaN	NaN	NaN	NaN	NaN	NaN	NaN	NaN	NaN	NaN	NaN	NaN	NaN	NaN	NaN	NaN
