0.00000,41223.934
0.13342,40199.566
0.26684,41275.148
0.40027,40830.469
0.53369,39917.051
0.66711,39003.379
0.80053,37967.566
0.93395,39961.008
1.06737,41715.445
1.20080,45727.664
1.33422,49248.375
1.46764,58132.039
1.60106,86594.883
1.73448,132973.000
1.86791,153129.312
2.00133,118850.773
2.13475,78551.672
2.26817,56432.625
2.40159,47309.379
