0.0000	32908.8828
0.1334	32324.2812
0.2668	33045.4688
0.4003	34112.4570
0.5337	33490.6523
0.6671	33302.6797
0.8005	33779.8477
0.9340	33409.7305
1.0674	33382.1758
1.2008	34244.6055
1.3342	36749.6211
1.4676	46538.5977
1.6011	64230.6250
1.7345	92570.7031
1.8679	103444.0703
2.0013	91642.1172
2.1347	74067.9844
2.2682	51430.8281
2.4016	41040.1875
2.5350	36305.4219
2.6684	33216.0156
2.8019	32550.3320
2.9353	33652.1953
