X,Y
0.00000,15799.996
0.13342,15943.706
0.26684,15775.161
0.40027,15755.438
0.53369,16342.718
0.66711,16356.959
0.80053,15722.119
0.93395,16059.096
1.06737,15987.677
1.20080,15658.951
1.33422,15714.847
1.46764,16163.647
1.60106,17035.719
1.73448,16803.920
1.86791,16576.711
2.00133,16758.137
2.13475,17260.461
2.26817,18174.156
2.40159,18396.963
2.53502,21668.180
2.66844,29967.906
2.80186,41788.008
2.93528,41915.738
3.06870,31130.584
3.20212,21750.543
3.33555,18305.316
3.46897,17045.707
