0.00000,14656.253
0.13342,15262.514
0.26684,18044.877
0.40027,19960.424
0.53369,23118.730
0.66711,22381.043
0.80053,22433.182
0.93395,20747.939
1.06737,19317.828
1.20080,21524.266
1.33422,21299.232
1.46764,21385.572
1.60106,18233.064
1.73448,16349.449
1.86791,14581.321
2.00133,14130.041
2.13475,13455.616
2.26817,13228.697
2.40159,12895.240
2.53502,13703.880
