0.00000,33746.102
0.13342,35475.074
0.26684,35683.422
0.40027,34208.723
0.53369,35577.465
0.66711,35455.586
0.80053,36221.777
0.93395,37053.066
1.06737,36144.809
1.20080,34962.270
1.33422,36995.633
1.46764,40782.043
1.60106,46829.168
1.73448,63079.691
1.86791,85229.992
2.00133,96306.547
2.13475,71070.875
2.26817,51113.586
2.40159,42813.391
2.53502,38469.484
