0.00000,32333.234
0.13342,32635.621
0.26684,33304.285
0.40027,31902.354
0.53369,31677.934
0.66711,32371.064
0.80053,33477.051
0.93395,32674.588
1.06737,31690.926
1.20080,31050.209
1.33422,32161.279
1.46764,33638.402
1.60106,34098.789
1.73448,37435.254
1.86791,49071.227
2.00133,72172.555
2.13475,89387.562
2.26817,76949.547
2.40159,54376.465
