X,Y
0.00000,12683.703
0.13342,13397.317
0.26684,15223.351
0.40027,16436.277
0.53369,16635.697
0.66711,15556.854
0.80053,15253.935
0.93395,14304.677
1.06737,13873.397
1.20080,13946.045
1.33422,14359.554
1.46764,13730.694
1.60106,13316.441
1.73448,13566.206
1.86791,13526.815
2.00133,12998.304
