X,Y
0.00000,12372.498
0.13342,13552.682
0.26684,15718.562
0.40027,17847.834
0.53369,17837.393
0.66711,17646.896
0.80053,16609.039
0.93395,16270.205
1.06737,15665.012
1.20080,15933.071
1.33422,15560.153
1.46764,14177.404
1.60106,15014.848
1.73448,14450.902
1.86791,14780.590
2.00133,14439.556
2.13475,12816.038
2.26817,10976.319
2.40159,11438.399
2.53502,11395.806
2.66844,10918.603
2.80186,10901.042
