0.00000,35651.379
0.13342,36609.434
0.26684,37321.305
0.40027,36010.434
0.53369,36322.953
0.66711,39258.941
0.80053,38768.309
0.93395,43056.699
1.06737,59312.918
1.20080,87923.539
1.33422,110614.555
1.46764,93905.500
1.60106,61395.645
