X,Y
0.00000,12920.934
0.13342,13340.152
0.26684,15034.948
0.40027,16216.253
0.53369,20857.043
0.66711,20993.688
0.80053,19361.926
0.93395,19267.004
1.06737,18708.939
1.20080,18074.307
1.33422,18277.836
1.46764,17394.139
1.60106,16257.279
1.73448,15090.377
1.86791,13562.056
2.00133,12449.897
2.13475,13430.016
2.26817,12291.954
2.40159,13025.550
2.53502,12904.003
2.66844,12355.521
2.80186,11976.203
2.93528,11629.572
3.06870,11461.674
