x	Y_20180130_15109_10_7g_left	Y_20180130_15109_11_4g_left	Y_20180130_15109_15_10g	Y_20180130_15109_15_12g	Y_20180130_15109_17_2g_left	Y_20180130_15109_17_8g_left	Y_20180130_15109_19_13g	Y_20180130_15109_2_1g_left	Y_20180130_15109_22_11g	Y_20180130_15109_22_15g	Y_20180130_15109_22_1g	Y_20180130_15109_23_4g	Y_20180130_15109_25_4g	Y_20180130_15109_28_4g	Y_20180130_15109_31_3g	Y_20180130_15109_31_5g	Y_20180130_15109_31_6g	Y_20180130_15109_33_2g	Y_20180130_15109_33_5g	Y_20180130_15109_34_7g	Y_20180130_15109_35_9g	Y_20180130_15109_36_5g	Y_20180130_15109_36_6g	Y_20180130_15109_38_3g	Y_20180130_15109_38_6g	Y_20180130_15109_40_7g	Y_20180130_15109_41_6g	Y_20180130_15109_5_2g_left	Y_20180130_15109_5_4g_left	Y_20180130_15109_6_4g_left	Y_20180130_15109_7_10g	Y_20180130_15109_7_11g	Y_20180130_15109_7_3g_left	Y_20180130_15109_8_1g_left	Y_20180130_15109_8_8g	Y_20180130_15109_43_1g	Y_20180130_15109_1_6g_right	Y_20180130_15109_11_2g_right	Y_20180130_15109_2_8g	Y_20180130_15109_4_9g	Y_20180130_15109_5_10g	Y_20180130_15109_5_5g_right	Y_20180130_15109_6_10g	Y_20180130_15109_9_5g_right	Y_20180130_15109_14_13g	Y_20180130_15109_16_10g	Y_20180130_15109_16_12g	Y_20180130_15109_16_13g	Y_20180130_15109_16_6g_right	Y_20180130_15109_17_11g	Y_20180130_15109_17_6g_right
0	10719.372	12166.149	13894.138	13183.434	12426.751	12316.907	12326.911	11042.527	12447.586	11448.2	13863.861	12737	13169.5	13096.098	14424.867	14346.274	14276.646	12593.5	14225.906	13665.756	11079.194	13266.408	11615.112	13040.144	11764.2	10430.09	10700.18	11313.525	12090.731	12585.649	12578.314	13762.152	13267.698	12890.592	12825.649	13363.44	14277.24	11435.438	12920.934	11325.062	12568.554	10969.197	11888.042	12548.572	13567.994	11374.041	12164.066	11701.054	12779.136	11814.17	10865.218
0.1334	11888.179	12441.386	13737.023	13596.517	13367.181	13426.727	13173.278	11610.518	12614.963	11779.881	14313.291	12333.24	13068.029	13589.506	14778.069	13539.658	15209.051	13822.747	15158.841	13519.302	11518.785	14154.082	11941.173	12615.911	12592.023	11189.779	10779.186	11803.661	12390.375	12893.961	12248.358	13687.802	13764.084	13499.297	13041.293	16496.42	12977.671	12046.729	13340.152	12194.608	12521.584	10738.836	11780.432	13379.784	13554.686	12051.506	13151.111	12457.15	13918.349	12129.583	12347.346
0.2668	12786.822	13671.818	14019.56	13887.188	13725.353	14981.582	14876.383	12904.898	13253.396	12491.599	14280.055	15394.258	14865.185	16469.346	17059.396	14534.372	15898.881	14948.375	15505.728	16049.751	12257.66	14855.562	12913.858	14978.871	13498.774	11667.081	11650.988	12273.521	13157.655	14167.163	13065.604	14289.5	15124.852	13800.97	16180.632	18695.377	13741.217	13687.559	15034.948	12953.559	13091.19	11565.739	11756.499	13610.426	14839.803	13612.768	14177.038	14062.483	15143.777	12893.069	12546.536
0.4003	14828.201	16292.529	15192.673	15971.509	15547.741	18249.658	17104.471	14250.382	14394.488	14193.03	15237.728	17813.719	16644.168	18254.432	19897.076	18320.434	20385.83	17161.178	17380.463	18828.156	13436.604	18682.627	14556.248	18082.963	15763.786	15097.926	13611.898	14270.864	15331.881	16236.561	14731.769	16629.627	15665.103	14102.493	19346.895	20571.703	16718.096	15893.552	16216.253	14966.456	15386.857	12950.172	13162.344	15607.609	16710.492	15804.716	15757.57	15183.506	18187.146	14170.726	14563.042
0.5337	18696.627	18876.016	19163.174	19655.236	18769.143	19061.035	20359.955	15423.976	15606.881	17586.086	16731.873	23094.033	20476.188	18772.758	22047.291	24049.09	26352.842	18631.795	20934.344	22307.674	16686.814	23315.02	17356.568	20095.973	20252.031	17483.832	16787.66	18544.186	21038.748	16761.707	15550.456	21060.295	15314.456	15517.435	19400.055	17875.633	19601.746	16636.354	20857.043	15493.745	19106.18	16481.365	15577.955	17184.666	19131.025	18772.477	18265.307	17196.25	20237.422	16806.484	15114.614
0.6671	21037.613	20843.992	21923.59	20977.244	21330.047	18347.396	21406.994	18216.625	19021.242	21689.281	17363.939	21634.932	28547.916	18916.059	22489.277	27875.051	33115.109	18370.945	21168.691	22552.787	21168.422	29350.682	20111.949	19364.797	25762.24	22965.066	19111.416	23093.025	27543.885	17368.766	16906.619	22397.297	15744.839	18299.152	18980.572	16677.41	21384.197	15481.243	20993.688	15687.821	24993.699	19258.619	18101.381	18200.408	18996.846	20039.658	19250.473	16508.439	19886.562	18349.777	15232.873
0.8005	19935.959	21643.615	22455.277	19835.07	21487.838	17212.691	21635.951	18114.908	24399.393	22269.541	18675.82	23206.348	31222.201	18731.215	21335.143	26628.668	35005.152	17520.533	20716.104	22290.51	23297.121	31800.277	21951.488	18270.188	27678.617	22509.059	19523.637	27312.234	29067.744	16927.402	19060.826	22824.836	14114.583	21335.842	19497.166	15822.004	20784.121	14157.132	19361.926	14667.118	27581.156	19333.379	20766.611	19054.361	18843.988	18712.205	20193.1	16989.195	18733.254	17376.553	14286.476
0.934	17546.152	21947.707	23649.436	19177.252	19643.959	15742.527	22878.471	19683.311	24179.482	21771.451	17359.812	24030.242	28436.715	18398.223	20248.145	23821.23	34328.516	16750.398	19780.328	21559.65	22296.715	31674.949	21122.24	15941.711	25143.727	21809.041	20376.807	26313.893	27492.635	16682.336	19789.205	21781.191	14285.959	21354.609	18252.326	15251.964	21695.574	14217.924	19267.004	15960.738	25333.738	18901.668	18741.648	18135.113	18573.67	18819.215	19419.408	16944.709	17002.949	16230.506	15158.021
1.0674	16337.842	21242.791	24382.584	18161.986	17661.482	15330.924	23593.066	19369.484	21264.824	21330.73	17257.438	23191.209	27570.898	17320.01	20449.652	23479.498	32170.252	16052.308	19356.832	22489.574	21505.541	29435.625	19793.895	16052.439	20674.312	20734.229	20948.215	22689.469	24228.785	16133.585	20632.91	21802.449	14540.93	20445.533	18708.281	14842.032	20819.957	13336.158	18708.939	16361.468	24942.822	18979.498	16363.37	16958.049	19650.805	19119.535	17974.148	15835.158	16823.064	15479.617	16204.646
1.2008	15392.415	21235.854	24736.637	18243.494	16535.432	15548.055	21171.771	20705.371	18064.084	19673.432	16922.539	22110.48	25168.582	15915.496	20025.334	22985.424	29087.814	15998.051	18609.059	21778.387	21217.275	25736.137	19530.65	15488.221	20180.818	20692.928	20083.318	22077.396	22358.127	15855.703	19751.596	19748.908	14599.306	20198.674	18100.578	15055.144	20918.768	13717.697	18074.307	16496.836	22599.607	17672.959	17088.047	16086.594	17410.467	19364.477	17822.164	15986.558	16594.229	14014.311	15656.624
1.3342	15751.26	19789.176	25097.473	17289.545	16561.285	15877.925	18150.77	20016.512	17433.072	19347.266	19415.326	21133.078	22642.564	15346.21	19021.016	22138.244	25258.131	14679.507	17121.572	20381.434	20226.395	23841.559	17939.418	15188.013	20576.117	21564.715	20056.725	22091.266	20732.682	14987.41	17311.447	18090.758	13666.841	18396.93	18214.986	15267.211	20456.744	15176.333	18277.836	16531.295	18806.654	16607.062	17823.078	15789.155	15893.812	18062.883	16713.834	14833.956	15614.345	13181.241	15539.708
1.4676	15995.475	19056.057	23495.586	16450.23	16367.141	15544.962	16261.327	20241.031	17062.4	19358.1	21236.344	19241.131	20883.873	14187.27	17311.162	20636.506	25526.803	14983.523	17085.5	18553.229	20433.227	23317.672	16488.152	15448.676	21300.609	21011.678	19599.598	21977.629	19714.887	15679.281	16014.198	17119.219	14338.381	16766.162	16152.646	15308.991	19915.057	16632.867	17394.139	15332.997	17737.854	15307.547	18187.07	14518.903	15037.359	17664.01	15872.351	14803	15859.651	14352.846	14285.647
1.6011	15724.58	18236.215	23850.137	15567.888	16588.551	15250.123	16035.372	20043.555	17873.861	19226.631	20817.496	17934.861	20511.002	14893.574	15636.394	19787.365	23573.482	15408.297	18249.865	17250.922	18805.5	21410.24	16910.48	15757.948	20158.594	19270.232	17761.527	22072.922	19138.924	15539.56	14923.761	15689.574	15557.828	17146.658	16003.517	16581.998	19544.912	15915.253	16257.279	13777.286	19004.277	15287.555	19225.168	14034.023	13417.359	17169.26	16079.954	14129.377	16127.172	14214.056	13295.121
1.7345	15467.352	18391.844	24126.723	16157.958	15460.462	15742.286	14766.926	19505.055	19243.158	18343.428	18752.598	19282.352	21305.723	14476.254	14650.146	17422.824	22479.352	14216.593	20160.092	16930.479	18991.9	19032.871	18858.824	16454.029	19116.719	18153.836	17991.74	22168.756	17579.924	14860.672	13754.691	14669.356	16451.012	17999.539	16425.297	16035.554	19136.854	16161.131	15090.377	13402.434	19613.635	14599.706	19076.488	14288.103	14136.551	18016.457	16730.293	14136.512	16332.917	14451.314	13500.919
1.8679	15095.256	17895.25	20083.498	15767.719	15257.534	15065.812	14138.998	19467.76	20635.537	17067.824	15296.463	20290.928	22369.713	14906.633	14576.454	15965.215	19766.166	14486.596	18476.844	16771.447	18647.932	17797.572	19115.658	16192.626	18741.863	18367.738	16928.91	21223.559	16453.145	14734.548	14547.3	14283.534	15665.823	18461.119	17155.092	16344.427	17512.482	15944.47	13562.056	12686.08	20887.066	14704.227	18571.539	14498.195	14481.864	17126.928	17251.578	14286.066	18515.375	13272.238	13939.131
2.0013	15833.185	16584.438	19353.363	14248.362	14820.584	14182.041	13485.134	18659.082	18964.492	16001.551	13473.568	20232.252	19819.938	14544.799	12897.143	16546.834	16626.303	15839.298	16561.625	15952.054	16819.582	18117.936	18221.172	15642.483	17814.711	19728.15	16192.763	20124.412	14873.155	14240.604	14672.023	13357.822	15245.989	17658.92	17044.688	15479.057	18004.768	14769.117	12449.897	12310.16	21457.498	13331.721	16048.031	14329.181	13913.877	17112.895	17937.572	12899.598	20548.354	12947.765	15120.996
2.1348	15889.466	14717.761	19371.467	14327.298	13594.883	14467.261	14478.781	17348.092	17659.199	15493.605	12939.419	17352.875	17544.527	16454.578	12548.062	14749.045	15048.849	14384.602	15299.974	14199.452	15118.337	17654.607	17217.375	16271.259	19326.432	18725.896	17035.342	19339.98	14283.43	13377.94	14683.168	12929.951	15152.718	16431.711	15827.345	13446.695	17072.842	13807.823	13430.016	13212.534	20277.33	14133.221	15189.735	13697.275	12880.222	18916.613	16460.271	12917.625	20967.863	12167.413	15465.39
2.2682	15333.154	13844.185	19201.99	14483.944	13418.352	14602.05	12894.167	17395.805	16228.432	14398.847	13273.965	14474.521	17815.965	17681.891	12265.25	13419.919	13809.806	12898.458	14864.067	13243.717	14150.174	16625.658	16228.03	17022.85	19122.887	18349.195	19306.031	16217.84	13626.926	12117.499	14242.253	13196.274	14321.483	15666.305	14752.694	12447.815	16343.003	13131.354	12291.954	13263.611	16666.014	13800.729	14718.432	14326.606	12261.83	19390.428	14705.09	12194.043	19071.859	11933.678	13646.974
2.4016	14892.594	12711.449	18032.881	14066.677	13396.479	14031.509	12708.315	17422.277	15408.333	13331.415	13326.363	12682.775	17768.486	16451.92	11888.489	13129.59	12645.494	12342.86	14090.054	13085.023	13515.415	14942.065	15597.737	14951.761	17245.271	17276.26	20824.908	16088.483	14488.059	11312.23	14062.523	12959.173	13825.622	15487.741	14735.252	13142.419	14851.481	12773.583	13025.55	13498.38	15602.422	13630.44	12980.845	14802.601	12720.81	19565.785	13987.369	11877.915	20211.145	10772.891	12676.969
2.535	14315.337	12392.406	17344.828	13425.909	13121.844	14945.753	12939.17	15818.584	15235.475	13101.467	14716.567	11508.405	18017.602	15217.634	11064.659	12752.679	12467.132	11280.279	13162.259	12444.031	12995.733	14181.208	15259.821	13007.817	16506.213	15535.563	21734.898	14442.507	14852.309	11195.113	14206.559	12462.169	13356.593	15382.168	14129.584	13197.626	14523.804	12180.269	12904.003	13227.917	13691.866	13353.14	13420.999	14616.994	12973.683	17453.148	12490.673	11966.68	21029.314	10924.622	12625.082
2.6684	13878.471	12377.455	17074.912	13554.729	12526.249	14425.527	12999.437	14271.877	14426.028	12128.805	NaN	12187.653	18094.914	13432.444	11373.298	12731.921	12136.524	12175.929	12712.308	11921.004	12478.111	13383.172	16350.688	12755.844	14714.732	13321.257	21643.551	13492.787	15039.837	11434.007	14567.292	11965.036	NaN	15302.213	13490.37	12403.057	13280.507	11932.139	12355.521	13389.728	12587.083	12445.342	12863.341	13970.735	13007.477	15272.906	11636.616	11266.498	17351.408	10258.896	12130.726
2.8019	13094.89	11615.735	16590.443	12202.827	12479.54	13493.185	12681.749	12853.801	13817.103	11140.242	NaN	11971.147	16243.288	12921.178	11381.166	12620.892	12021.474	NaN	12696.158	11605.072	12555.717	13096.361	15925.761	NaN	13646.861	12212.601	18741.602	13932.14	14104.973	11494.171	14819.504	11896.114	NaN	13665.126	12948.399	12901.283	12805.125	12254.369	11976.203	13596.499	12299.029	11788.86	12989.496	13896.126	13103.054	13527.17	11205.208	11085.85	13933.999	10887.1	11742.287
2.9353	12797.49	11351.086	16373.692	11355.691	11839.829	13489.605	12928.33	12214.002	13254.918	11120.452	NaN	NaN	14413.837	12485.355	11490.312	12640.896	11931.421	NaN	NaN	11088.763	12016.147	12590.645	15243.729	NaN	14442.172	11903.554	16606.617	13652.927	12736.747	10890.4	14125.899	12061.256	NaN	12390.444	12963.01	NaN	11968.393	NaN	11629.572	13082.352	11866.611	NaN	12930.977	12757.278	NaN	13213.821	10983.075	11047.338	13291.934	11149.803	12806.886
3.0687	NaN	11381.724	17693.643	11869.825	11959.976	NaN	12915.717	11834.75	13191.32	11586.787	NaN	NaN	12890.294	NaN	11513.698	12786.457	12547.163	NaN	NaN	11857.603	12072.504	NaN	15010.654	NaN	13545.27	11867.434	14484.387	13590.166	13007.188	10696.153	12565.928	12440.311	NaN	12525.089	12667.182	NaN	12131.655	NaN	11461.674	NaN	12792.848	NaN	11907.506	12124.915	NaN	12745.425	11520.952	NaN	NaN	11299.779	NaN
3.2021	NaN	11967.899	16152.935	12594.875	NaN	NaN	12367.992	12554.236	13201.206	11867.141	NaN	NaN	14762.618	NaN	NaN	NaN	13020.938	NaN	NaN	11493.472	NaN	NaN	13714.418	NaN	13174.672	NaN	13290.146	13783.795	NaN	NaN	12357.563	11951.613	NaN	NaN	NaN	NaN	NaN	NaN	NaN	NaN	NaN	NaN	NaN	12270.198	NaN	12657.033	NaN	NaN	NaN	10343.077	NaN
3.3356	NaN	11108.821	14684.178	NaN	NaN	NaN	12304.293	13067.684	NaN	NaN	NaN	NaN	NaN	NaN	NaN	NaN	NaN	NaN	NaN	11368.854	NaN	NaN	NaN	NaN	12991.836	NaN	12881.468	NaN	NaN	NaN	12253.948	12048.007	NaN	NaN	NaN	NaN	NaN	NaN	NaN	NaN	NaN	NaN	NaN	NaN	NaN	NaN	NaN	NaN	NaN	NaN	NaN
3.469	NaN	NaN	13205.401	NaN	NaN	NaN	NaN	NaN	NaN	NaN	NaN	NaN	NaN	NaN	NaN	NaN	NaN	NaN	NaN	NaN	NaN	NaN	NaN	NaN	NaN	NaN	13483.101	NaN	NaN	NaN	12078.771	12180.117	NaN	NaN	NaN	NaN	NaN	NaN	NaN	NaN	NaN	NaN	NaN	NaN	NaN	NaN	NaN	NaN	NaN	NaN	NaN
3.6024	NaN	NaN	11871.016	NaN	NaN	NaN	NaN	NaN	NaN	NaN	NaN	NaN	NaN	NaN	NaN	NaN	NaN	NaN	NaN	NaN	NaN	NaN	NaN	NaN	NaN	NaN	13752.186	NaN	NaN	NaN	12166.357	NaN	NaN	NaN	NaN	NaN	NaN	NaN	NaN	NaN	NaN	NaN	NaN	NaN	NaN	NaN	NaN	NaN	NaN	NaN	NaN
3.7358	NaN	NaN	12305.855	NaN	NaN	NaN	NaN	NaN	NaN	NaN	NaN	NaN	NaN	NaN	NaN	NaN	NaN	NaN	NaN	NaN	NaN	NaN	NaN	NaN	NaN	NaN	13697.693	NaN	NaN	NaN	NaN	NaN	NaN	NaN	NaN	NaN	NaN	NaN	NaN	NaN	NaN	NaN	NaN	NaN	NaN	NaN	NaN	NaN	NaN	NaN	NaN
3.8692	NaN	NaN	12559.07	NaN	NaN	NaN	NaN	NaN	NaN	NaN	NaN	NaN	NaN	NaN	NaN	NaN	NaN	NaN	NaN	NaN	NaN	NaN	NaN	NaN	NaN	NaN	NaN	NaN	NaN	NaN	NaN	NaN	NaN	NaN	NaN	NaN	NaN	NaN	NaN	NaN	NaN	NaN	NaN	NaN	NaN	NaN	NaN	NaN	NaN	NaN	NaN
4.0027	NaN	NaN	NaN	NaN	NaN	NaN	NaN	NaN	NaN	NaN	NaN	NaN	NaN	NaN	NaN	NaN	NaN	NaN	NaN	NaN	NaN	NaN	NaN	NaN	NaN	NaN	NaN	NaN	NaN	NaN	NaN	NaN	NaN	NaN	NaN	NaN	NaN	NaN	NaN	NaN	NaN	NaN	NaN	NaN	NaN	NaN	NaN	NaN	NaN	NaN	NaN
4.1361	NaN	NaN	NaN	NaN	NaN	NaN	NaN	NaN	NaN	NaN	NaN	NaN	NaN	NaN	NaN	NaN	NaN	NaN	NaN	NaN	NaN	NaN	NaN	NaN	NaN	NaN	NaN	NaN	NaN	NaN	NaN	NaN	NaN	NaN	NaN	NaN	NaN	NaN	NaN	NaN	NaN	NaN	NaN	NaN	NaN	NaN	NaN	NaN	NaN	NaN	NaN
4.2695	NaN	NaN	NaN	NaN	NaN	NaN	NaN	NaN	NaN	NaN	NaN	NaN	NaN	NaN	NaN	NaN	NaN	NaN	NaN	NaN	NaN	NaN	NaN	NaN	NaN	NaN	NaN	NaN	NaN	NaN	NaN	NaN	NaN	NaN	NaN	NaN	NaN	NaN	NaN	NaN	NaN	NaN	NaN	NaN	NaN	NaN	NaN	NaN	NaN	NaN	NaN
4.4029	NaN	NaN	NaN	NaN	NaN	NaN	NaN	NaN	NaN	NaN	NaN	NaN	NaN	NaN	NaN	NaN	NaN	NaN	NaN	NaN	NaN	NaN	NaN	NaN	NaN	NaN	NaN	NaN	NaN	NaN	NaN	NaN	NaN	NaN	NaN	NaN	NaN	NaN	NaN	NaN	NaN	NaN	NaN	NaN	NaN	NaN	NaN	NaN	NaN	NaN	NaN
4.5363	NaN	NaN	NaN	NaN	NaN	NaN	NaN	NaN	NaN	NaN	NaN	NaN	NaN	NaN	NaN	NaN	NaN	NaN	NaN	NaN	NaN	NaN	NaN	NaN	NaN	NaN	NaN	NaN	NaN	NaN	NaN	NaN	NaN	NaN	NaN	NaN	NaN	NaN	NaN	NaN	NaN	NaN	NaN	NaN	NaN	NaN	NaN	NaN	NaN	NaN	NaN
4.6698	NaN	NaN	NaN	NaN	NaN	NaN	NaN	NaN	NaN	NaN	NaN	NaN	NaN	NaN	NaN	NaN	NaN	NaN	NaN	NaN	NaN	NaN	NaN	NaN	NaN	NaN	NaN	NaN	NaN	NaN	NaN	NaN	NaN	NaN	NaN	NaN	NaN	NaN	NaN	NaN	NaN	NaN	NaN	NaN	NaN	NaN	NaN	NaN	NaN	NaN	NaN
4.8032	NaN	NaN	NaN	NaN	NaN	NaN	NaN	NaN	NaN	NaN	NaN	NaN	NaN	NaN	NaN	NaN	NaN	NaN	NaN	NaN	NaN	NaN	NaN	NaN	NaN	NaN	NaN	NaN	NaN	NaN	NaN	NaN	NaN	NaN	NaN	NaN	NaN	NaN	NaN	NaN	NaN	NaN	NaN	NaN	NaN	NaN	NaN	NaN	NaN	NaN	NaN
4.9366	NaN	NaN	NaN	NaN	NaN	NaN	NaN	NaN	NaN	NaN	NaN	NaN	NaN	NaN	NaN	NaN	NaN	NaN	NaN	NaN	NaN	NaN	NaN	NaN	NaN	NaN	NaN	NaN	NaN	NaN	NaN	NaN	NaN	NaN	NaN	NaN	NaN	NaN	NaN	NaN	NaN	NaN	NaN	NaN	NaN	NaN	NaN	NaN	NaN	NaN	NaN
5.07	NaN	NaN	NaN	NaN	NaN	NaN	NaN	NaN	NaN	NaN	NaN	NaN	NaN	NaN	NaN	NaN	NaN	NaN	NaN	NaN	NaN	NaN	NaN	NaN	NaN	NaN	NaN	NaN	NaN	NaN	NaN	NaN	NaN	NaN	NaN	NaN	NaN	NaN	NaN	NaN	NaN	NaN	NaN	NaN	NaN	NaN	NaN	NaN	NaN	NaN	NaN
5.2035	NaN	NaN	NaN	NaN	NaN	NaN	NaN	NaN	NaN	NaN	NaN	NaN	NaN	NaN	NaN	NaN	NaN	NaN	NaN	NaN	NaN	NaN	NaN	NaN	NaN	NaN	NaN	NaN	NaN	NaN	NaN	NaN	NaN	NaN	NaN	NaN	NaN	NaN	NaN	NaN	NaN	NaN	NaN	NaN	NaN	NaN	NaN	NaN	NaN	NaN	NaN
5.3369	NaN	NaN	NaN	NaN	NaN	NaN	NaN	NaN	NaN	NaN	NaN	NaN	NaN	NaN	NaN	NaN	NaN	NaN	NaN	NaN	NaN	NaN	NaN	NaN	NaN	NaN	NaN	NaN	NaN	NaN	NaN	NaN	NaN	NaN	NaN	NaN	NaN	NaN	NaN	NaN	NaN	NaN	NaN	NaN	NaN	NaN	NaN	NaN	NaN	NaN	NaN
5.4703	NaN	NaN	NaN	NaN	NaN	NaN	NaN	NaN	NaN	NaN	NaN	NaN	NaN	NaN	NaN	NaN	NaN	NaN	NaN	NaN	NaN	NaN	NaN	NaN	NaN	NaN	NaN	NaN	NaN	NaN	NaN	NaN	NaN	NaN	NaN	NaN	NaN	NaN	NaN	NaN	NaN	NaN	NaN	NaN	NaN	NaN	NaN	NaN	NaN	NaN	NaN
5.6037	NaN	NaN	NaN	NaN	NaN	NaN	NaN	NaN	NaN	NaN	NaN	NaN	NaN	NaN	NaN	NaN	NaN	NaN	NaN	NaN	NaN	NaN	NaN	NaN	NaN	NaN	NaN	NaN	NaN	NaN	NaN	NaN	NaN	NaN	NaN	NaN	NaN	NaN	NaN	NaN	NaN	NaN	NaN	NaN	NaN	NaN	NaN	NaN	NaN	NaN	NaN
5.7371	NaN	NaN	NaN	NaN	NaN	NaN	NaN	NaN	NaN	NaN	NaN	NaN	NaN	NaN	NaN	NaN	NaN	NaN	NaN	NaN	NaN	NaN	NaN	NaN	NaN	NaN	NaN	NaN	NaN	NaN	NaN	NaN	NaN	NaN	NaN	NaN	NaN	NaN	NaN	NaN	NaN	NaN	NaN	NaN	NaN	NaN	NaN	NaN	NaN	NaN	NaN
