X,Y
0.00000,38216.777
0.13342,39417.871
0.26684,39151.367
0.40027,38881.488
0.53369,38053.793
0.66711,37752.801
0.80053,37640.176
0.93395,38672.762
1.06737,38301.785
1.20080,37676.453
1.33422,40569.578
1.46764,43856.934
1.60106,50951.203
1.73448,69957.258
1.86791,92003.648
2.00133,96636.852
2.13475,70687.523
2.26817,52888.273
2.40159,45240.477
2.53502,42713.121
