0.00000,36324.727
0.13342,36175.441
0.26684,37851.391
0.40027,37373.141
0.53369,36556.445
0.66711,36227.270
0.80053,37042.727
0.93395,36750.906
1.06737,37846.613
1.20080,40741.809
1.33422,45388.285
1.46764,59273.875
1.60106,84928.141
1.73448,101131.438
1.86791,80842.383
2.00133,55817.086
2.13475,46262.695
