X,Y
0.00000,31446.082
0.13342,33156.176
0.26684,32352.727
0.40027,32057.898
0.53369,31386.494
0.66711,32095.658
0.80053,31299.760
0.93395,32459.652
1.06737,31163.881
1.20080,30351.732
1.33422,30934.010
1.46764,32058.279
1.60106,32130.260
1.73448,33584.895
1.86791,34476.285
2.00133,35513.824
2.13475,37943.891
2.26817,46110.086
2.40159,58786.492
2.53502,61720.559
2.66844,48137.609
