0.00000,39751.512
0.13342,39230.961
0.26684,40962.422
0.40027,39058.977
0.53369,39289.121
0.66711,39875.992
0.80053,40277.426
0.93395,40417.324
1.06737,40219.750
1.20080,37821.555
1.33422,38371.719
1.46764,38965.402
1.60106,39682.855
1.73448,38883.602
1.86791,43877.719
2.00133,48930.949
2.13475,70171.867
2.26817,110949.664
2.40159,134327.688
2.53502,107394.906
2.66844,71728.945
2.80186,52479.957
2.93528,45995.441
