0.00000,12321.152
0.13342,12923.978
0.26684,13859.104
0.40027,17472.457
0.53369,21873.633
0.66711,23098.488
0.80053,24949.781
0.93395,25897.572
1.06737,25855.723
1.20080,23959.125
1.33422,20906.744
1.46764,18207.877
1.60106,18562.828
1.73448,16436.912
1.86791,15172.513
