0.00000,11583.526
0.13342,12181.491
0.26684,13362.231
0.40027,15071.080
0.53369,15713.281
0.66711,14078.641
0.80053,14124.048
0.93395,16399.846
1.06737,16321.025
1.20080,16814.836
1.33422,17529.527
1.46764,20695.078
1.60106,25586.936
1.73448,25807.789
1.86791,20488.199
2.00133,16261.484
2.13475,14011.966
2.26817,13416.980
2.40159,12999.905
