0.0000	16576.6641
0.1334	17702.8809
0.2668	19971.0605
0.4003	23734.4277
0.5337	25614.2832
0.6671	23841.7109
0.8005	21395.0410
0.9340	22278.5762
1.0674	23998.7246
1.2008	26990.0625
1.3342	27120.4746
1.4676	22010.1445
1.6011	17687.8086
1.7345	16081.6338
1.8679	15056.9795
2.0013	13694.9316
2.1347	14081.4619
2.2682	13852.0859
2.4016	13849.4121
