X,Y
0.00000,32273.551
0.13342,33115.070
0.26684,32453.621
0.40027,31984.449
0.53369,31952.123
0.66711,31994.303
0.80053,31211.379
0.93395,31536.254
1.06737,31846.373
1.20080,31363.043
1.33422,30381.570
1.46764,30180.570
1.60106,31224.191
1.73448,32708.750
1.86791,34008.406
2.00133,39174.363
2.13475,50868.172
2.26817,71863.547
2.40159,73370.312
2.53502,52574.934
2.66844,38520.445
2.80186,33628.066
