0.0000	14136.0996
0.1334	15121.5283
0.2668	15219.1338
0.4003	17487.9121
0.5337	23021.2852
0.6671	30156.0645
0.8005	28120.6797
0.9340	23555.3301
1.0674	21223.6621
1.2008	19858.5020
1.3342	18995.0352
1.4676	19457.0391
1.6011	20160.9805
1.7345	20330.8906
1.8679	23384.7168
2.0013	21285.5293
2.1347	17741.0684
2.2682	17533.0664
2.4016	16174.4961
2.5350	17488.3203
2.6684	17291.7891
2.8019	15691.9180
2.9353	15519.8438
3.0687	14045.0752
3.2021	15104.1934
3.3355	14979.9023
3.4690	14813.1211
3.6024	14863.9307
