x	Y_20180514_15100_10_4g	Y_20180514_15100_10_6g	Y_20180514_15100_13_9g	Y_20180514_15100_14_3g	Y_20180514_15100_18_2g	Y_20180514_15100_19_5g	Y_20180514_15100_19_7g	Y_20180514_15100_2_1g	Y_20180514_15100_23_6g	Y_20180514_15100_26_3g	Y_20180514_15100_27_6g	Y_20180514_15100_3_1g	Y_20180514_15100_3_6g	Y_20180514_15100_30_5g	Y_20180514_15100_32_1g	Y_20180514_15100_32_3g	Y_20180514_15100_4_12g	Y_20180514_15100_4_7g	Y_20180514_15100_6_4g	Y_20180514_15100_7_3g	Y_20180514_15100_9_7g
0	12335.8691	12105.8545	12046.3447	11209.0449	14633.4023	14267.9199	15331.4922	12145.8369	11341.4922	11968.8271	13045.1895	13940.3887	14848.8027	16472.9551	12907.9316	13898.7354	13806.3281	14408.2646	14843.1787	14257.4229	14215.2754
0.1334	13075.3623	13148.4658	12229.9551	11758.5127	15461.4785	14169.9326	15336.5049	13745.6406	12298.2754	13806.4727	13073.2314	13389.5439	15278.2275	16905.2578	13285.9961	14982.5527	13917.6777	15144.0664	16878.082	15408.9199	15113.3291
0.2668	14108.6328	16285.5078	12612.3184	14013.8887	17081.9531	15656.3584	16977.6426	14839.0703	13862.2148	17449.7559	13165.9102	14246.959	17274.9805	20313.9121	13963.7588	15349.7578	15168.875	15858.1006	21827.1797	16981.0996	17885.2012
0.4003	17193.9609	19118.6055	14980.3301	19456.3672	21214.2676	18527.0605	20009.6699	18695.6406	15729.0762	21294.7266	14214.8896	17558.2656	20276.0293	23793.3438	14777.3408	16918.2754	17641.6992	19006.7402	27350.6992	18042.9805	22275.7031
0.5337	21135.7969	23392.3086	18485.5703	25236.2305	23675.7734	20938.9453	24966.6543	24910.7891	19685.0684	22912.5078	16827.1816	21166.8711	26893.3633	25221.6543	17218.6172	20274.2422	21711.7559	24047.8652	28368.6172	21124.707	25401.1895
0.6671	21244.6953	23954.4434	23852.9609	27928.7793	23611.1309	22959.2676	25181.9727	28602.918	26598.1211	20732.752	19550.1562	22898.9277	33941.0117	22170.3535	21000.8418	23333.6055	25303.2305	26958.832	24912.2031	23377.1523	25089.957
0.8005	18584.1152	22580.543	24500.5176	25101.4141	20706.7109	22167.6133	21696.3184	24940.2773	27541.2344	16286.1963	20601.7637	20374.7246	32992.6289	18269.6758	20389.4688	21076.4902	22163.0586	28172.1387	22321.8652	22435.5	23029.4492
0.934	16819.8633	21092.4395	23319.334	21961.2148	17956.3945	20061.5508	17833.3496	21086.6309	24683.3242	14013.4854	19747.9707	18647.1641	27630.0605	17902.5371	17554.834	17710.2598	20196.9004	24500.7891	21336.1543	21582.209	22569.7402
1.0674	17223.9082	19159.0742	22943.7578	21082.873	16413.4922	20525.3965	15888.6865	19815.2324	21219.7637	13494.6777	17421.2852	17244.707	26172.1445	17367.5234	14061.6807	16221.7529	18618.8281	22771.0781	20630.2773	21630.5078	22157.8438
1.2008	18020.9727	17526.0527	22902.7441	18447.0527	15925.2549	19251.7598	14697.0469	19233.0762	19378.4727	13618.4834	16435.457	16352.0645	24214.291	17387.3984	14029.083	15989.6172	16801.8457	22712.5977	19818.8906	21091.582	22996.7578
1.3342	18688.2969	16960.9766	21703.5508	17363.668	16664.3809	19054.5645	14855.0928	17223.3105	18129.0312	13629.9238	15759.5879	15571.9092	21911.543	16202.5869	13699.5898	15020.6875	16021.0889	20905.6133	20346.6602	20346.1777	22019.1504
1.4676	17702.0684	18440.3594	21967.5293	17428.7266	17611.1953	17332.6328	14307.0527	16248.3994	18541.6035	13462.3896	15656.542	14585.5293	22150.9883	16015.9619	13105.3525	14190.7012	15080.2754	20429.9102	20116.2891	19040.2207	20562.1875
1.6011	18913.9902	17840.7285	22805.8164	17751.2539	17776.4844	16302.7471	14789.6904	16941.3613	18557.084	12929.4932	15004.3896	15303.8926	23833.8496	15580.0664	14120.3428	14791.3867	16030.458	20189.3711	19729.7578	17361.1992	19359.5762
1.7345	17986.1035	16858.7852	21902.2324	17554.1973	18449.9824	17342.0977	14952.9775	17344.2754	20028.1582	13247.917	15447.3369	15486.96	21200.0742	14738.7959	14657.335	13699.8838	16234.585	20238.6465	18476.541	17133.8828	18867.4961
1.8679	18903.9902	17661.4199	21361.3633	16017.6787	19070.7676	17919.7734	15624.3867	18841.0996	18863.8066	14000.1846	14212.252	16190.2344	19133.207	14903.6299	14123.1924	12824.2324	15075.2998	19536.4688	17341.6543	16699.1484	19321.4004
2.0013	18863.8418	17550.4863	19369.5586	15568.3594	19617.6973	16759.8926	15851.7246	20574.8926	17841.4727	14208.3633	14339.248	14654.6133	17888.3203	15853.5576	14646.4297	13231.4805	16057.6885	18491.7754	17980.918	17375.25	18505.9844
2.1347	19169.0703	18474.2754	19279.2891	15156.4443	20419.5879	16137.8955	15874.4727	21476.8223	17486.1758	15137.75	13109.7764	14132.7988	16800.9375	17679.8418	14764.9287	13451.8643	15831.3057	18195.6953	17109.3379	16302.2568	18151.5605
2.2682	18392.8477	18422.4883	17498.332	14495.9443	20840.0898	16345.3584	15022.7881	20969.5293	16131.9316	14404.0166	12778.7012	15441.5273	15706.0166	18266.2812	13884.4502	13406.9912	15959.8945	17467.7461	17359.9492	16583.2617	17666.0547
2.4016	17872.5352	18303.1133	16950.9004	13347.6865	20690.8906	17196.0703	14067.4395	18586.6113	16002.1592	13847.1963	12685.7656	15951.999	16183.2412	18734.6641	14473.7598	13607.9238	15791.5361	16928.5547	19088.6855	16092.5566	17433.0469
2.535	17097.1543	16807.418	17839.2715	12748.874	19909.8145	17681.3105	13950.2441	17908.3164	16230.4062	14341.1035	13351.6992	15570.1162	16994.2793	19057.1973	14761.7354	13869.5771	16078.2461	15732.5898	19150.1973	15312.0391	16975.2305
2.6684	16174.1152	15508.1162	18030.9414	12232.7959	17261.125	18035.5898	13507.5264	16511.0684	18371.6465	13470.5166	13772.9326	17523.498	15618.3555	17287.4707	14222.1064	14669.2002	14769.7744	16317.6143	21740.9648	15942.9727	14864.2441
2.8019	15894.5586	14472.4316	17534.5234	12628.0605	16489.1309	19123.6113	14518.6035	16527.4141	19213.8652	12667.3301	14581.5225	19538.6992	14956.5059	15864.1084	14552.7402	14609.8652	14138.6172	15979.207	22150.4707	16037.2939	13437.8047
2.9353	16037.9141	12896.3164	15880.8926	11955.6152	15283.0244	17939.6523	12427.792	15146.7109	18969.3379	12333.1348	14687.6738	20943.8359	14822.8457	14537.1631	13591.9229	14701.4482	13645.4531	15808.248	20313.6523	15746.0869	13705.0781
3.0687	15917.5137	12882.7773	15095.1113	11411.4023	15082.293	16686.1465	13018.6396	15749.0049	16348.0439	12860.9619	13723.8984	18951.5977	12839.5459	14434.0137	13871.4482	14668.374	13493.6621	16814.2832	18058.2832	15343.5215	13764.5986
3.2021	15881.7041	12656.918	14879.0186	11520.5586	15385.9043	16370.0459	12648.7891	15223.6465	15247.6846	12241.6621	13284.4277	16993.6973	13119.4561	13213.6719	12994.5098	14518.8242	13150.251	16163.4941	15803.3428	16625.2695	13466.8389
3.3355	15304.4414	12851.6055	15176.0645	NaN	NaN	14797.1494	13088.0811	15175.7119	15042.0586	NaN	13422.8262	15258.9053	13238.7188	12850.1758	13857.7441	15137.8467	13037.3574	16226.3662	14312.4561	16624.3984	13646.1162
3.469	15240.0811	13281.7471	14977.6143	NaN	NaN	15340.7178	12447.9805	14759.8594	NaN	NaN	13175.6113	14120.083	12875.3506	13447.252	14231.2588	NaN	12788.2871	14585.3086	14472.7266	16223.0938	13920.3936
3.6024	15111.4893	NaN	15194.1543	NaN	NaN	15241.9092	11512.9375	14833.7441	NaN	NaN	13310.0068	13660.541	12630.5225	13839.6689	NaN	NaN	12613.0654	15030.5176	14599.5098	15015.1494	14393.7695
3.7358	14774.0312	NaN	14898.9248	NaN	NaN	14325.1475	11986.4473	14273.0137	NaN	NaN	NaN	13990.7109	NaN	NaN	NaN	NaN	12914.9141	13472.165	NaN	14441.834	NaN
3.8692	NaN	NaN	NaN	NaN	NaN	14267.5664	11663.0684	13694.8145	NaN	NaN	NaN	13145.3496	NaN	NaN	NaN	NaN	12938.2793	14007.0156	NaN	NaN	NaN
4.0027	NaN	NaN	NaN	NaN	NaN	NaN	NaN	NaN	NaN	NaN	NaN	13373.7637	NaN	NaN	NaN	NaN	NaN	NaN	NaN	NaN	NaN
4.1361	NaN	NaN	NaN	NaN	NaN	NaN	NaN	NaN	NaN	NaN	NaN	NaN	NaN	NaN	NaN	NaN	NaN	NaN	NaN	NaN	NaN
4.2695	NaN	NaN	NaN	NaN	NaN	NaN	NaN	NaN	NaN	NaN	NaN	NaN	NaN	NaN	NaN	NaN	NaN	NaN	NaN	NaN	NaN
4.4029	NaN	NaN	NaN	NaN	NaN	NaN	NaN	NaN	NaN	NaN	NaN	NaN	NaN	NaN	NaN	NaN	NaN	NaN	NaN	NaN	NaN
4.5363	NaN	NaN	NaN	NaN	NaN	NaN	NaN	NaN	NaN	NaN	NaN	NaN	NaN	NaN	NaN	NaN	NaN	NaN	NaN	NaN	NaN
4.6698	NaN	NaN	NaN	NaN	NaN	NaN	NaN	NaN	NaN	NaN	NaN	NaN	NaN	NaN	NaN	NaN	NaN	NaN	NaN	NaN	NaN
4.8032	NaN	NaN	NaN	NaN	NaN	NaN	NaN	NaN	NaN	NaN	NaN	NaN	NaN	NaN	NaN	NaN	NaN	NaN	NaN	NaN	NaN
4.9366	NaN	NaN	NaN	NaN	NaN	NaN	NaN	NaN	NaN	NaN	NaN	NaN	NaN	NaN	NaN	NaN	NaN	NaN	NaN	NaN	NaN
5.07	NaN	NaN	NaN	NaN	NaN	NaN	NaN	NaN	NaN	NaN	NaN	NaN	NaN	NaN	NaN	NaN	NaN	NaN	NaN	NaN	NaN
