0.00000,12072.248
0.13342,12663.804
0.26684,14712.020
0.40027,17453.373
0.53369,17888.486
0.66711,17873.629
0.80053,17098.092
0.93395,16472.898
1.06737,16163.609
1.20080,17164.432
1.33422,17303.148
1.46764,15615.259
1.60106,14110.224
1.73448,13676.257
1.86791,12875.598
2.00133,13040.560
2.13475,13024.846
