X,Y
0.00000,12527.684
0.13342,12101.262
0.26684,12294.644
0.40027,13219.852
0.53369,15279.047
0.66711,17258.014
0.80053,18162.719
0.93395,18039.035
1.06737,17742.502
1.20080,16754.184
1.33422,15413.838
1.46764,13754.233
1.60106,13110.380
1.73448,12369.478
1.86791,12035.702
2.00133,11799.419
2.13475,11922.426
2.26817,12195.390
