x	Y_20180514_15338_c1_1_2g	Y_20180514_15338_c1_10_13g	Y_20180514_15338_c1_11_1g	Y_20180514_15338_c1_12_2g	Y_20180514_15338_c1_12_6g	Y_20180514_15338_c1_12_7g	Y_20180514_15338_c1_13_6g	Y_20180514_15338_c1_18_3g	Y_20180514_15338_c1_18_4g	Y_20180514_15338_c1_2_3g	Y_20180514_15338_c1_2_8g	Y_20180514_15338_c1_20_6g	Y_20180514_15338_c1_23_5g	Y_20180514_15338_c1_24_6g	Y_20180514_15338_c1_25_3g	Y_20180514_15338_c1_28_5g	Y_20180514_15338_c1_3_6g	Y_20180514_15338_c1_3_8g	Y_20180514_15338_c1_6_4g	Y_20180514_15338_c1_8_15g
0	29496.098	30872.348	34265.879	32270.246	30773.135	32809.535	32615.457	31375.475	27601.844	34225.324	31240.172	32505.605	35071.621	30315.209	31786.199	29164.711	32568.977	27931.064	27843.516	31780.559
0.1334	29260.27	30486.311	31576.307	30867.941	29833.539	31731.646	33878.195	32012.91	29691.561	33810.012	30924.443	33419.379	33706.727	28952.791	31556.791	28014.395	30980.211	29296.316	28407.914	32085.686
0.2668	30297.984	30395.402	32045.289	30413.754	31418.746	32323.225	34654.301	31438.973	29785.482	35633.359	31553.549	32034.727	33232.824	28577.256	30387.746	28700.932	31970.111	28920.984	28830.271	32878.641
0.4003	29312.324	31167.031	31366.947	30248.398	30042.637	31774.641	35316.594	30676.924	29175.246	35216.055	31391.199	33201.43	33481.883	28471.852	31369.344	29396.012	31761.961	29656.697	29215.887	31897.811
0.5337	28783.33	30403.803	33985.711	29490.154	29122.375	31079.75	33928.734	32695.775	29160.678	35349.258	31332.508	33806.34	32351.225	29065.766	30071.986	28650.848	30576.961	29380.064	28821.547	31573.275
0.6671	31459.055	28493.668	33243.355	30825.164	30801.695	31937.102	35374.125	31480.875	28850.729	34877.91	31177.031	34033.688	32368.994	29585.947	30207.447	27997.678	31273.898	30052.641	29756.752	32813.492
0.8005	30707.797	28898.662	32507.586	30767.199	30726.717	31583.936	32780.988	31251.445	30222.914	35448.523	31830.836	33018.852	32803.875	29476.592	30547.1	29069.975	30893.824	30299.002	28157.336	32594.486
0.934	31003.754	31230.924	33998.355	29901.883	31508.572	30951.76	34622.797	32733.783	30760.922	34368.906	32448.404	33802.305	33539.012	30527.939	31044.662	29021.736	31129.203	29607.094	29288.82	32547.65
1.0674	33627.098	30117.961	32216.547	33690.473	31000.182	31662.014	34708.668	32906.539	30446.361	34635.195	32370.461	35293.852	33817.23	32604.4	30638.25	29117.51	29802.947	29540.752	28988.332	33492.84
1.2008	34464.625	31185.918	32799.066	34291.785	32079.121	33276.945	34651.762	33450.57	30670.561	34158.75	33976.16	36124.086	34492.293	33272.398	30729.768	28403.523	29863.168	31219.168	29179.479	32610.311
1.3342	37365.465	31875.094	33137.367	35264.547	30690.289	33098.863	37422.66	32988.004	29859.775	35577.535	32574.256	36489.145	35851.477	32138.969	30805.523	28495.543	30897.191	30283.334	31211.096	32674.516
1.4676	44303.773	32120.875	32879	35603.84	31721.68	33198.016	38008.82	32455.508	30147.738	40888.539	34893.355	34601.16	34162.664	32415.043	31901.076	30357.656	32445.324	30426.783	30650.719	33023.137
1.6011	56793.023	31867.625	32829.445	33442.934	32162.043	34365.605	37440.984	33554.605	29736.896	46644.102	34929.512	34306.523	34217.16	34123.328	32212.111	31734.561	32210.906	30009.793	31254.812	33765.363
1.7345	65083.883	32426.383	34240.641	33954.98	31533.496	34020.797	36784.074	31754.928	31265.648	47563.051	37486.844	37373.766	33474.121	35860.676	30937.355	32482.348	31881.01	31087.734	30879.799	33371.398
1.8679	52641.953	30715.611	36715.613	33399.68	33788.656	33664.02	37344.727	32842.945	30600.496	42024.094	41838.344	42395.801	36447.102	39013.938	31605.742	36550.723	33215.73	31036.711	30339.9	33934.078
2.0013	42074.527	31103.582	43246.762	34428.664	31844.713	36212.551	40523.945	34163.676	31664.781	37527.898	42796.238	51896.621	34548.66	44882.156	34925.801	47137.492	33268.258	30512.273	31970.236	35298.094
2.1348	37855.605	32037.273	50640.223	32182.504	32181.236	43883.551	49030.375	35137.684	32602.805	35009.258	39510.148	51782.719	34645.668	56198.672	39697.086	54504.941	33490.82	29887.863	33617.008	34494.648
2.2682	35396.879	32741.35	53194.742	34232.242	32059.801	53546.68	70503.562	42387.918	33456.957	33418.629	34369.176	44417.621	39161.008	85420.484	48908.492	46272.965	34043.281	30477.631	38668.52	35274.418
2.4016	34316.273	35087.996	43853.629	33177.102	30600.521	52425.453	89753.773	52208.449	38692.371	32489.824	35311.371	37360.438	44971.039	136669.109	60150.734	37833.535	38321.934	32203.154	44930.82	36702.227
2.535	NaN	43184.984	37578.586	40132.496	33810.449	43340.434	80031.273	59041.477	49297.328	NaN	35855.414	32954.449	54851.707	132095.062	55687.297	32552.371	47250.969	34653.844	47126.727	41427.676
2.6684	NaN	51720.074	32875.602	48707.168	34676.219	37471.242	55505.137	53083.758	64376.441	NaN	34051.941	33209.676	58646.105	84733.375	42199.586	NaN	52085.508	37193.969	41851.16	48288.84
2.8019	NaN	52856.688	33478.629	57383.984	39810.047	34433.352	42087.727	42036.41	61509.277	NaN	34098.465	NaN	52617.105	54242.613	35728.309	NaN	45215.277	34681.297	36225.414	54323.113
2.9353	NaN	43294.141	34330.93	50049.176	45489.977	34153.633	38225.52	37084.824	47885.465	NaN	34109.875	NaN	41620.922	43158.652	34417.352	NaN	39339.777	31110.049	32656.217	50864.594
3.0687	NaN	35651.824	33993.48	41013.539	45638.586	34370.441	37470.887	35413.852	36956.125	NaN	33844.906	NaN	36521.93	39224.996	NaN	NaN	36032.496	29376.959	32657.738	40839.719
3.2021	NaN	34534.34	33208.766	35213.043	39060.375	NaN	35282.121	34245.184	33694.117	NaN	NaN	NaN	33618.676	36035.266	NaN	NaN	33214.125	29423.027	30796.352	38001.324
3.3356	NaN	32479.162	32607.107	35144.426	34715.688	NaN	35128.148	NaN	34645.633	NaN	NaN	NaN	32744.508	34496.023	NaN	NaN	32953.551	30197.334	31094.135	36069.336
3.469	NaN	NaN	32391.906	33197.664	33770.512	NaN	NaN	NaN	NaN	NaN	NaN	NaN	32531.229	33186.062	NaN	NaN	32990.527	NaN	28784.615	35301.117
3.6024	NaN	NaN	31634.48	33244.906	34184.418	NaN	NaN	NaN	NaN	NaN	NaN	NaN	NaN	32599.949	NaN	NaN	NaN	NaN	29754.084	NaN
3.7358	NaN	NaN	31098.941	33838.488	33238.168	NaN	NaN	NaN	NaN	NaN	NaN	NaN	NaN	32493.195	NaN	NaN	NaN	NaN	29705.529	NaN
3.8692	NaN	NaN	NaN	NaN	32759.977	NaN	NaN	NaN	NaN	NaN	NaN	NaN	NaN	31821.939	NaN	NaN	NaN	NaN	28803.33	NaN
4.0027	NaN	NaN	NaN	NaN	32365.01	NaN	NaN	NaN	NaN	NaN	NaN	NaN	NaN	32287.787	NaN	NaN	NaN	NaN	NaN	NaN
4.1361	NaN	NaN	NaN	NaN	NaN	NaN	NaN	NaN	NaN	NaN	NaN	NaN	NaN	31645.336	NaN	NaN	NaN	NaN	NaN	NaN
4.2695	NaN	NaN	NaN	NaN	NaN	NaN	NaN	NaN	NaN	NaN	NaN	NaN	NaN	NaN	NaN	NaN	NaN	NaN	NaN	NaN
4.4029	NaN	NaN	NaN	NaN	NaN	NaN	NaN	NaN	NaN	NaN	NaN	NaN	NaN	NaN	NaN	NaN	NaN	NaN	NaN	NaN
4.5363	NaN	NaN	NaN	NaN	NaN	NaN	NaN	NaN	NaN	NaN	NaN	NaN	NaN	NaN	NaN	NaN	NaN	NaN	NaN	NaN
4.6698	NaN	NaN	NaN	NaN	NaN	NaN	NaN	NaN	NaN	NaN	NaN	NaN	NaN	NaN	NaN	NaN	NaN	NaN	NaN	NaN
4.8032	NaN	NaN	NaN	NaN	NaN	NaN	NaN	NaN	NaN	NaN	NaN	NaN	NaN	NaN	NaN	NaN	NaN	NaN	NaN	NaN
4.9366	NaN	NaN	NaN	NaN	NaN	NaN	NaN	NaN	NaN	NaN	NaN	NaN	NaN	NaN	NaN	NaN	NaN	NaN	NaN	NaN
5.07	NaN	NaN	NaN	NaN	NaN	NaN	NaN	NaN	NaN	NaN	NaN	NaN	NaN	NaN	NaN	NaN	NaN	NaN	NaN	NaN
5.2035	NaN	NaN	NaN	NaN	NaN	NaN	NaN	NaN	NaN	NaN	NaN	NaN	NaN	NaN	NaN	NaN	NaN	NaN	NaN	NaN
5.3369	NaN	NaN	NaN	NaN	NaN	NaN	NaN	NaN	NaN	NaN	NaN	NaN	NaN	NaN	NaN	NaN	NaN	NaN	NaN	NaN
5.4703	NaN	NaN	NaN	NaN	NaN	NaN	NaN	NaN	NaN	NaN	NaN	NaN	NaN	NaN	NaN	NaN	NaN	NaN	NaN	NaN
