0.00000,12043.269
0.13342,13585.070
0.26684,14770.017
0.40027,16321.977
0.53369,18823.025
0.66711,21138.230
0.80053,21471.498
0.93395,20980.998
1.06737,18742.924
1.20080,16424.049
1.33422,15738.437
1.46764,16619.027
1.60106,17161.658
1.73448,15883.448
1.86791,15779.295
2.00133,14433.864
2.13475,12866.765
2.26817,12373.314
2.40159,12682.446
2.53502,12628.588
2.66844,12163.414
