0.0000	14949.1719
0.1334	16072.8389
0.2668	21194.1484
0.4003	25597.4238
0.5337	24899.4082
0.6671	20790.0566
0.8005	17872.1855
0.9340	16208.6816
1.0674	16317.8164
1.2008	16668.9980
1.3342	15338.9834
1.4676	15765.8408
1.6011	15598.3545
1.7345	15770.2793
1.8679	14696.0869
2.0013	14968.9297
2.1347	14113.3359
2.2682	13039.3652
2.4016	12921.5449
