x	Y_20180514_15100b_12_15g	Y_20180514_15100b_14_10g	Y_20180514_15100b_18_8g	Y_20180514_15100b_22_7g	Y_20180514_15100b_25_1g
0	11794.7002	12462.0068	14518.5303	13042.7705	11575.0762
0.1334	13159.2412	13399.3057	16155.2891	15218.4297	13881.4688
0.2668	14632.3613	17656.793	19986.7871	19560.2598	18739.4766
0.4003	17394.3652	22077.4902	24531.5859	26524.7227	25581.4473
0.5337	22100.5527	24903.6172	23726.1602	26104.0254	26917.457
0.6671	22307.3105	23008.5117	21626.3945	21100.2207	22061.3633
0.8005	20408.8359	21311.0938	19859.1133	18296.8848	18431.4629
0.934	19529.4785	20966.5645	21428.0664	16178.5684	16716.3184
1.0674	18917.0664	18994.5352	22240.4629	15583.749	16907.9434
1.2008	19848.8086	18331.7617	21789.3594	16673.8789	17248.1543
1.3342	17912.0742	18198.4023	20581.0273	16362.6416	18276.9238
1.4676	19230.707	18076.7559	18547.252	17061.2402	17850.1426
1.6011	19144.7148	17970.9316	18169.3809	16700.4141	16703.0059
1.7345	18834.4004	17781.2754	17923.1094	16161.4326	15551.5615
1.8679	17299.5938	17456.3711	18191.332	16132.999	14009.6846
2.0013	17009.7891	17293.6738	18153.3926	15297.1055	14389.4023
2.1347	17125.9902	16209.5049	17870.5352	15637.6338	14470.0371
2.2682	17876.0547	16017.2266	17374.7949	15586.6865	15019.7754
2.4016	16903.4082	17695.1836	18398.4336	16089.3281	15054.5381
2.535	17309.0215	17033.4375	18230.2637	18576.25	15135.627
2.6684	17284.4512	15489.8604	18937.1621	19998.0059	16129.4238
2.8019	17645.5039	14065.1768	20291.3672	20013.3379	16055.2764
2.9353	18162.3984	13780.5234	19533.6836	19074.5352	15626.9258
3.0687	19854.793	13505.1504	20261.4688	17951.625	16538.6719
3.2021	20917.8809	13905.3633	20385.3809	17884.5371	16977.1797
3.3355	21713.2344	13575.3652	18846.2129	18465.8555	16433.5059
3.469	19017.2227	13279.1289	17611.4805	16631.4277	15575.0947
3.6024	15319.8467	13602.7764	15840.6895	15933.0596	14727.627
3.7358	14994.9668	13387.9531	16251.7402	15111.9873	14547.6094
3.8692	16176.2178	13748.4033	16493.334	15563.4834	14662.249
4.0027	14907.6387	13466.71	16430.2383	14972.5381	14862.7617
4.1361	14743.3262	12243.6064	15718.4922	14769.0225	14570.8496
4.2695	14078.9551	12998.8984	16124.124	14676.6826	14040.165
4.4029	14327.9795	13987.2646	16397.3457	NaN	13808.0068
4.5363	14606.1904	14113.0957	16615.7715	NaN	14380.9072
4.6698	NaN	NaN	NaN	NaN	13661.0713
4.8032	NaN	NaN	NaN	NaN	14312.002
4.9366	NaN	NaN	NaN	NaN	13800.3584
5.07	NaN	NaN	NaN	NaN	13151.877
