0.00000,38273.500
0.13342,39405.336
0.26684,38960.082
0.40027,40238.422
0.53369,39155.812
0.66711,37608.488
0.80053,36656.086
0.93395,38705.512
1.06737,39068.762
1.20080,41058.816
1.33422,39848.312
1.46764,39958.180
1.60106,42121.496
1.73448,46644.723
1.86791,57210.262
2.00133,81067.516
2.13475,88400.203
2.26817,65343.473
2.40159,51148.641
2.53502,44229.645
2.66844,40123.016
