0.00000,38849.898
0.13342,41221.965
0.26684,40123.750
0.40027,38892.715
0.53369,38810.902
0.66711,39715.195
0.80053,38523.711
0.93395,38259.953
1.06737,37677.586
1.20080,37378.500
1.33422,36665.578
1.46764,38407.879
1.60106,38348.129
1.73448,41505.480
1.86791,40655.746
2.00133,42974.312
2.13475,46048.723
2.26817,64607.734
2.40159,93811.312
2.53502,132958.875
2.66844,119012.820
2.80186,77603.070
2.93528,55273.391
3.06870,46385.895
3.20212,43985.605
