x	Y_20180130_15109_10_11g	Y_20180130_15109_10_12g	Y_20180130_15109_10_8g	Y_20180130_15109_11_3g	Y_20180130_15109_11_8g	Y_20180130_15109_2_5g	Y_20180130_15109_3_12g	Y_20180130_15109_4_10g	Y_20180130_15109_4_3g	Y_20180130_15109_5_7g	Y_20180130_15109_7_3g	Y_20180130_15109_9_9g
0	34760.941	36135.273	34097.668	38389.738	34884.723	34332.844	32449.367	37495.699	33031.957	30668.48	37149.043	36236.168
0.1334	34014.59	35615.836	33210.238	37495.762	38337.086	34482.48	32233.861	36792.977	33504.965	31242.254	37280.727	35478.723
0.2668	34214.043	35035.848	35412.926	37221.512	37005.246	33815.086	31444.959	37106.438	33347.754	32220.008	37443.969	35192.656
0.4003	34610.367	35360.508	37694.773	39007.875	35632.113	34718.789	32026.328	38865.234	33150.086	32860.785	38924.535	34694.402
0.5337	34545.996	34301.75	35167.707	37379.484	35542.262	35676.277	32314.793	38364.551	33630.023	31268.279	38720.824	34311.289
0.6671	34228.18	35626.059	36495.109	37609.742	37385.148	33958.25	32425.479	38529.301	34010.5	31949.262	38131.875	34935.27
0.8005	34309.305	34933.82	34996.227	38416.734	35531.902	35879.383	32765.057	39333.516	32628.008	30884.123	37281.504	34682.895
0.934	33611.777	35696.027	34838.527	38217.223	34976.301	36098.215	33087.32	39226.789	33505.918	31490.732	36280.57	35295.348
1.0674	36053.332	34884.711	34952.426	38129.57	37126.816	34478.902	34010.406	40111.207	32864.281	31723.105	38324.961	34865.008
1.2008	34912.648	34766.992	34229.051	39110.719	37598.328	35249.504	33713.395	39160.32	33097.82	32920.711	36747.898	35548.625
1.3342	35808.672	35030.844	34215.004	38676.051	37865.883	34966.523	34442.883	40606.871	35562.457	33103.023	37091.551	34560.238
1.4676	35380.309	36042.125	34992.93	39898.875	37770.637	36435.918	34361.406	40977.504	36256.766	33687.609	36419.426	37269.566
1.6011	35611.086	40098.746	36722.238	39863.477	39754.258	33947.828	37299.797	44358.828	41581.34	33491.465	35578.684	39004.348
1.7345	40826.172	47252.801	40760.121	39933.949	43043.133	34760.965	46317.086	48519.48	45977.578	35448.266	36920.848	44030.324
1.8679	52605.516	66511.422	46075.562	43518.812	55893.574	35680.055	62703.789	64358.062	65891.586	37465.168	39905.391	55941.168
2.0013	75459.742	91934.078	64788.559	51218.867	84872.406	37355.715	82439.742	103367.25	105196.305	43643.535	43138.16	79395.836
2.1348	96514.383	94597.461	102551.773	66928.883	96313.555	43765.523	102827.102	147363.125	142604.406	59552.703	51916.645	99282.602
2.2682	82388.031	69135.609	126274.258	109944.969	76993.328	60418.656	133727.656	137561.5	124703.344	77008.891	71545.297	81473.164
2.4016	56674.633	49981.242	94614.969	147671.312	55339.559	78487.859	139429.922	101561.781	78056.266	72289.141	81247.75	57117.605
2.535	43706.078	44856.297	61409.535	126759.984	44310.969	75474.922	99302.367	81676.023	52047.727	53052.465	71732.586	44354.98
2.6684	NaN	NaN	46484.594	81655.531	39041.926	56431.613	63803.578	63069.398	NaN	43022.461	58262.047	NaN
2.8019	NaN	NaN	NaN	59356.574	NaN	43839.953	47070.715	49128.148	NaN	38287.77	52610.66	NaN
2.9353	NaN	NaN	NaN	48934.531	NaN	38344.707	NaN	NaN	NaN	NaN	44974.871	NaN
3.0687	NaN	NaN	NaN	43647.422	NaN	37451.398	NaN	NaN	NaN	NaN	NaN	NaN
3.2021	NaN	NaN	NaN	NaN	NaN	NaN	NaN	NaN	NaN	NaN	NaN	NaN
3.3356	NaN	NaN	NaN	NaN	NaN	NaN	NaN	NaN	NaN	NaN	NaN	NaN
3.469	NaN	NaN	NaN	NaN	NaN	NaN	NaN	NaN	NaN	NaN	NaN	NaN
3.6024	NaN	NaN	NaN	NaN	NaN	NaN	NaN	NaN	NaN	NaN	NaN	NaN
3.7358	NaN	NaN	NaN	NaN	NaN	NaN	NaN	NaN	NaN	NaN	NaN	NaN
3.8692	NaN	NaN	NaN	NaN	NaN	NaN	NaN	NaN	NaN	NaN	NaN	NaN
4.0027	NaN	NaN	NaN	NaN	NaN	NaN	NaN	NaN	NaN	NaN	NaN	NaN
4.1361	NaN	NaN	NaN	NaN	NaN	NaN	NaN	NaN	NaN	NaN	NaN	NaN
4.2695	NaN	NaN	NaN	NaN	NaN	NaN	NaN	NaN	NaN	NaN	NaN	NaN
4.4029	NaN	NaN	NaN	NaN	NaN	NaN	NaN	NaN	NaN	NaN	NaN	NaN
4.5363	NaN	NaN	NaN	NaN	NaN	NaN	NaN	NaN	NaN	NaN	NaN	NaN
