x	Y_20180514_15325_11_1g	Y_20180514_15325_12_6g	Y_20180514_15325_14_1g	Y_20180514_15325_17_8g	Y_20180514_15325_18_4g	Y_20180514_15325_19_9g	Y_20180514_15325_2_5g	Y_20180514_15325_21_2g	Y_20180514_15325_3_7g	Y_20180514_15325_9_8g
0	29416.6543	32227.0996	33593.1523	34279.9336	34918.1367	33273.7578	32924.0742	31650.5879	34992.5977	34241.9062
0.1334	29614.2578	32728.9102	33451.1445	35842.4297	35011.2617	32281.8457	32613.5371	31469.752	34643.375	31424.2656
0.2668	30353.9922	32751.4707	33139.1445	35738.5781	35327.5586	31977.2266	33884.3008	31761.2227	34301.5	31927.3535
0.4003	29701.5879	33203.6094	33573.1445	35803.3164	35332.9688	33639.1328	33699.9688	31265.0957	33957.457	31402.1934
0.5337	32600.248	32711.6621	32837.9375	35290.8438	34416.3008	32042.7305	33008.582	34218.125	33823.1211	31967.3926
0.6671	30153.6309	32924.957	34014.1992	34708.1133	33200.6562	31754.918	33062.3516	32860	32994.5	31323.4316
0.8005	29937.6445	33515.7812	33094.9453	36199.6875	32771.793	32923.4688	33950.6406	33524.0273	33242.418	31512.7754
0.934	29543.8906	33405.8125	32934.5	35333.0625	33229.5156	32201.791	31987.8184	33239.9922	34330.7383	32208.0898
1.0674	30500.8965	35002.5273	32764.6738	36433.2344	33619.2188	32730.1172	32618.1074	34382.6797	32629.6523	33037.3203
1.2008	28639.4258	32694.0645	32063.1016	33623.1953	32296.0762	33624.4922	32035.7031	34749.9219	32281.9434	31252.9883
1.3342	31116.5879	33459.2227	31598.1992	35885.7969	33742.2695	34338.707	32835.0391	34513.5	33550.3711	31310.0859
1.4676	30453.75	33176.9062	32232.5137	34267.6797	32862.9023	34325.1406	33608.6953	34290.4844	32936.6133	29873.9062
1.6011	29756.4551	31659.6543	32810.3828	34483.8906	33287.9688	33578.7734	33204.9141	34176.8633	31807.6172	32786.1289
1.7345	30313.2266	35131.1367	32824.0977	35331.2383	32362.8535	36163.875	33618.0586	36456.6484	32689.5391	29345.541
1.8679	31091.3203	34305.457	34398.8711	34564.3438	32880.3555	40765.4766	37590.4961	40034.0703	34254.2422	31531.4883
2.0013	34567.0977	35745.1953	34391.5195	33923.3672	34867.9453	50391.9219	44348.9531	40319.7734	34772.8438	32913.8125
2.1347	41409.6211	38293.4844	42019.5547	33607.0938	35503.5625	74118.9062	65520.2031	47444.2773	37309.2812	38500.6641
2.2682	58192.5703	47066.543	59253.875	36304.2188	39713.5703	119462.5391	98688.5	64837.1289	44658.9883	51543.3398
2.4016	77695.2734	66499.5859	95974.7031	38928.832	49836.5156	155498.75	116871.5	107065.9922	67162.4531	75967.125
2.535	72057.7734	100404.7812	116463.3828	48171.5	68870.4375	131863.1719	88087.8984	135150.4844	108914.8125	91143.6562
2.6684	52263.7578	103407.5078	92326.7578	52958.1719	78661.9688	77885.6016	58567.2188	100436.4297	145880.375	66696.2969
2.8019	40080.5195	73794.1953	57516.7266	46894.6914	61876.8945	47805.4102	46206.7969	65233.6445	124681.7656	44762.3867
2.9353	NaN	51732.625	43712.7031	39758.6836	46381.7539	38066.0977	38309.5273	49631.0195	80280.8828	37903.3242
3.0687	NaN	43182.7852	36958.9805	36091.4805	39762.9961	35746.3125	36689.4297	42005.9961	53877.6875	34854.7422
3.2021	NaN	38920.5234	34174.5703	35247.1992	35759.9688	NaN	34290.6719	42299.832	42764.1406	NaN
3.3355	NaN	NaN	NaN	NaN	35421.9883	NaN	33887.2305	38573.332	NaN	NaN
3.469	NaN	NaN	NaN	NaN	35060.6797	NaN	34025.8789	NaN	NaN	NaN
3.6024	NaN	NaN	NaN	NaN	NaN	NaN	NaN	NaN	NaN	NaN
3.7358	NaN	NaN	NaN	NaN	NaN	NaN	NaN	NaN	NaN	NaN
3.8692	NaN	NaN	NaN	NaN	NaN	NaN	NaN	NaN	NaN	NaN
4.0027	NaN	NaN	NaN	NaN	NaN	NaN	NaN	NaN	NaN	NaN
4.1361	NaN	NaN	NaN	NaN	NaN	NaN	NaN	NaN	NaN	NaN
4.2695	NaN	NaN	NaN	NaN	NaN	NaN	NaN	NaN	NaN	NaN
4.4029	NaN	NaN	NaN	NaN	NaN	NaN	NaN	NaN	NaN	NaN
4.5363	NaN	NaN	NaN	NaN	NaN	NaN	NaN	NaN	NaN	NaN
4.6698	NaN	NaN	NaN	NaN	NaN	NaN	NaN	NaN	NaN	NaN
4.8032	NaN	NaN	NaN	NaN	NaN	NaN	NaN	NaN	NaN	NaN
4.9366	NaN	NaN	NaN	NaN	NaN	NaN	NaN	NaN	NaN	NaN
5.07	NaN	NaN	NaN	NaN	NaN	NaN	NaN	NaN	NaN	NaN
5.2035	NaN	NaN	NaN	NaN	NaN	NaN	NaN	NaN	NaN	NaN
5.3369	NaN	NaN	NaN	NaN	NaN	NaN	NaN	NaN	NaN	NaN
5.4703	NaN	NaN	NaN	NaN	NaN	NaN	NaN	NaN	NaN	NaN
5.6037	NaN	NaN	NaN	NaN	NaN	NaN	NaN	NaN	NaN	NaN
5.7371	NaN	NaN	NaN	NaN	NaN	NaN	NaN	NaN	NaN	NaN
5.8706	NaN	NaN	NaN	NaN	NaN	NaN	NaN	NaN	NaN	NaN
