x	Y_20180514_15325_15_2g	Y_20180514_15325_16_8g	Y_20180514_15325_2_2g	Y_20180514_15325_2_4g	Y_20180514_15325_20_5g	Y_20180514_15325_24_3g	Y_20180514_15325_26_6g	Y_20180514_15325_26_8g	Y_20180514_15325_3_3g	Y_20180514_15325_30_5g	Y_20180514_15325_5_13g	Y_20180514_15325_6_6g	Y_20180514_15325_9_3g
0	32664.498	32654.3242	29470.4844	33766.625	34958.2383	32946.8672	36221.207	28039.1387	35294.5039	33432.7422	29451.0352	32077.6719	36465.7734
0.1334	31393.5332	32123.1309	28584.2559	33632.9297	35474.1641	32862.5391	34444.125	29967.6934	35854.1289	33534.582	30460.7266	32377.8066	36041.6562
0.2668	32072.3633	32868.625	28940.8906	35823.1094	34982.75	33542.0273	34762.3242	29163.4336	35355.8828	34408.8516	31578.2324	32388.3594	36177.1719
0.4003	32625.125	35025.9766	29699.5234	34274.3398	34932.8438	33373.7578	33970.0898	29044.5391	36450.3242	34559.7031	31181.5664	33327.3047	36539.4453
0.5337	33930.0625	34005.2578	29692.5273	34442.6953	35428.2344	33638.0117	32752.1387	28627.5723	36004.4062	32774.875	31435.8691	34037.0859	39675.6953
0.6671	34551.0156	32622.252	28153.8457	33756.8477	36701.6562	33390.4336	32957.5508	28712.5254	36303.8477	32548.998	31452.166	33454.375	40679.8672
0.8005	32960.6094	32477.5781	29538.2246	34878.4414	37870.1055	32904.668	31937.3906	28547.8691	35664.7852	32644.7461	32130.1836	34257.4844	39981.9648
0.934	33914.3945	31840.1309	30673.4043	33182.4844	36315.9453	32724.3496	32915.3867	29049.873	36721.75	32362.1172	31833.4512	32677.4395	39965.4453
1.0674	34145.7656	32938.5352	31633.4062	31949.6523	36618.2578	33589.4609	32818.4531	29422.4668	37417.6914	33102.3633	31732.1914	33850.0977	39196.4922
1.2008	33964.4375	34295.7734	35087.6641	30775.9531	41676.6562	33331.4766	31519.2344	31496.4492	37989.0898	32460.2422	33523.9766	33739.4961	38279.3477
1.3342	35986.3281	38410.168	39641.8164	34203.6445	46713.4883	36329.9531	32616.7168	33242.2578	37361.5742	33561.8203	33998.832	37448	38288.0234
1.4676	40672.1211	46625.3125	52171.5977	37721.9922	61002.4062	40352.625	35532.3906	37565.9492	39274.5039	34308.6875	34747.8398	39690.582	42322.2227
1.6011	50104.0391	60141.668	72698.0781	45244.8086	101297.0469	49152.3633	40091.5742	56663.1719	39102.2148	36037.3203	37419.5977	44153.0938	52559.9102
1.7345	77840.9141	65277.3047	76086.0234	62487.8086	165137.9688	72714.5625	54454.2578	79508	50502.7812	38121.8477	45921.8242	63729.0039	78249.8984
1.8679	107796.4688	51240.7383	56485.4062	67300.2109	171091.3281	118107.9219	79714.9219	76366.7656	68173.4297	42780.5742	71595.9062	99751.2266	107984.4141
2.0013	101407.4297	38699.7031	42137.957	54223.3359	118685.6172	139320.5781	91215.4453	52691.2031	113954.7188	57480.5039	96496.0938	125503.2344	92697.5312
2.1347	68645.625	34329.7578	33738.6953	42210.7695	71215.2188	110303.7812	71340	36548.2109	163535.0781	79314.6797	88754.2891	98432.9922	64953.2031
2.2682	48161.7578	NaN	30893.2812	37516.2266	47064.9688	66442.3516	48377.7695	31763.877	162918	79347.8438	66901.9141	62010.8398	NaN
2.4016	NaN	NaN	30592.8691	34100.5273	39057.0781	48250	41092.8633	31727.0059	130424.2266	60877.418	49333.6133	44130.7188	NaN
2.535	NaN	NaN	NaN	34583.125	35303.2617	40856.9453	37327.6914	NaN	76927.7031	45688.2188	40341.5898	NaN	NaN
2.6684	NaN	NaN	NaN	36008.4375	35067.6445	NaN	37379.2148	NaN	58218.3594	NaN	34364.6172	NaN	NaN
2.8019	NaN	NaN	NaN	34550.4062	NaN	NaN	NaN	NaN	50082.8398	NaN	NaN	NaN	NaN
2.9353	NaN	NaN	NaN	NaN	NaN	NaN	NaN	NaN	45017.6719	NaN	NaN	NaN	NaN
3.0687	NaN	NaN	NaN	NaN	NaN	NaN	NaN	NaN	NaN	NaN	NaN	NaN	NaN
3.2021	NaN	NaN	NaN	NaN	NaN	NaN	NaN	NaN	NaN	NaN	NaN	NaN	NaN
3.3355	NaN	NaN	NaN	NaN	NaN	NaN	NaN	NaN	NaN	NaN	NaN	NaN	NaN
3.469	NaN	NaN	NaN	NaN	NaN	NaN	NaN	NaN	NaN	NaN	NaN	NaN	NaN
3.6024	NaN	NaN	NaN	NaN	NaN	NaN	NaN	NaN	NaN	NaN	NaN	NaN	NaN
3.7358	NaN	NaN	NaN	NaN	NaN	NaN	NaN	NaN	NaN	NaN	NaN	NaN	NaN
3.8692	NaN	NaN	NaN	NaN	NaN	NaN	NaN	NaN	NaN	NaN	NaN	NaN	NaN
4.0027	NaN	NaN	NaN	NaN	NaN	NaN	NaN	NaN	NaN	NaN	NaN	NaN	NaN
4.1361	NaN	NaN	NaN	NaN	NaN	NaN	NaN	NaN	NaN	NaN	NaN	NaN	NaN
4.2695	NaN	NaN	NaN	NaN	NaN	NaN	NaN	NaN	NaN	NaN	NaN	NaN	NaN
4.4029	NaN	NaN	NaN	NaN	NaN	NaN	NaN	NaN	NaN	NaN	NaN	NaN	NaN
4.5363	NaN	NaN	NaN	NaN	NaN	NaN	NaN	NaN	NaN	NaN	NaN	NaN	NaN
4.6698	NaN	NaN	NaN	NaN	NaN	NaN	NaN	NaN	NaN	NaN	NaN	NaN	NaN
4.8032	NaN	NaN	NaN	NaN	NaN	NaN	NaN	NaN	NaN	NaN	NaN	NaN	NaN
4.9366	NaN	NaN	NaN	NaN	NaN	NaN	NaN	NaN	NaN	NaN	NaN	NaN	NaN
5.07	NaN	NaN	NaN	NaN	NaN	NaN	NaN	NaN	NaN	NaN	NaN	NaN	NaN
5.2035	NaN	NaN	NaN	NaN	NaN	NaN	NaN	NaN	NaN	NaN	NaN	NaN	NaN
5.3369	NaN	NaN	NaN	NaN	NaN	NaN	NaN	NaN	NaN	NaN	NaN	NaN	NaN
5.4703	NaN	NaN	NaN	NaN	NaN	NaN	NaN	NaN	NaN	NaN	NaN	NaN	NaN
5.6037	NaN	NaN	NaN	NaN	NaN	NaN	NaN	NaN	NaN	NaN	NaN	NaN	NaN
5.7371	NaN	NaN	NaN	NaN	NaN	NaN	NaN	NaN	NaN	NaN	NaN	NaN	NaN
5.8706	NaN	NaN	NaN	NaN	NaN	NaN	NaN	NaN	NaN	NaN	NaN	NaN	NaN
