0.00000,11899.600
0.13342,12949.723
0.26684,16025.518
0.40027,16979.289
0.53369,20997.031
0.66711,20483.137
0.80053,18431.217
0.93395,19796.820
1.06737,21489.686
1.20080,19931.068
1.33422,18254.824
1.46764,18024.967
1.60106,17331.127
1.73448,16767.510
1.86791,15949.026
2.00133,15942.463
2.13475,15051.476
2.26817,14190.128
2.40159,13824.098
2.53502,14139.056
2.66844,14485.672
2.80186,13797.319
