X,Y
0.00000,36236.168
0.13342,35478.723
0.26684,35192.656
0.40027,34694.402
0.53369,34311.289
0.66711,34935.270
0.80053,34682.895
0.93395,35295.348
1.06737,34865.008
1.20080,35548.625
1.33422,34560.238
1.46764,37269.566
1.60106,39004.348
1.73448,44030.324
1.86791,55941.168
2.00133,79395.836
2.13475,99282.602
2.26817,81473.164
2.40159,57117.605
2.53502,44354.980
