0.0000	34964.6172
0.1334	33487.8281
0.2668	32117.9980
0.4003	33123.9258
0.5337	33856.8125
0.6671	33809.6211
0.8005	33014.8750
0.9340	33588.4805
1.0674	32991.5781
1.2008	33342.8438
1.3342	33823.2383
1.4676	35087.1445
1.6011	42039.0703
1.7345	58472.2852
1.8679	83343.2344
2.0013	100930.0078
2.1347	80846.5625
2.2682	54301.5508
2.4016	40799.2539
2.5350	37717.8438
2.6684	37036.3750
2.8019	38642.2227
2.9353	37624.5820
