X,Y
0.00000,13053.893
0.13342,14094.424
0.26684,16121.618
0.40027,19558.295
0.53369,21784.014
0.66711,22781.672
0.80053,24421.594
0.93395,22829.697
1.06737,21835.727
1.20080,20630.961
1.33422,19331.586
1.46764,18267.816
1.60106,16499.953
1.73448,15140.101
1.86791,13948.891
2.00133,13330.599
2.13475,12966.571
