0.00000,14072.686
0.13342,14734.727
0.26684,15346.018
0.40027,17497.996
0.53369,17791.746
0.66711,17331.771
0.80053,17471.574
0.93395,16364.210
1.06737,15021.893
1.20080,14123.137
1.33422,13652.526
1.46764,13903.879
1.60106,13061.994
