0.00000,11832.317
0.13342,13245.391
0.26684,15156.265
0.40027,18358.941
0.53369,21281.488
0.66711,21558.135
0.80053,22116.730
0.93395,21431.592
1.06737,21744.467
1.20080,23844.805
1.33422,23408.273
1.46764,22397.805
1.60106,20717.256
1.73448,20690.215
1.86791,19504.084
2.00133,17413.367
2.13475,15782.093
2.26817,15050.087
2.40159,14449.406
