x	Y_20180514_15338_c2_11_6g	Y_20180514_15338_c2_31_8g	Y_20180514_15338_c2_9_4g
0	32613.602	35789.633	32513.326
0.1334	32999.941	35581.902	33260.184
0.2668	32354.297	34749.488	33196.809
0.4003	31791.416	35033.75	32905.914
0.5337	33218.961	32802.605	30547.674
0.6671	33040.504	32375.014	32632.156
0.8005	34283.875	31899.154	32188.479
0.934	33100.551	32194.26	34541.617
1.0674	32824.617	32337.797	33299.836
1.2008	35588.219	32409.92	33116.191
1.3342	34141.074	33418.398	33558.164
1.4676	35598.199	32338.689	33284.234
1.6011	32971.277	31966.104	31976.031
1.7345	32894.656	31075.404	33318.652
1.8679	34432.188	32690.945	32684.475
2.0013	33446.168	33721.586	34435.215
2.1348	34461.031	31819.178	34643.051
2.2682	33168.703	32201.199	34429.434
2.4016	32420.641	33497.465	33541.773
2.535	33454.516	33483.062	36504.398
2.6684	32900.172	34688.586	37086.164
2.8019	33404.184	33370.707	43624.367
2.9353	34420.375	34884.531	54562.848
3.0687	37544.832	34522.203	56254.109
3.2021	38831.578	33613.68	46214.637
3.3356	47984.445	33774.164	38155.195
3.469	54159.652	33368.496	35040.484
3.6024	47323.992	33040.863	34326.316
3.7358	38709.602	34296.59	35236.762
3.8692	34125.508	34695.324	NaN
4.0027	34137.152	38925.371	NaN
4.1361	NaN	44964.836	NaN
4.2695	NaN	41387.105	NaN
4.4029	NaN	38125.883	NaN
4.5363	NaN	36514.281	NaN
4.6698	NaN	NaN	NaN
4.8032	NaN	NaN	NaN
4.9366	NaN	NaN	NaN
5.07	NaN	NaN	NaN
5.2035	NaN	NaN	NaN
