x	Y_20180514_15325_1_5g	Y_20180514_15325_10_5g	Y_20180514_15325_10_6g	Y_20180514_15325_11_1g	Y_20180514_15325_12_1g	Y_20180514_15325_12_2g	Y_20180514_15325_12_5g	Y_20180514_15325_12_6g	Y_20180514_15325_12_7g	Y_20180514_15325_14_1g	Y_20180514_15325_15_3g	Y_20180514_15325_16_3g	Y_20180514_15325_16_5g	Y_20180514_15325_16_6g	Y_20180514_15325_17_10g	Y_20180514_15325_17_1g	Y_20180514_15325_17_8g	Y_20180514_15325_18_1g	Y_20180514_15325_18_4g	Y_20180514_15325_19_9g	Y_20180514_15325_2_5g	Y_20180514_15325_20_2g	Y_20180514_15325_21_2g	Y_20180514_15325_22_5g	Y_20180514_15325_24_1g	Y_20180514_15325_24_2g	Y_20180514_15325_25_5g	Y_20180514_15325_25_6g	Y_20180514_15325_27_2g	Y_20180514_15325_27_7g	Y_20180514_15325_28_1g	Y_20180514_15325_28_3g	Y_20180514_15325_28_7g	Y_20180514_15325_29_3g	Y_20180514_15325_3_7g	Y_20180514_15325_31_3g	Y_20180514_15325_31_4g	Y_20180514_15325_4_3g	Y_20180514_15325_5_1g	Y_20180514_15325_5_2g	Y_20180514_15325_7_7g	Y_20180514_15325_8_3g	Y_20180514_15325_8_4g	Y_20180514_15325_9_8g
0	14047.7812	12124.627	12346.8926	13215.9951	13954.6191	12143.1836	13955.1855	11802.7559	13553.0439	12887.1113	13600.6465	13900.4785	12787.749	10718.4902	14007.2217	11486.0303	12943.3457	13516.54	14925.0117	13075.1504	13894.3223	12802.5996	12859.4873	12981.7139	13594.4121	14938.6777	13966.0654	14433.2324	11380.71	13533.8945	12417.7588	10484.6973	10718.2061	14879.6436	13832.7314	14949.2988	14684.3223	13942.6699	13103.4277	14281.9248	11696.9805	12995.4229	12049.9824	13226.6963
0.1334	15111.9014	13168.9727	14210.9922	13478.0859	15246.3447	12086.6582	14750.9619	11550.9971	14199.0605	13443.6768	13860.3799	14341.9248	13531.1934	11369.9053	15337.4141	11933.6602	13898.6758	13581.5801	14880.7256	14611.3623	16084.8818	13283.4922	13265.7852	14324.3555	14007.335	15527.4297	14218.166	15030.9902	11159.0391	14140.7285	13132.459	10648.9424	11074.3037	16334.5557	13888.5732	14820.1973	17349.0488	14846.4912	14463.959	15157.2041	12248.3398	16782.5586	13016.6494	13808.2822
0.2668	19195.6309	16376.2842	16209.9463	16414.7031	16749.6953	12970.8447	14786.8311	12251.9834	14442.1582	15041.1279	15476.5137	16066.4766	15467.8682	13090.832	19508.8086	13391.5225	14192.7568	15274.5957	14818.4717	17311.457	19202.752	13868.793	15047.1924	16724.8125	18160.0391	16899.0918	16557.8145	15966.6338	14023.9922	16529.4961	13946.0254	10191.7754	11231.374	19895.9492	14961.9277	15786.4609	23096.1719	17608.3555	16757.2598	17863.6094	15161.6973	23082.373	15241.5078	15454.29
0.4003	26253.3711	21578.6445	18725.2773	20446.625	21854.8594	14536.0371	16460.5547	13511.208	15451.4727	16958.1094	18769.8691	20269.2148	19043.6719	15754.9795	29212.8652	15743.0596	15672.1758	17737.9785	15818.9463	21084.334	23618.6895	14983.5488	19254.1445	23623.209	25980.832	18251.7266	18689.0547	16814.9805	21020.3262	19336.5488	19010.7598	13574.0225	12574.5088	25475.1738	15515.4492	17975.4082	27917.4141	26899.9668	24448.7148	25570.7695	19047.0801	26544.8184	20376.375	17519.5566
0.5337	30114.4766	23030.9395	23545.9277	22467.8438	33861.3672	17650.2324	17928.0449	17553.4609	16612.1348	25259.2168	24835.5332	28316.1621	20462.2266	20699.3027	39609.1484	20291.5352	16727.0059	18906.8613	16203.8369	24737.498	24257.9297	19435.8652	28161.6777	33033.6719	32672.3418	24212.4902	27411.9512	18546.5234	28403.2129	25202.5488	25330.1699	18219.6348	14136.4336	27578.916	17595.7305	23671.0156	24216.8223	38126.9766	29491.0215	34969.2305	27023.1133	24267.4805	28136.9355	23895.9238
0.6671	25578.6914	19330.4922	28587.4648	19694.6914	35273.5391	24208.6289	20828.6172	22741.7734	18550.9727	29649.0059	28655.0098	32020.25	19930.043	25634.8047	38471.1836	28346.4727	23051.293	18424.7617	19634.0293	22137.1543	20901.5879	24269.8301	29223.3477	39368.0469	26422.9531	32832.9023	41189.5547	25157.2773	26612.7969	31622.127	31058.2754	24424.5391	18578.5156	21729.8457	22049.9414	32522.8633	19621.4453	39081.3281	26575.0996	37644.0625	36322.5195	20770.0801	33180.9648	32355.2676
0.8005	22697.0625	16869.7891	27342.6602	16750.2695	29176.1719	31864.0449	27420.2578	26054.0469	22607.0723	27164.2617	24990.1172	28999.0059	17418.1777	26641.5488	28703.2812	31220.9668	25753.3027	17310.2305	22188.2734	19763.8926	19439.709	25021.041	28106.3594	32696.1133	19695.7656	33371.5312	47819.375	30042.7012	22751.5586	32266.2168	27587.9062	23114.834	24997.8691	20745.7969	28332.0137	36429.7266	15974.8184	32590.7188	20371.3164	31765.1836	34653.957	18161.2559	27798.9434	29916.4453
0.934	20398.7266	15489.2451	23084.3027	15311.7637	23221.0684	33496.6328	29207.8613	24268.2598	22328.9473	21863.4551	21098.0469	21343.3633	16924.666	23154.1562	23435.3945	28343.7656	22003.2383	16360.4678	19062.8242	17937.5312	18339.3203	20595.5078	24436.416	25082.916	16244.501	27073.8105	37635.5469	26483.5547	20152.0859	26174.2715	21121.9609	19800.2578	27706.1465	18753.709	27782.9492	30020.5449	14784.7285	28035.4473	17621.4688	25884.5332	27745.5469	17071.4531	22845.4668	25508.875
1.0674	20097.9629	13668.3809	20022.0391	15070.8291	21171.1543	29619.2734	27229.2773	21545.3418	19148.4707	18515.3359	16308.7021	16622.8105	17186.0781	20586.5742	20527.6582	22619.2559	20626.6738	15331.333	16774.2832	16663.9375	18261.7656	17902.1074	22310.5703	19638.0938	14095.459	23472.7969	27039.3359	22996.8008	18908.3594	23454.2363	18463.1699	18619.3555	26246.0898	16816.2188	24144.1465	24697.7676	13541.0176	25484.4297	17620.5254	22401.6094	22413.5859	17830.5352	21741.1934	23843.3867
1.2008	18842.8965	13019.3154	17828.3379	14281.2607	22021.1016	24930.9355	23769.6113	18939.5664	18657.2324	16817.8301	15170.2363	14822.8682	18594.9766	18916.6484	18542.1836	20029.3457	18321.7109	14690.8008	15592.1768	16173.3721	16953.9297	16674.5039	21581.8379	16451.4961	13141.8916	20975.6133	21573.3711	19405.9375	17854.0684	20748.5449	17368.1562	18436.9785	22676.6211	15075.1572	19954.8516	23530.9414	13315.5703	23971.1348	17836.2754	19965.7461	19469.2812	17049.8828	19848.5918	20679.6348
1.3342	19271.2734	13258.6953	17886.2949	14962.1973	21475.3828	21125.8359	23801.0957	17970.2051	19638.75	15492.2764	15623.9854	14342.2148	17169.7969	18103.9141	16761.7227	19816.2246	17608.5586	13591.1104	14553.7412	15413.5547	15525.8701	14975.6445	21786.3945	16706.9297	13769.4414	19361.084	20274.1738	18862.0664	17441.8984	17846.9941	17443.5039	18180.8145	21020.7129	13812.7861	17241.2324	21978.2695	13842.1953	23896.0449	17632.6602	19554.6973	19800.1738	18123.0918	18307.9961	20788.3223
1.4676	19962.6289	14565.9502	17347.5449	14842.9922	18664.9219	20586.4824	21311.8633	16971.8516	23349.375	14789.7109	14893.626	14673.9873	18002.2207	18768.0469	15725.8369	17518.0801	18669.8672	14556.9736	14366.6689	16721.1484	14898.3086	14901.2021	21226.6875	16792.7891	13568.0693	18530.2422	17432.4434	17764.1523	18129.5742	17420.6914	16087	16765.7031	21010.8086	13513.9346	17249.0762	21017.0391	13876.917	22797.6543	17015.5898	17102.1387	19976.9629	18562.2188	16762.8555	18499.6758
1.6011	17401.3965	13729.9141	16499.1348	16059.4014	18814.9121	20121.6445	20761.5547	16742.0957	23707.8926	14365.1299	13596.1084	15884.3545	18516.7539	18228.791	15061.2783	16051.2539	17192.4961	14180.4053	14394.8926	15568.0234	15572.4824	15505.8662	21651.6055	15962.6143	14089.5049	19204.5781	16460.707	16817.1289	17214.7109	17799.8125	15488.9014	15307.9307	20762.4512	14026.9062	16606.9961	22208.2227	13766.3389	21343.1133	15303.6777	15708.6289	20073.9902	19805.9297	15532.9648	17107.4395
1.7345	16438.6172	13831.2529	16570.875	16124.3584	17915.416	19302.7773	19770.7422	17378.3848	20190.2637	14830.166	14122.2949	15522.957	19201.0352	18675.8477	14984.0078	15764.2803	15547.874	14504.0049	14291.293	15967.873	14627.8779	18116.4844	22984.6621	14925.5449	14907.2354	19159.8711	16995.0898	16223.7891	16860.625	16739.6719	14471.8633	13383.6221	20493.0938	14385.2441	16104.873	23013.3535	13098.8691	19555.4395	15700.0547	16159.2451	19637.459	19645.4844	15173.1973	16368.6104
1.8679	16041.6816	14425.4561	16884.3223	15533.3057	18527.2461	17842.2832	19040	18023.084	18624.5215	14080.7305	14269.6865	14802.9893	17577.9336	17602.8848	13989.0762	15214.5127	16337.5273	14460.0977	14537.5498	16629.4492	14962.1973	17554.9648	22132.1367	13592.96	14960.3496	19378.4395	17261.0664	17675.6465	17203.5176	16122.7148	12972.1113	13546.1191	18951.6055	14635.5898	17030.3594	23169.375	13903.4912	16073.0215	15406.7939	15372.4561	18765.6543	19910	14239.501	16842.1172
2.0013	15271.1523	16523.2461	18317.2969	15483.0469	17346.543	18091.2402	17922.5234	15660.9883	17227.9688	13286.6172	14675.9473	14167.376	16618.1699	15931.1924	13598.3096	14887.9688	16715.2207	14178.3037	14904.1729	17124.9785	14332.5215	18129.3965	21019.8516	13234.5918	15072.2197	19048.4258	17724.4258	19204.5605	16856.6387	15384.9834	13365.1953	14282.6943	18353.3145	14593.1123	16778.3223	23386.9199	14226.1035	17192.5508	15140.9004	15355.9668	17619.3477	19508.0566	14487.8145	16062.2334
2.1347	15111.5146	15783.9219	19371.123	14836.4287	17540.8281	18463.416	16239.5986	14477.4717	15751.4453	13636.4805	15168.3506	15175.0371	16468.668	15321.7568	12121.1357	13923.8848	15647.3926	14679.0801	15515.4805	16342.5098	14927.915	17052.3066	18908.5352	14045.4346	15308.4834	17120.5547	17119.4238	20132.3301	17565.5195	16231.376	13508.1299	14488.2256	17234.8828	15542.7568	16927.0059	20898.8379	13301.2949	19099.4297	15164.9375	14577.3193	16845.8125	19395.5117	14801.4756	16032.8408
2.2682	14939.8896	14786.6807	17485.3184	14651.8945	17439.2129	18294.8594	14731.1953	13454.9004	14552.7236	12948.2607	15816.6924	15881.1592	15849.5928	15117.2451	12662.7012	12816.3828	15015.8789	15803.0156	14292.0195	15638.9414	14827.8027	17688.7578	17904.918	14595.292	15660.8633	15187.3389	17894.0586	19596.082	17405.834	16156.6367	13230.9932	14597.6357	16368.9502	15940.4238	19633.2539	20751.9434	13521.6768	20072.5039	14475.7832	16924.2344	16305.2246	18097.8926	15976.9082	16672.7734
2.4016	13938.6992	14447.5068	16060.7188	14229.1572	17783.8066	17852.9395	14524.8066	12718.5811	14034.5391	12636.0527	16245.0898	15934.8564	13954.2285	15041.4619	13021.6855	12732.2188	14831.499	15793.0117	14369.3477	15925.9043	15062.4092	19003.6035	16291.3018	14944.9824	16318.2832	14004.4072	16690.4961	18627.7812	18306.418	14715.7471	13699.5879	14649.2559	17038.4023	16451.2969	19562.2266	19882.873	14058.2539	19050.3105	13883.2256	18472.1309	16511.7578	15792.4014	17206.1758	17318.293
2.535	13760.3701	14009.2979	15148.0234	13343.1172	19907.9785	18067.4531	13905.0039	12442.7451	13621.5098	13245.252	16966.1523	15292.043	14399.1211	16694.2109	14183.418	13017.1133	14147.5205	14074.6719	14457.6309	15509.8906	14461.8447	19222.6562	14206.1484	14582.6992	15691.9189	13591.0498	17387.9727	18748.2988	17787.3242	14474.1191	14237.0576	14513.0205	17364.2988	17032.6836	17348.707	19116.9824	13415.498	17357.9961	13269.1328	17873.3516	15490.5703	14469.6152	18257.2344	16955.5469
2.6684	13979.2021	14295.2695	14084.7402	13318.3652	21271.0762	17260.5098	13196.4355	12477.333	14369.0811	13399.6934	17737.5059	15493.0078	15286.459	17317.1797	15697.9648	13812.2852	12684.3574	13709.0488	15132.208	15011.5811	14873.1191	20043.4473	13047.0635	15378.2695	15896.4727	14073.7588	18042.1758	17162.3848	16958.2188	14138.0361	13081.7422	13528.4902	15919.8379	17367.8262	16272.3271	18663.5742	13363.1982	16917.6758	13835.4775	15898.5947	15597.1221	13992.3203	17703.2461	14130.3057
2.8019	13957.9736	14041.7178	12877.0947	13209.6084	22434.7344	15693.3701	13747.4736	12213.0566	15864.9756	13721.7998	16157.2656	14850.0938	14395.6016	15851.1562	15913.0908	13673.9805	12659.0127	12863.9854	15373.0732	14974.2783	14777.834	22813.709	12783.4902	16963.4551	14443.5381	13466.8984	17915.4727	19055.1641	15455.4668	14137.0371	12901.5303	12469.2695	14468.4141	15929.8252	15656.8232	18736.0625	13772.5566	15931.1963	14407.4248	13778.8496	15885.917	12979.0908	17956.418	13847.5059
2.9353	14368.9785	13881.5947	12760.457	NaN	21175.916	15043.7334	13659.2061	12647.2432	15893.6436	13747.6631	15654.832	13805.6621	13630.4961	13933.7656	15125.6729	13656.7842	12887.7998	12749.5986	16114.7637	15000.6289	14370.2061	23334.9199	13018.3721	17915.8789	14053.8701	15254.8604	17006.6387	19208.7988	14588.6396	13333.1934	11915.4648	12110.8223	13987.585	15491.7939	15090.707	17750.3008	13558.7158	15775.8564	13822.9023	13500.6494	14850.0996	NaN	18134.375	14029.6758
3.0687	NaN	12954.4365	12729.2832	NaN	17913.168	14586.7031	13556.4648	12305.3301	NaN	13647.083	NaN	13945.9258	14044.9414	13368.6104	15599.8232	13507.7725	13429.4551	13025.5879	16909.8945	14728.584	14088.4648	20301.8125	13461.4551	19350.6992	13783.2715	15861.3789	17046.9961	20248.791	13874.2275	12978.8662	12286.0488	12366.2373	13389.0791	NaN	15129.5645	16746.0176	12566.9648	15842.9268	13890.8975	13105.0312	15420.0439	NaN	NaN	13895.9375
3.2021	NaN	14507.6162	13171.4053	NaN	15418.9971	14185.7314	12589.0635	11974.4043	NaN	13471.499	NaN	14031.4521	13353.5303	12785.292	NaN	12709.7217	13576.8643	NaN	15356.7988	NaN	14363.4268	16897.7871	12195.5186	NaN	12932.8232	16283.2656	17898.084	20809.8828	13299.2998	12536.8174	12229.6426	NaN	13143.6729	NaN	14608.3701	14667.5117	12611.5117	15132.5801	NaN	12305.083	15567.1631	NaN	NaN	NaN
3.3355	NaN	14491.375	NaN	NaN	14247.8975	13375.0371	12587.0801	NaN	NaN	NaN	NaN	13954.0449	NaN	14090.7939	NaN	NaN	NaN	NaN	15949.6904	NaN	13599.0635	14574.8828	12247.6367	NaN	12623.1504	16327.6338	NaN	19891.3672	NaN	12510.2861	12328.7744	NaN	13207.8828	NaN	NaN	14313.8047	13616.8184	14214.3408	NaN	9237.1348	NaN	NaN	NaN	NaN
3.469	NaN	13827.3506	NaN	NaN	14204.8584	13322.4424	11987.3789	NaN	NaN	NaN	NaN	NaN	NaN	13976.0635	NaN	NaN	NaN	NaN	14489.0752	NaN	13340.2021	12871.2803	NaN	NaN	12228.4316	17494.1777	NaN	16991.0586	NaN	12671.3984	12166.2588	NaN	12786.0391	NaN	NaN	14787.0811	NaN	13940.8936	NaN	NaN	NaN	NaN	NaN	NaN
3.6024	NaN	13317.249	NaN	NaN	NaN	12673.3926	12461.7119	NaN	NaN	NaN	NaN	NaN	NaN	12342.0752	NaN	NaN	NaN	NaN	NaN	NaN	NaN	12934.1738	NaN	NaN	11938.5205	NaN	NaN	NaN	NaN	NaN	NaN	NaN	13175.957	NaN	NaN	14887.0527	NaN	14419.1641	NaN	NaN	NaN	NaN	NaN	NaN
3.7358	NaN	NaN	NaN	NaN	NaN	12941.1465	12423.9873	NaN	NaN	NaN	NaN	NaN	NaN	NaN	NaN	NaN	NaN	NaN	NaN	NaN	NaN	12661.9072	NaN	NaN	11890.7803	NaN	NaN	NaN	NaN	NaN	NaN	NaN	12652.3076	NaN	NaN	NaN	NaN	NaN	NaN	NaN	NaN	NaN	NaN	NaN
3.8692	NaN	NaN	NaN	NaN	NaN	NaN	12480.834	NaN	NaN	NaN	NaN	NaN	NaN	NaN	NaN	NaN	NaN	NaN	NaN	NaN	NaN	NaN	NaN	NaN	11129.8896	NaN	NaN	NaN	NaN	NaN	NaN	NaN	13478.8389	NaN	NaN	NaN	NaN	NaN	NaN	NaN	NaN	NaN	NaN	NaN
4.0027	NaN	NaN	NaN	NaN	NaN	NaN	NaN	NaN	NaN	NaN	NaN	NaN	NaN	NaN	NaN	NaN	NaN	NaN	NaN	NaN	NaN	NaN	NaN	NaN	NaN	NaN	NaN	NaN	NaN	NaN	NaN	NaN	13521.6768	NaN	NaN	NaN	NaN	NaN	NaN	NaN	NaN	NaN	NaN	NaN
4.1361	NaN	NaN	NaN	NaN	NaN	NaN	NaN	NaN	NaN	NaN	NaN	NaN	NaN	NaN	NaN	NaN	NaN	NaN	NaN	NaN	NaN	NaN	NaN	NaN	NaN	NaN	NaN	NaN	NaN	NaN	NaN	NaN	NaN	NaN	NaN	NaN	NaN	NaN	NaN	NaN	NaN	NaN	NaN	NaN
4.2695	NaN	NaN	NaN	NaN	NaN	NaN	NaN	NaN	NaN	NaN	NaN	NaN	NaN	NaN	NaN	NaN	NaN	NaN	NaN	NaN	NaN	NaN	NaN	NaN	NaN	NaN	NaN	NaN	NaN	NaN	NaN	NaN	NaN	NaN	NaN	NaN	NaN	NaN	NaN	NaN	NaN	NaN	NaN	NaN
4.4029	NaN	NaN	NaN	NaN	NaN	NaN	NaN	NaN	NaN	NaN	NaN	NaN	NaN	NaN	NaN	NaN	NaN	NaN	NaN	NaN	NaN	NaN	NaN	NaN	NaN	NaN	NaN	NaN	NaN	NaN	NaN	NaN	NaN	NaN	NaN	NaN	NaN	NaN	NaN	NaN	NaN	NaN	NaN	NaN
4.5363	NaN	NaN	NaN	NaN	NaN	NaN	NaN	NaN	NaN	NaN	NaN	NaN	NaN	NaN	NaN	NaN	NaN	NaN	NaN	NaN	NaN	NaN	NaN	NaN	NaN	NaN	NaN	NaN	NaN	NaN	NaN	NaN	NaN	NaN	NaN	NaN	NaN	NaN	NaN	NaN	NaN	NaN	NaN	NaN
4.6698	NaN	NaN	NaN	NaN	NaN	NaN	NaN	NaN	NaN	NaN	NaN	NaN	NaN	NaN	NaN	NaN	NaN	NaN	NaN	NaN	NaN	NaN	NaN	NaN	NaN	NaN	NaN	NaN	NaN	NaN	NaN	NaN	NaN	NaN	NaN	NaN	NaN	NaN	NaN	NaN	NaN	NaN	NaN	NaN
4.8032	NaN	NaN	NaN	NaN	NaN	NaN	NaN	NaN	NaN	NaN	NaN	NaN	NaN	NaN	NaN	NaN	NaN	NaN	NaN	NaN	NaN	NaN	NaN	NaN	NaN	NaN	NaN	NaN	NaN	NaN	NaN	NaN	NaN	NaN	NaN	NaN	NaN	NaN	NaN	NaN	NaN	NaN	NaN	NaN
4.9366	NaN	NaN	NaN	NaN	NaN	NaN	NaN	NaN	NaN	NaN	NaN	NaN	NaN	NaN	NaN	NaN	NaN	NaN	NaN	NaN	NaN	NaN	NaN	NaN	NaN	NaN	NaN	NaN	NaN	NaN	NaN	NaN	NaN	NaN	NaN	NaN	NaN	NaN	NaN	NaN	NaN	NaN	NaN	NaN
5.07	NaN	NaN	NaN	NaN	NaN	NaN	NaN	NaN	NaN	NaN	NaN	NaN	NaN	NaN	NaN	NaN	NaN	NaN	NaN	NaN	NaN	NaN	NaN	NaN	NaN	NaN	NaN	NaN	NaN	NaN	NaN	NaN	NaN	NaN	NaN	NaN	NaN	NaN	NaN	NaN	NaN	NaN	NaN	NaN
5.2035	NaN	NaN	NaN	NaN	NaN	NaN	NaN	NaN	NaN	NaN	NaN	NaN	NaN	NaN	NaN	NaN	NaN	NaN	NaN	NaN	NaN	NaN	NaN	NaN	NaN	NaN	NaN	NaN	NaN	NaN	NaN	NaN	NaN	NaN	NaN	NaN	NaN	NaN	NaN	NaN	NaN	NaN	NaN	NaN
5.3369	NaN	NaN	NaN	NaN	NaN	NaN	NaN	NaN	NaN	NaN	NaN	NaN	NaN	NaN	NaN	NaN	NaN	NaN	NaN	NaN	NaN	NaN	NaN	NaN	NaN	NaN	NaN	NaN	NaN	NaN	NaN	NaN	NaN	NaN	NaN	NaN	NaN	NaN	NaN	NaN	NaN	NaN	NaN	NaN
5.4703	NaN	NaN	NaN	NaN	NaN	NaN	NaN	NaN	NaN	NaN	NaN	NaN	NaN	NaN	NaN	NaN	NaN	NaN	NaN	NaN	NaN	NaN	NaN	NaN	NaN	NaN	NaN	NaN	NaN	NaN	NaN	NaN	NaN	NaN	NaN	NaN	NaN	NaN	NaN	NaN	NaN	NaN	NaN	NaN
5.6037	NaN	NaN	NaN	NaN	NaN	NaN	NaN	NaN	NaN	NaN	NaN	NaN	NaN	NaN	NaN	NaN	NaN	NaN	NaN	NaN	NaN	NaN	NaN	NaN	NaN	NaN	NaN	NaN	NaN	NaN	NaN	NaN	NaN	NaN	NaN	NaN	NaN	NaN	NaN	NaN	NaN	NaN	NaN	NaN
5.7371	NaN	NaN	NaN	NaN	NaN	NaN	NaN	NaN	NaN	NaN	NaN	NaN	NaN	NaN	NaN	NaN	NaN	NaN	NaN	NaN	NaN	NaN	NaN	NaN	NaN	NaN	NaN	NaN	NaN	NaN	NaN	NaN	NaN	NaN	NaN	NaN	NaN	NaN	NaN	NaN	NaN	NaN	NaN	NaN
5.8706	NaN	NaN	NaN	NaN	NaN	NaN	NaN	NaN	NaN	NaN	NaN	NaN	NaN	NaN	NaN	NaN	NaN	NaN	NaN	NaN	NaN	NaN	NaN	NaN	NaN	NaN	NaN	NaN	NaN	NaN	NaN	NaN	NaN	NaN	NaN	NaN	NaN	NaN	NaN	NaN	NaN	NaN	NaN	NaN
