0.00000,13246.378
0.13342,14395.590
0.26684,18525.279
0.40027,22180.068
0.53369,24108.211
0.66711,23678.340
0.80053,24074.309
0.93395,24474.877
1.06737,23721.205
1.20080,22349.598
1.33422,21575.314
1.46764,19021.021
1.60106,16535.629
1.73448,15454.452
1.86791,14612.121
2.00133,13584.735
2.13475,13053.199
2.26817,13220.771
2.40159,12900.735
2.53502,13527.243
2.66844,12846.301
