0.00000,13132.595
0.13342,14544.636
0.26684,16242.535
0.40027,19714.449
0.53369,24534.174
0.66711,25846.523
0.80053,25793.486
0.93395,26914.586
1.06737,25081.246
1.20080,21655.459
1.33422,20483.611
1.46764,23633.764
1.60106,23541.379
1.73448,21702.336
1.86791,20077.904
2.00133,19436.387
2.13475,16772.943
2.26817,15612.430
2.40159,14597.110
2.53502,13597.116
2.66844,12787.278
2.80186,12255.239
2.93528,13004.599
3.06870,12631.072
