0.00000,13162.295
0.13342,14010.423
0.26684,15144.093
0.40027,17256.285
0.53369,21831.959
0.66711,24405.428
0.80053,24574.662
0.93395,21967.047
1.06737,20625.631
1.20080,21675.707
1.33422,18907.379
1.46764,18696.039
1.60106,18562.365
1.73448,18104.406
1.86791,16045.523
2.00133,14130.827
2.13475,12680.353
2.26817,12718.062
2.40159,12225.897
