x	Y_20180514_15100b_12_3g	Y_20180514_15100b_13_6g	Y_20180514_15100b_14_9g	Y_20180514_15100b_16_15g	Y_20180514_15100b_18_1g	Y_20180514_15100b_19_1g	Y_20180514_15100b_20_3g	Y_20180514_15100b_22_12g	Y_20180514_15100b_22_4g	Y_20180514_15100b_25_8g	Y_20180514_15100b_9_9g
0	13412.3662	13724.5049	13947.7334	13046.1758	13888.5771	12314.9531	13148.1084	12272.8643	10898.7148	16675.0859	14625.0537
0.1334	15253.291	14677.9268	15303.5283	14498.5898	14210.623	12260.8477	12965.7197	13341.0264	11874.252	18099.9336	14870.3779
0.2668	18234.4414	16651.8828	18827.9961	17628.5254	13886.3789	14464.3027	13117.3896	14345.6504	13431.0107	19211.1211	15102.9229
0.4003	25365.3848	19108.4199	23589.5391	21523.5781	16318.3916	16431.4531	14503.4609	17247.4219	16465.9512	23452.2676	15289.5527
0.5337	29960.4414	23724.002	27454.4062	20180.6055	16504.5195	19854.2832	17547.5625	21461.6191	19411.6309	25681.1191	16185.9482
0.6671	27885.9453	23908.9102	23503.5957	18189.7168	19449.0059	24931.1465	23026.0039	24806.8984	20946.5918	22151.0293	17175.3906
0.8005	23349.6406	20930.5137	19245.2285	15891.2598	24031.8457	25128.1406	26796.0547	24016.6426	18666.6367	20432.416	19507.5371
0.934	20581.9512	19453.5078	17233.5586	14625.6055	22700.2461	24071.6289	24448.2812	22229.1914	17518.7383	18022.7246	23499.2012
1.0674	19257.2617	18901.8672	16327.7207	14866.374	19774.9102	21872.3379	19831.002	19330.791	15227.1309	16205.582	30240.8711
1.2008	19429.207	17638.6289	15315.8594	16255.7832	17486.1367	20714.3047	18088.8965	20668.0547	13899.8105	15329.1895	32858.168
1.3342	18962.0918	17330.1992	15104.5391	17511.6016	16544.4707	20637.2871	17555.1191	21945.709	13740.9414	15809.0918	30155.0566
1.4676	18391.9355	16555.0039	15985.124	17800.6055	16056.6826	17474.9551	16103.5664	20512.5117	13723.1914	16058.1982	26626.4766
1.6011	16570.2656	17877.1055	15956.75	18919.2168	15098.5273	16397.0078	16017.4512	20199.3984	13317.5537	16045.4707	23332.2129
1.7345	16059.9297	17474.834	14713.5605	19354.4062	15163.8066	17754.75	15954.8086	20190.9785	14108.8027	17015.498	22534.4629
1.8679	17117.3906	19012.1035	14410.2393	20129.2305	15654.8984	16012.002	16595.7383	20401.5039	13720.8867	19038.3047	22230.3965
2.0013	18307.9453	18601.373	14727.3037	19418.707	15916.9199	16714.2578	18177	21153.3164	14094.3096	19707.9707	22301.2305
2.1347	20344.3008	20262.3359	14578.3916	18732.8125	16160.917	17115.418	19512.1016	18760.7383	16846.3008	18406.7812	21084.5488
2.2682	20271.0605	22001.3848	15660.2598	18631.0605	17078.4863	16833.457	19544	18775.4316	18449.7461	20142.4785	19844.8652
2.4016	19970.3262	19381.4473	15619.5977	17628.3984	17654.5117	16496.3555	18877.4121	19090.3301	20237.2793	21833.4746	20352.1875
2.535	20705.4082	20244.5898	16436.0859	16450.8809	17957.3047	16016.1836	20741.0508	18446.957	19549.8594	20285.9766	21884.0391
2.6684	19471.2207	21500.3125	15012.8584	15052.9287	17801.1055	15330.7871	21383.6602	18415.207	19134.1191	19381.4277	23106.0078
2.8019	19134.9883	22093.4648	14744.3438	14656.1074	20611.9707	16302.6006	19787.1641	18309.9023	17975.9766	18937.834	22684.1367
2.9353	17943.9805	20495.9453	14333.0303	14628.2178	22664.3945	16062.3447	17945.2812	16976.3574	16258.7432	17272.6641	23309.3828
3.0687	17272.8555	16642.6133	14418.0859	14062.9463	23625.2539	15444.9092	16893.8613	15813.5947	15375.0557	15741.4229	24456.6562
3.2021	16764.6777	15597.1768	13986.167	NaN	21060.4902	14981.6191	15580.4258	14751.6875	14547.1904	15410.6875	23384.5059
3.3355	14354.5098	14238.4854	12743.7549	NaN	18863.5195	15938.9834	13872.8047	14167.2734	13632.5361	13772.8076	22843.5
3.469	13224.4814	13392.7324	13029.1953	NaN	18107.1797	15624.2422	14460.0508	14228.7871	14355.1006	13968.2188	22386.8867
3.6024	11701.1211	13772.9053	12164.167	NaN	16510.4902	14823.2119	14200.6064	13893.2129	14341.2539	14896.6885	19992.3828
3.7358	11808.8555	13613.5576	12259.0498	NaN	16429.0215	15627.6045	14095.6475	NaN	14619.1523	15484.8164	17005.5
3.8692	12640.7227	13084.3311	12494.0947	NaN	16158.1777	NaN	14253.6602	NaN	NaN	15385.4727	15837.7734
4.0027	12850.2061	13795.2637	12400.127	NaN	15674.0586	NaN	14320.5137	NaN	NaN	14689.0234	15341.7871
4.1361	NaN	13814.1309	12333.6357	NaN	NaN	NaN	14798.7314	NaN	NaN	14035.3145	15292.8252
4.2695	NaN	NaN	NaN	NaN	NaN	NaN	NaN	NaN	NaN	NaN	14551.4287
4.4029	NaN	NaN	NaN	NaN	NaN	NaN	NaN	NaN	NaN	NaN	NaN
4.5363	NaN	NaN	NaN	NaN	NaN	NaN	NaN	NaN	NaN	NaN	NaN
4.6698	NaN	NaN	NaN	NaN	NaN	NaN	NaN	NaN	NaN	NaN	NaN
4.8032	NaN	NaN	NaN	NaN	NaN	NaN	NaN	NaN	NaN	NaN	NaN
4.9366	NaN	NaN	NaN	NaN	NaN	NaN	NaN	NaN	NaN	NaN	NaN
5.07	NaN	NaN	NaN	NaN	NaN	NaN	NaN	NaN	NaN	NaN	NaN
