x	Y_20180130_15109_1_3g	Y_20180130_15109_1_5g	Y_20180130_15109_1_6g	Y_20180130_15109_1_8g	Y_20180130_15109_10_1g	Y_20180130_15109_11_2g	Y_20180130_15109_11_5g	Y_20180130_15109_2_15g	Y_20180130_15109_2_8g	Y_20180130_15109_3_14g	Y_20180130_15109_3_3g	Y_20180130_15109_4_7g	Y_20180130_15109_4_9g	Y_20180130_15109_5_10g	Y_20180130_15109_5_2g	Y_20180130_15109_5_5g	Y_20180130_15109_5_6g	Y_20180130_15109_5_9g	Y_20180130_15109_6_10g	Y_20180130_15109_7_5g	Y_20180130_15109_8_7g	Y_20180130_15109_9_5g	Y_20180130_15109_9_6g
0	41290.191	36641.305	39378.176	34697	38195.766	30811.734	37338.539	35745.781	37831.129	32195.188	29985.975	33681.602	33607.852	37219.762	33241.281	35474.414	37877.203	39131.117	30926.465	35568.859	33405.613	39601.602	32422.602
0.1334	41399.223	36509.996	40976.492	35905.391	36412.488	31858.014	39195.117	36607.379	38942.172	32106.457	29224.492	32903	33066.398	38521.934	34405.812	36572.348	38235.234	39920.199	32672.443	37711.293	32544.004	38384.984	34582.016
0.2668	41086.477	37289.027	40350.836	34964.371	37931.266	29940.357	37643.09	35977.582	37785.52	30939.943	29856.459	33968.75	35112.281	37633.562	34664.586	37842.598	36563.398	39343.672	33084.145	35410.293	33795.168	39371.477	34778.469
0.4003	39995.906	35642.496	40806.324	33829.5	36891.246	31248.193	36226.508	36996.746	36940.055	31386.77	30307.812	33247.137	32936.211	39371.043	36252.688	36965.828	36958.367	38439.777	32392.93	34855.363	33960.582	40996.84	34229.309
0.5337	42927.348	36455.914	40548.359	34546.441	36801.406	31898.797	36765.09	38258.32	38580.492	30288.713	29860.295	33764.754	32464.531	38923.91	36360.254	36231.488	37946.609	37842.684	31052.676	36028.711	33290.004	40157.406	33628.035
0.6671	43922.922	36376.367	38682.109	34607.121	36645.793	30535.326	37691.734	38324.168	39825.762	31011.121	29889.256	33650.855	31804.18	37706	36976.133	36328.758	37873.309	37601.723	31676.6	35471.031	32975.863	40975.957	34706.012
0.8005	43282.254	35907.84	38466.129	35125.234	37067.133	31708.807	37162.883	37119.445	38037.465	32560.646	30501.199	35268.199	32362.613	38215.223	36809.93	38480.598	38256.516	37873.812	31600.686	38268.469	33705.074	39007.449	33152.812
0.934	40502.652	36780.289	38935.02	35322.312	38537.871	31108.334	38185.262	37750.547	40022.789	31219.023	28293.178	35668.984	33402.938	39321.805	36282.91	38058.91	37852.688	36997.637	31455.316	37687.562	35462.34	39056.926	33208.258
1.0674	40492.949	36996.277	37360.07	37296.688	37795.879	30676.23	36914.91	38567.047	41239.738	31317.746	29245.572	33241.57	33272.723	37344.59	36749.809	37019.168	35281.871	38462.285	30754.268	37424.551	33266.336	40139.379	32183.891
1.2008	41188.566	38198.348	38820.855	34952.578	38283.758	31024.301	36258.027	39948.051	40714.48	32306.102	28417.611	32868.84	33418.328	36339.074	34929.223	37755.262	36778.805	38602.371	30492.227	38364.637	33350.383	40997.59	34582.082
1.3342	42554.531	36569.188	38652.023	35615.613	38058.473	31997.246	37820.152	39866.73	41693.742	32050.738	29322.066	34728.25	35204.223	37670.254	36035.426	39146.676	36742.562	35960.59	31083.602	37827.906	34231.438	40362.051	33855.254
1.4676	39257.66	37432.301	39231.852	36582.602	38296.184	32692.875	38298.672	41218.008	43046.785	31866.6	28799.133	34260.469	36805.637	36041.922	35876.391	38121.043	37658.688	38007.059	30388.076	36296.426	33937.266	40525.16	33438.488
1.6011	40234.469	40447.309	39758.516	36659.801	38225.395	32081.889	38316.148	42084.879	44511.234	31800.76	28312.039	33760.188	36397.992	36501.145	35346.977	37769.316	35641.574	37482.203	31750.082	36305.281	33710.602	41349.367	33117.039
1.7345	41996.148	39466.574	41692.668	38531.945	39794.105	33473.922	37009.5	41408.121	46265.641	32959.543	29689.109	35743.879	38414.066	38994.742	35466.906	36780.996	35892.309	38261.754	31324.357	38812.848	33070.238	40304.918	33858.812
1.8679	39776.273	36325.922	43624.043	38373.926	40197.848	36935.309	37592.344	39873.762	50949.188	31812.264	29057.75	36605.445	40349.238	38884.312	37253.594	35914.023	36799.285	38369.73	31629.523	38447.836	35762.605	40707.312	35354.18
2.0013	45035.824	37766.727	47856.02	38112.387	39279.426	41747.473	37369.109	38892.363	62797.336	33117.789	30265.082	35370.426	44326.637	40361.074	38663.312	36788.875	39511.008	39381.633	32889.152	41174.082	36038.973	42511.672	34422.453
2.1348	47403.855	41108.016	52880.379	38272.367	44419.859	57481.645	40961.695	38543.832	86565.633	38663.066	30294.52	38678.328	55036.539	42360.867	41514.633	39224.453	40411.953	41320.34	33013.137	42184.879	36095.219	44785.016	37246.41
2.2682	59057.844	42647.238	72622.445	39326.598	47239.652	89206.773	46932.156	40074.438	143333.703	51004.027	31529.604	46393.91	79410.805	47117.625	47785.492	42129.492	41467.586	46924.008	40027.328	47382.137	41046.723	49716.961	45679.352
2.4016	91116.633	53069.43	104167.641	46025.508	59752.926	102813.281	60032.258	45688.891	213402.656	73342.789	34043.684	59430.969	123836.945	61849.402	72040.625	51172.98	51011.309	57657.445	55321.09	64234.043	54693.172	63216.254	57582.641
2.535	140915.094	78532.43	124275.164	61037.988	90000.766	80157	86164.969	56916.344	234149.953	86677.984	38406.852	84597.438	132767.5	86782.852	123260.898	67596.68	67850.094	80413.812	73165.188	95780.109	85973.062	95008.406	86498.281
2.6684	149653.844	130342.43	97963.461	81902.828	113012.133	52239.453	104854.914	82204.969	182933.969	71121.727	51659.367	110814.242	92337.453	89504.695	184477	79663.922	104334.281	99099.875	76249.805	104964.789	151524.141	137667.344	109065.18
2.8019	101628	159723.359	66190.328	81736.734	99384.977	39446.551	80065.305	118040.492	108891.352	50564.801	69502.828	102281.391	55512.031	70352.266	177874.125	70343.844	134295.641	88588.422	60090.973	81105.18	175259.953	137396.062	90043.906
2.9353	64060.121	126201.227	51845.465	60208.227	65192.098	NaN	61479.605	122686.273	69515.734	NaN	63373.867	69908.383	42397.273	54024.641	112666.32	NaN	124296.273	58267.664	43788.023	57060.902	130932.547	90913.891	60730.984
3.0687	49153.785	81402.68	44257.609	46384.348	48527.312	NaN	48991.078	87724.516	52388.996	NaN	44880.957	49559.863	NaN	43432.781	65233.645	NaN	84812.688	46250.945	36712.961	47465.73	73236.602	60548.398	47045.957
3.2021	43687.203	57847.219	NaN	NaN	43521.461	NaN	42888.387	61585.152	NaN	NaN	36994.094	39047.348	NaN	NaN	NaN	NaN	57689.059	NaN	NaN	NaN	51277.699	50343.145	NaN
3.3356	41788.832	47846.32	NaN	NaN	NaN	NaN	NaN	NaN	NaN	NaN	31423.721	NaN	NaN	NaN	NaN	NaN	48234.902	NaN	NaN	NaN	43589.906	NaN	NaN
3.469	41857.801	42114.695	NaN	NaN	NaN	NaN	NaN	NaN	NaN	NaN	NaN	NaN	NaN	NaN	NaN	NaN	44676.887	NaN	NaN	NaN	39712.367	NaN	NaN
3.6024	NaN	NaN	NaN	NaN	NaN	NaN	NaN	NaN	NaN	NaN	NaN	NaN	NaN	NaN	NaN	NaN	NaN	NaN	NaN	NaN	38477.098	NaN	NaN
3.7358	NaN	NaN	NaN	NaN	NaN	NaN	NaN	NaN	NaN	NaN	NaN	NaN	NaN	NaN	NaN	NaN	NaN	NaN	NaN	NaN	37710.73	NaN	NaN
3.8692	NaN	NaN	NaN	NaN	NaN	NaN	NaN	NaN	NaN	NaN	NaN	NaN	NaN	NaN	NaN	NaN	NaN	NaN	NaN	NaN	NaN	NaN	NaN
4.0027	NaN	NaN	NaN	NaN	NaN	NaN	NaN	NaN	NaN	NaN	NaN	NaN	NaN	NaN	NaN	NaN	NaN	NaN	NaN	NaN	NaN	NaN	NaN
4.1361	NaN	NaN	NaN	NaN	NaN	NaN	NaN	NaN	NaN	NaN	NaN	NaN	NaN	NaN	NaN	NaN	NaN	NaN	NaN	NaN	NaN	NaN	NaN
4.2695	NaN	NaN	NaN	NaN	NaN	NaN	NaN	NaN	NaN	NaN	NaN	NaN	NaN	NaN	NaN	NaN	NaN	NaN	NaN	NaN	NaN	NaN	NaN
4.4029	NaN	NaN	NaN	NaN	NaN	NaN	NaN	NaN	NaN	NaN	NaN	NaN	NaN	NaN	NaN	NaN	NaN	NaN	NaN	NaN	NaN	NaN	NaN
4.5363	NaN	NaN	NaN	NaN	NaN	NaN	NaN	NaN	NaN	NaN	NaN	NaN	NaN	NaN	NaN	NaN	NaN	NaN	NaN	NaN	NaN	NaN	NaN
