X,Y
0.00000,12688.145
0.13342,13474.598
0.26684,14839.264
0.40027,17457.039
0.53369,20013.098
0.66711,17274.518
0.80053,15001.316
0.93395,13556.280
1.06737,12958.835
1.20080,12822.108
1.33422,13047.776
1.46764,12704.552
1.60106,12834.055
1.73448,13337.044
1.86791,13546.286
2.00133,13738.966
2.13475,12750.925
