0.0000	15929.6963
0.1334	16258.2383
0.2668	17230.9707
0.4003	17127.9980
0.5337	20434.6406
0.6671	22629.7617
0.8005	19801.6367
0.9340	17896.1582
1.0674	17001.6016
1.2008	15690.2852
1.3342	14632.6348
1.4676	14094.4043
1.6011	14692.0645
1.7345	15163.8350
1.8679	14310.7842
2.0013	13404.2480
2.1347	13622.6953
2.2682	14125.6396
2.4016	14104.1504
2.5350	13907.5244
2.6684	14461.9473
