0.00000,38641.516
0.13342,40122.793
0.26684,37666.262
0.40027,38223.242
0.53369,38005.785
0.66711,38363.191
0.80053,39176.266
0.93395,40405.121
1.06737,40568.906
1.20080,41476.105
1.33422,47191.227
1.46764,56239.988
1.60106,78864.508
1.73448,91890.211
1.86791,71493.148
2.00133,50712.914
2.13475,44246.328
2.26817,42767.598
2.40159,41067.383
2.53502,39876.117
2.66844,39801.195
