X,Y
0.00000,11664.176
0.13342,12653.998
0.26684,14036.767
0.40027,16941.887
0.53369,21076.287
0.66711,23753.246
0.80053,22521.781
0.93395,21219.014
1.06737,18790.262
1.20080,18463.324
1.33422,18918.053
1.46764,18110.809
1.60106,16917.166
1.73448,14977.962
1.86791,14792.800
2.00133,14911.078
2.13475,16138.008
2.26817,16698.389
2.40159,16598.076
2.53502,15605.467
2.66844,16321.271
2.80186,15177.559
2.93528,14556.618
3.06870,14963.832
3.20212,14755.694
3.33555,13977.008
