X,Y
0.00000,35456.828
0.13342,36261.832
0.26684,37915.832
0.40027,37659.344
0.53369,38688.820
0.66711,40595.215
0.80053,47351.770
0.93395,58193.859
1.06737,79573.578
1.20080,99048.734
1.33422,129786.578
1.46764,130404.008
1.60106,94248.695
1.73448,60782.875
1.86791,47324.465
2.00133,42935.895
