X,Y
0.00000,14941.960
0.13342,15939.824
0.26684,15363.887
0.40027,14282.271
0.53369,13689.858
0.66711,12644.389
0.80053,12819.044
0.93395,12010.980
1.06737,11555.888
1.20080,11587.201
1.33422,11781.174
1.46764,11625.059
1.60106,12078.051
