X,Y
0.00000,11267.483
0.13342,11896.662
0.26684,12298.411
0.40027,15126.053
0.53369,19874.754
0.66711,21789.715
0.80053,20647.654
0.93395,18608.295
1.06737,16444.363
1.20080,14750.634
1.33422,13624.501
1.46764,13149.249
1.60106,13366.924
1.73448,12935.849
