0.00000,11701.054
0.13342,12457.150
0.26684,14062.483
0.40027,15183.506
0.53369,17196.250
0.66711,16508.439
0.80053,16989.195
0.93395,16944.709
1.06737,15835.158
1.20080,15986.558
1.33422,14833.956
1.46764,14803.000
1.60106,14129.377
1.73448,14136.512
1.86791,14286.066
2.00133,12899.598
2.13475,12917.625
2.26817,12194.043
2.40159,11877.915
2.53502,11966.680
2.66844,11266.498
2.80186,11085.850
2.93528,11047.338
