X,Y
0.00000,12952.065
0.13342,13600.141
0.26684,15589.795
0.40027,19122.014
0.53369,21506.740
0.66711,19394.141
0.80053,17801.453
0.93395,18221.502
1.06737,17717.582
1.20080,17212.252
1.33422,15564.207
1.46764,15181.514
1.60106,14538.117
1.73448,13371.239
1.86791,13082.262
2.00133,11828.407
2.13475,12356.184
2.26817,12116.414
2.40159,12811.622
