x	Y_20180130_15109_16_1g_left	Y_20180130_15109_36_7g	Y_20180130_15109_42_10g	Y_20180130_15109_5_11g	Y_20180130_15109_5_12g
0	33840.402	35413.688	37229.9894925926	35943.164	36885.797
0.1334	34163.48	37284.637	37750.1886592593	36111.031	35698.125
0.2668	33641.562	37696.68	37705.6770851852	33934.961	38532.195
0.4003	33201.648	36370.625	37060.7100222222	35476.32	38445.039
0.5337	34243.734	35576.426	37725.3750851852	35740.129	38763.758
0.6671	34652.051	36881.738	36536.7797	34714.062	37449.934
0.8005	34863.992	35771.492	36444.2824777778	35553.723	37774.684
0.934	34111.07	35307.59	37481.531562963	37784.625	38158.746
1.0674	33498.746	35559.895	37943.4983	36614.5	37380.715
1.2008	33046.531	37348.465	37804.4536962963	36297.668	37465.555
1.3342	34034.512	36045.664	35250.0469333333	36159.285	35705.227
1.4676	35027.324	35219.523	36241.7283259259	35915.691	36729.312
1.6011	34621.316	36749.242	35505.2176740741	36432.371	37431.082
1.7345	36501.262	35187.387	35866.3580962963	36814.605	37067.215
1.8679	36918	35911.512	36540.8078888889	37540.008	37570.188
2.0013	37328.438	35114.738	34588.3365703704	36572.383	36434.953
2.1348	38096.504	35063.773	35148.6908222222	36472.969	37022.73
2.2682	37847.574	35737.348	35685.8834222222	33977.336	36661.531
2.4016	38770.492	36042.344	38656.6770703704	37066.422	36717.223
2.535	40188.348	36806.621	37932.7738333333	38204.418	37686.723
2.6684	40718.723	38307.551	38462.4624333333	40437.109	38181.961
2.8019	46870.492	39178.41	44065.5533222222	46798.645	38716.398
2.9353	57085.586	40038.305	54344.9546222222	68819.625	43865.867
3.0687	78803.797	48646.879	80827.7882851852	93396.977	53066.773
3.2021	131277.047	68890.711	128470.350774074	99145.508	68538.406
3.3356	167013.344	107436.156	144995.802011111	73298.344	73180.93
3.469	141495.719	125213.086	105468.261407407	52299.719	58733.09
3.6024	84855.531	90450.867	65115.5344111111	NaN	47408.711
3.7358	53431.266	59395.949	45493.7191185185	NaN	41520.586
3.8692	NaN	49147.758	41230.2641962963	NaN	NaN
4.0027	NaN	44516.785	NaN	NaN	NaN
4.1361	NaN	NaN	NaN	NaN	NaN
4.2695	NaN	NaN	NaN	NaN	NaN
4.4029	NaN	NaN	NaN	NaN	NaN
4.5363	NaN	NaN	NaN	NaN	NaN
4.6698	NaN	NaN	NaN	NaN	NaN
4.8032	NaN	NaN	NaN	NaN	NaN
4.9366	NaN	NaN	NaN	NaN	NaN
5.07	NaN	NaN	NaN	NaN	NaN
5.2035	NaN	NaN	NaN	NaN	NaN
5.3369	NaN	NaN	NaN	NaN	NaN
5.4703	NaN	NaN	NaN	NaN	NaN
5.6037	NaN	NaN	NaN	NaN	NaN
5.7371	NaN	NaN	NaN	NaN	NaN
