0.0000	32345.2031
0.1334	33748.1250
0.2668	32481.4766
0.4003	32303.1367
0.5337	32603.5859
0.6671	33475.8281
0.8005	34883.0352
0.9340	33905.5938
1.0674	32995.0039
1.2008	33575.3125
1.3342	35506.8516
1.4676	34754.5547
1.6011	33820.3438
1.7345	34500.0938
1.8679	33956.6953
2.0013	35759.8828
2.1347	37189.7383
2.2682	41760.4414
2.4016	48221.3438
2.5350	65237.0234
2.6684	68269.7422
2.8019	53929.3633
2.9353	40984.7070
3.0687	36790.0039
3.2021	34993.0586
3.3355	34910.0352
3.4690	35234.6211
