X,Y
0.00000,12987.314
0.13342,13452.811
0.26684,14321.666
0.40027,16032.998
0.53369,19567.873
0.66711,19367.279
0.80053,17450.545
0.93395,15278.444
1.06737,13705.412
1.20080,13233.550
1.33422,12790.476
1.46764,12518.590
1.60106,12785.280
1.73448,13241.380
1.86791,13209.913
2.00133,12985.248
2.13475,12798.176
