0.0000	28840.3066
0.1334	29768.2168
0.2668	29706.7520
0.4003	30749.9805
0.5337	29322.9258
0.6671	29442.1914
0.8005	31043.9902
0.9340	32294.1504
1.0674	32620.7266
1.2008	34011.4414
1.3342	36320.5938
1.4676	45459.2266
1.6011	63151.5781
1.7345	94020.0391
1.8679	113131.7969
2.0013	85682.3203
2.1347	54090.6055
2.2682	42530.8906
2.4016	35169.7891
