x	Y_20180130_15109_1_6g	Y_20180130_15109_11_2g	Y_20180130_15109_2_8g	Y_20180130_15109_4_9g	Y_20180130_15109_5_10g	Y_20180130_15109_5_5g	Y_20180130_15109_6_10g	Y_20180130_15109_9_5g
0	14277.24	11435.438	12920.934	11325.062	12568.554	10969.197	11888.042	12548.572
0.1334	12977.671	12046.729	13340.152	12194.608	12521.584	10738.836	11780.432	13379.784
0.2668	13741.217	13687.559	15034.948	12953.559	13091.19	11565.739	11756.499	13610.426
0.4003	16718.096	15893.552	16216.253	14966.456	15386.857	12950.172	13162.344	15607.609
0.5337	19601.746	16636.354	20857.043	15493.745	19106.18	16481.365	15577.955	17184.666
0.6671	21384.197	15481.243	20993.688	15687.821	24993.699	19258.619	18101.381	18200.408
0.8005	20784.121	14157.132	19361.926	14667.118	27581.156	19333.379	20766.611	19054.361
0.934	21695.574	14217.924	19267.004	15960.738	25333.738	18901.668	18741.648	18135.113
1.0674	20819.957	13336.158	18708.939	16361.468	24942.822	18979.498	16363.37	16958.049
1.2008	20918.768	13717.697	18074.307	16496.836	22599.607	17672.959	17088.047	16086.594
1.3342	20456.744	15176.333	18277.836	16531.295	18806.654	16607.062	17823.078	15789.155
1.4676	19915.057	16632.867	17394.139	15332.997	17737.854	15307.547	18187.07	14518.903
1.6011	19544.912	15915.253	16257.279	13777.286	19004.277	15287.555	19225.168	14034.023
1.7345	19136.854	16161.131	15090.377	13402.434	19613.635	14599.706	19076.488	14288.103
1.8679	17512.482	15944.47	13562.056	12686.08	20887.066	14704.227	18571.539	14498.195
2.0013	18004.768	14769.117	12449.897	12310.16	21457.498	13331.721	16048.031	14329.181
2.1348	17072.842	13807.823	13430.016	13212.534	20277.33	14133.221	15189.735	13697.275
2.2682	16343.003	13131.354	12291.954	13263.611	16666.014	13800.729	14718.432	14326.606
2.4016	14851.481	12773.583	13025.55	13498.38	15602.422	13630.44	12980.845	14802.601
2.535	14523.804	12180.269	12904.003	13227.917	13691.866	13353.14	13420.999	14616.994
2.6684	13280.507	11932.139	12355.521	13389.728	12587.083	12445.342	12863.341	13970.735
2.8019	12805.125	12254.369	11976.203	13596.499	12299.029	11788.86	12989.496	13896.126
2.9353	11968.393	NaN	11629.572	13082.352	11866.611	NaN	12930.977	12757.278
3.0687	12131.655	NaN	11461.674	NaN	12792.848	NaN	11907.506	12124.915
3.2021	NaN	NaN	NaN	NaN	NaN	NaN	NaN	12270.198
3.3356	NaN	NaN	NaN	NaN	NaN	NaN	NaN	NaN
3.469	NaN	NaN	NaN	NaN	NaN	NaN	NaN	NaN
3.6024	NaN	NaN	NaN	NaN	NaN	NaN	NaN	NaN
3.7358	NaN	NaN	NaN	NaN	NaN	NaN	NaN	NaN
3.8692	NaN	NaN	NaN	NaN	NaN	NaN	NaN	NaN
4.0027	NaN	NaN	NaN	NaN	NaN	NaN	NaN	NaN
4.1361	NaN	NaN	NaN	NaN	NaN	NaN	NaN	NaN
4.2695	NaN	NaN	NaN	NaN	NaN	NaN	NaN	NaN
4.4029	NaN	NaN	NaN	NaN	NaN	NaN	NaN	NaN
4.5363	NaN	NaN	NaN	NaN	NaN	NaN	NaN	NaN
