0.00000,37424.754
0.13342,39319.211
0.26684,37871.434
0.40027,37666.707
0.53369,37560.875
0.66711,37625.984
0.80053,37188.762
0.93395,38070.062
1.06737,37684.293
1.20080,39896.738
1.33422,38051.031
1.46764,39195.539
1.60106,39862.195
1.73448,40575.582
1.86791,41342.039
2.00133,42937.449
2.13475,49190.102
2.26817,62791.855
2.40159,94321.914
2.53502,114362.719
2.66844,93676.875
2.80186,65217.871
2.93528,50550.703
3.06870,46094.926
3.20212,43848.027
