X,Y
0.00000,15213.542
0.13342,15685.229
0.26684,15109.954
0.40027,14993.878
0.53369,13780.402
0.66711,14689.705
0.80053,15485.709
0.93395,15991.585
1.06737,15932.700
1.20080,15753.338
1.33422,16602.227
1.46764,16135.598
1.60106,16151.396
1.73448,18533.674
1.86791,23696.891
2.00133,30550.869
2.13475,29190.664
2.26817,22035.283
2.40159,18317.828
2.53502,16629.938
2.66844,16436.385
2.80186,15699.126
