X,Y
0.00000,30842.740
0.13342,32910.906
0.26684,32546.301
0.40027,33606.180
0.53369,33854.668
0.66711,33497.426
0.80053,32973.199
0.93395,33535.934
1.06737,32511.145
1.20080,32511.670
1.33422,32284.555
1.46764,32071.006
1.60106,32845.652
1.73448,31338.695
1.86791,30908.643
2.00133,31680.295
2.13475,32414.398
2.26817,31497.611
2.40159,32415.955
2.53502,34751.074
2.66844,35368.883
2.80186,38062.633
2.93528,46823.719
3.06870,63251.602
3.20212,94319.031
3.33555,99187.602
3.46897,68236.617
3.60239,45731.074
