0.0000	33505.4375
0.1334	32976.2969
0.2668	32837.3711
0.4003	33314.9805
0.5337	32571.2246
0.6671	32773.6172
0.8005	33834.6992
0.9340	34595.2930
1.0674	33908.1562
1.2008	33276.4141
1.3342	34446.0117
1.4676	35177.4844
1.6011	35097.9492
1.7345	34321.7227
1.8679	34378.9766
2.0013	34858.6250
2.1347	34844.6406
2.2682	34893.6797
2.4016	34952.0938
2.5350	38689.9258
2.6684	43317.3438
2.8019	52667.9336
2.9353	79671.0312
3.0687	118770.7969
3.2021	122731.8750
3.3355	85742.2656
3.4690	54335.4727
3.6024	42108.8516
3.7358	39108.2734
3.8692	37120.2773
