0.0000	16358.5996
0.1334	15704.9170
0.2668	16524.3320
0.4003	20941.0059
0.5337	26112.6914
0.6671	28459.7812
0.8005	23717.6758
0.9340	20408.0527
1.0674	18141.8594
1.2008	17445.2031
1.3342	16140.3096
1.4676	14907.5361
1.6011	15168.6797
1.7345	14977.8994
1.8679	15574.6289
2.0013	15494.8662
2.1347	14929.3701
2.2682	13552.9512
2.4016	13621.9922
2.5350	12390.2510
2.6684	12381.6973
