0.0000	31564.3320
0.1334	31617.7363
0.2668	31500.5625
0.4003	31803.1758
0.5337	29870.8262
0.6671	31672.2363
0.8005	32511.0273
0.9340	32290.1211
1.0674	32422.3652
1.2008	34081.9531
1.3342	40561.8086
1.4676	51343.0352
1.6011	75127.3125
1.7345	87696.5312
1.8679	72791.0391
2.0013	49931.5352
2.1347	39315.3320
2.2682	37213.7852
2.4016	36520.9961
