0.0000	16675.2227
0.1334	17343.4961
0.2668	17633.6543
0.4003	20030.0215
0.5337	26411.8965
0.6671	37216.4492
0.8005	38395.1172
0.9340	31363.0859
1.0674	25435.9668
1.2008	21697.3984
1.3342	20435.2324
1.4676	21316.8164
1.6011	21181.9941
1.7345	20037.3438
1.8679	19764.3281
2.0013	22086.8613
2.1347	23406.1367
2.2682	25358.4805
2.4016	24707.4492
2.5350	22449.2363
2.6684	19071.1680
2.8019	17121.2598
2.9353	15831.6416
3.0687	14797.5684
3.2021	14211.4502
3.3355	15021.5107
