0.00000,12528.805
0.13342,12514.020
0.26684,14269.136
0.40027,16736.301
0.53369,22187.691
0.66711,25450.758
0.80053,25729.959
0.93395,24032.885
1.06737,22756.809
1.20080,20258.256
1.33422,17988.059
1.46764,16478.250
1.60106,16061.271
1.73448,15156.421
1.86791,13875.901
2.00133,14109.627
2.13475,14389.717
2.26817,16637.258
2.40159,18051.893
2.53502,17644.111
2.66844,15838.469
2.80186,14321.920
2.93528,13413.637
3.06870,12273.370
3.20212,12297.190
