X,Y
0.00000,35112.074
0.13342,36507.719
0.26684,34745.922
0.40027,34375.047
0.53369,34612.418
0.66711,34562.590
0.80053,33341.809
0.93395,33988.922
1.06737,34402.949
1.20080,32995.160
1.33422,33191.695
1.46764,33397.797
1.60106,33863.367
1.73448,34201.121
1.86791,35460.824
2.00133,38166.699
2.13475,44111.652
2.26817,61993.062
2.40159,90997.578
2.53502,103278.359
2.66844,75636.109
2.80186,50518.289
