0.00000,32548.666
0.13342,33504.656
0.26684,34614.766
0.40027,33942.891
0.53369,32954.152
0.66711,34493.879
0.80053,33465.574
0.93395,34128.945
1.06737,33365.184
1.20080,34702.855
1.33422,34436.301
1.46764,38153.055
1.60106,42161.469
1.73448,55995.691
1.86791,89122.141
2.00133,115839.617
2.13475,95468.352
2.26817,64796.074
2.40159,48316.852
2.53502,40473.113
2.66844,36633.945
