0.00000,14724.098
0.13342,16514.332
0.26684,18347.904
0.40027,20123.561
0.53369,21178.736
0.66711,22740.340
0.80053,23063.262
0.93395,22959.488
1.06737,20595.209
1.20080,20008.846
1.33422,19078.383
1.46764,17354.064
1.60106,15398.340
1.73448,13233.946
1.86791,12324.444
2.00133,12580.729
2.13475,11636.722
2.26817,11255.771
