0.00000,14886.347
0.13342,15569.529
0.26684,19973.004
0.40027,22854.572
0.53369,23969.037
0.66711,24147.551
0.80053,24599.324
0.93395,23810.334
1.06737,22704.492
1.20080,21420.297
1.33422,19634.395
1.46764,17176.027
1.60106,15509.966
1.73448,13581.445
1.86791,12969.968
2.00133,12448.225
