0.00000,36778.418
0.13342,37001.445
0.26684,37213.703
0.40027,35881.098
0.53369,36788.375
0.66711,36295.090
0.80053,35224.137
0.93395,35892.855
1.06737,36886.945
1.20080,39920.605
1.33422,45598.168
1.46764,59725.234
1.60106,88010.109
1.73448,96432.406
1.86791,72563.312
2.00133,50578.676
2.13475,43508.172
