0.0000	33217.5781
0.1334	33204.2422
0.2668	32981.0859
0.4003	34058.7852
0.5337	33796.5312
0.6671	33382.9531
0.8005	33356.7148
0.9340	32665.0137
1.0674	33204.7539
1.2008	33296.7617
1.3342	33880.0000
1.4676	33269.8359
1.6011	35378.9844
1.7345	41026.4258
1.8679	55185.2031
2.0013	87872.1406
2.1347	120704.2812
2.2682	103187.4141
2.4016	65252.3867
2.5350	48567.8867
2.6684	44772.5156
