0.0000	16116.2881
0.1334	16669.3027
0.2668	16900.5977
0.4003	19154.8320
0.5337	20005.1230
0.6671	17613.2969
0.8005	15313.4141
0.9340	15048.3271
1.0674	15939.4717
1.2008	15821.1455
1.3342	17056.9766
1.4676	17412.0586
1.6011	17786.4688
1.7345	18494.0664
1.8679	19322.2207
2.0013	18408.6152
2.1347	17074.7695
2.2682	16904.1992
