0.00000,33620.758
0.13342,34253.098
0.26684,32594.842
0.40027,32592.742
0.53369,32963.875
0.66711,32721.213
0.80053,34093.289
0.93395,33919.602
1.06737,34486.422
1.20080,34906.910
1.33422,34329.844
1.46764,35486.469
1.60106,36665.332
1.73448,38140.637
1.86791,45437.020
2.00133,63213.793
2.13475,78227.664
2.26817,67687.586
2.40159,47894.465
2.53502,40112.449
2.66844,38726.727
