0.00000,34591.566
0.13342,37616.766
0.26684,34334.391
0.40027,36824.277
0.53369,36166.172
0.66711,35281.301
0.80053,34769.684
0.93395,36276.195
1.06737,35782.805
1.20080,33321.156
1.33422,36174.738
1.46764,34744.789
1.60106,33506.672
1.73448,33646.336
1.86791,35117.227
2.00133,35075.723
2.13475,34671.738
2.26817,35390.969
2.40159,38265.949
2.53502,42302.141
2.66844,59750.453
2.80186,83801.461
2.93528,89369.039
3.06870,64745.391
3.20212,46297.898
