x	Y_20180514_15100_10_3g	Y_20180514_15100_11_6g	Y_20180514_15100_21_3g	Y_20180514_15100_27_7g	Y_20180514_15100_30_1g	Y_20180514_15100_5_2g	Y_20180514_15100_7_3g
0	12756.95	12998.349	14996.3	10263.847	11775.81	12246.804	10238.294
0.1334	14185.316	11758.47	12837.971	10455.387	11292.57	13753.646	10506.33
0.2668	16606.709	11399.248	12101.274	10806.748	10423.04	14420.53	10995.378
0.4003	21228.375	11278.171	12477.375	11094.983	11220.349	14399.602	11818.068
0.5337	23097.355	10728.619	14714.746	11590.262	11166.556	14323.445	13609.46
0.6671	21247.416	11649.994	16994.475	12812.747	11851.064	14777.302	17299.176
0.8005	19842.332	11731.214	17732.094	13395.305	13425.481	16225.998	16398.734
0.934	19493.533	12016.128	16078.284	13393.247	15864.769	16067.021	14945.929
1.0674	19106	12407.826	15965.076	12768.823	19010.25	16110.537	14682.051
1.2008	19153.697	13304.465	15820.106	13996.898	18737.734	17137.764	13884.737
1.3342	18342.74	14375.186	15660.902	13399.911	17499.596	16478.242	14151.182
1.4676	16829.258	13854.252	15338.078	14116.221	16643.605	15017.481	14748.348
1.6011	15669.821	15836.464	16360.184	14885.352	15556.302	14530.384	15239.749
1.7345	15116.247	15784.738	16224.893	14898.669	16402.594	14317.983	14571.562
1.8679	14938.958	15508.595	15244.098	14928.372	16993.594	14076.552	14173.933
2.0013	14659.93	15768.163	15445.073	15603.284	16725.809	14094.77	14597.039
2.1348	13849.342	14579.55	13857.258	15399.372	16012.301	14439.279	14484.794
2.2682	13626.889	15876.713	12909.641	16692.586	16559.395	14108.39	14248.071
2.4016	13820.298	16253.354	14116.934	16092.557	15446.325	13901.938	15005.869
2.535	NaN	17580.824	13715.136	13899.796	15573.789	14456.731	14518.076
2.6684	NaN	17096.006	12518.291	14209.309	14264.277	14943.654	15260.763
2.8019	NaN	16542.344	12412.241	14187.483	13778.09	14793.816	15119.189
2.9353	NaN	14784.496	12112.884	13780.999	13658.257	NaN	NaN
3.0687	NaN	14278.758	NaN	NaN	13850.506	NaN	NaN
3.2021	NaN	14504.688	NaN	NaN	13921.202	NaN	NaN
3.3356	NaN	14210.639	NaN	NaN	14225.439	NaN	NaN
3.469	NaN	12898.473	NaN	NaN	12996.688	NaN	NaN
3.6024	NaN	NaN	NaN	NaN	13439.207	NaN	NaN
3.7358	NaN	NaN	NaN	NaN	NaN	NaN	NaN
3.8692	NaN	NaN	NaN	NaN	NaN	NaN	NaN
4.0027	NaN	NaN	NaN	NaN	NaN	NaN	NaN
4.1361	NaN	NaN	NaN	NaN	NaN	NaN	NaN
4.2695	NaN	NaN	NaN	NaN	NaN	NaN	NaN
4.4029	NaN	NaN	NaN	NaN	NaN	NaN	NaN
4.5363	NaN	NaN	NaN	NaN	NaN	NaN	NaN
4.6698	NaN	NaN	NaN	NaN	NaN	NaN	NaN
4.8032	NaN	NaN	NaN	NaN	NaN	NaN	NaN
4.9366	NaN	NaN	NaN	NaN	NaN	NaN	NaN
5.07	NaN	NaN	NaN	NaN	NaN	NaN	NaN
5.2035	NaN	NaN	NaN	NaN	NaN	NaN	NaN
5.3369	NaN	NaN	NaN	NaN	NaN	NaN	NaN
5.4703	NaN	NaN	NaN	NaN	NaN	NaN	NaN
5.6037	NaN	NaN	NaN	NaN	NaN	NaN	NaN
