0.00000,24042.182
0.13342,23239.018
0.26684,23768.695
0.40027,24636.287
0.53369,24843.279
0.66711,25076.098
0.80053,26390.664
0.93395,24959.188
1.06737,26646.832
1.20080,25892.885
1.33422,23779.418
1.46764,24012.588
1.60106,24317.988
1.73448,25071.627
1.86791,26801.430
2.00133,28936.902
2.13475,31417.184
2.26817,37209.062
2.40159,53391.020
2.53502,67618.586
2.66844,57108.062
2.80186,43480.488
2.93528,37052.961
