0.00000,32606.592
0.13342,31199.156
0.26684,31578.730
0.40027,32353.734
0.53369,33356.703
0.66711,32013.344
0.80053,31412.393
0.93395,31927.225
1.06737,32788.641
1.20080,34384.887
1.33422,33068.590
1.46764,31675.908
1.60106,30810.002
1.73448,32465.125
1.86791,34126.680
2.00133,34647.215
2.13475,39231.891
2.26817,49025.727
2.40159,68206.828
2.53502,81642.234
2.66844,65488.234
2.80186,48171.898
2.93528,38608.270
