0.00000,13346.762
0.13342,14902.930
0.26684,19513.209
0.40027,26013.910
0.53369,28003.494
0.66711,28081.703
0.80053,26082.555
0.93395,24501.836
1.06737,23218.752
1.20080,22371.105
1.33422,19246.896
1.46764,17379.279
1.60106,16445.998
1.73448,15181.798
1.86791,14343.355
2.00133,13473.346
2.13475,11806.416
2.26817,12063.111
2.40159,12272.510
2.53502,12093.410
2.66844,12368.246
