0.0000	31557.5215
0.1334	30234.5352
0.2668	31981.4082
0.4003	31876.1875
0.5337	32472.5078
0.6671	31877.5742
0.8005	32994.9883
0.9340	31714.8008
1.0674	32268.2812
1.2008	32702.8457
1.3342	32336.9180
1.4676	32363.7852
1.6011	32854.7383
1.7345	33361.2500
1.8679	33649.7422
2.0013	32666.5156
2.1347	35710.8633
2.2682	37254.9414
2.4016	36919.4297
2.5350	44198.3555
2.6684	61774.0078
2.8019	78271.2109
2.9353	69262.1484
3.0687	51445.1836
3.2021	40767.3711
3.3355	37573.0898
