x	Y_20180514_15338_c1_1_4g	Y_20180514_15338_c1_10_10g	Y_20180514_15338_c1_10_8g	Y_20180514_15338_c1_12_4g	Y_20180514_15338_c1_17_9g	Y_20180514_15338_c1_18_3g	Y_20180514_15338_c1_18_7g	Y_20180514_15338_c1_19_16g	Y_20180514_15338_c1_5_3g	Y_20180514_15338_c1_6_4g	Y_20180514_15338_c1_6_5g	Y_20180514_15338_c1_6_8g	Y_20180514_15338_c1_7_10g	Y_20180514_15338_c1_7_13g	Y_20180514_15338_c1_7_2g	Y_20180514_15338_c1_7_9g	Y_20180514_15338_c1_8_2g	Y_20180514_15338_c1_9_13g	Y_20180514_15338_c1_9_5g	Y_20180514_15338_c1_9_8g
0	10784.5449	15915.4502	9925.1123	12526.7275	11627.8037	14325.5	12758.5996	13518.5625	10089.0957	13300.8936	11608.0869	10642.4971	13562.1768	10793.2754	11277.5527	12224.5117	11839.0283	11926.9814	9566.3447	15434.5381
0.1334	11213.7793	16802.5234	11173.6875	12222.1748	13606.6387	15356.6748	14754.4453	13518.4277	10720.3564	13363.8242	13075.7725	12001.6973	14247.3613	10629.2168	11936.1621	12295.4629	13727.5518	11325.4922	9981.4873	15783.5967
0.2668	11917.6865	17809.5	12549.4912	13011.0713	17922.5059	17272.4297	18325.2012	12932.3955	11194.1523	13723.2217	12963.2764	12433.7656	15231.7168	11100.0615	13037.6523	12752.0938	14929.0283	11324.1797	11229.3223	16690.4316
0.4003	12312.8789	19033.166	13920.2832	15786.125	25850.543	21066.6973	23718.6523	13951.5645	11147.165	13919.2695	13031.4316	14218.5781	15996.9316	13022.0469	16211.2334	12559.127	16110.0254	13077.2666	11874.6152	18127.5176
0.5337	13585.0107	21223.0117	16178.9131	20322.3945	30361.9668	29152.209	26431.2617	14448.2324	11808.8154	15799.2646	14701.8955	16493.3965	18395.209	16068.0371	20115.8887	12270.4033	18815.9551	14494.0713	13506.1738	23123.9727
0.6671	15026.9746	27363.0859	21018.4941	23272.4961	28281.6035	36092.2578	19762.9492	17291.6836	14159.7686	17243.1445	17553.332	17252.3691	22607.7129	20261.6426	22385.9414	13352.8174	21440.6113	17753.418	14499.3994	27699.0469
0.8005	18852.5918	35059.0078	27535.0859	24155.8652	25508.4902	33316.9453	18383.2734	24237.6523	16836.0391	17271.5703	22070.1777	17039.8613	21197.3594	21356.6582	19829.5664	13342.2422	19184.4238	22926.1348	16992.1465	24706.5938
0.934	24003.4414	32558.0117	28884.1055	23145.9414	22672.3887	29200.6426	16923.1914	30528.8418	18029.7617	15896.7227	26727.1406	15467.0059	20013.2305	19290.1582	16369.7168	15046.9385	17289.9629	23539.7031	23028.5078	21432.6758
1.0674	25170.543	26489.082	26293.834	20209.0352	20051.4258	26390.2793	16498.4336	32795.8242	15545.874	14474.7393	25609.9395	14795.0195	19852.3926	16958.2559	14877.8496	16227.71	15132.6699	18767.2266	28182.625	18714.2227
1.2008	24081.6172	25452.4766	22673.7695	18156.6855	19120.5078	24542.0684	17003.1777	27504.0762	13326.1367	13245.7559	21261.9121	15013.4297	19736.748	15669.6221	14729.9561	15619.7461	14390.5684	17757.916	26413.7324	17317.0469
1.3342	21751.4688	23626.582	19702.498	16332.7588	19997.752	22775.0859	18109.6211	24452.4102	13111.875	13195.4727	18851.709	14530.8223	19770.8691	15293.501	15968.168	14224.2783	14418.6143	17377.0859	22957.4238	16768.3926
1.4676	19729.8848	21945.0352	20007.3359	16181.46	19336.1387	22704.5332	17306.4531	24497.6133	13607.5625	13858.4033	18155.7969	15163.5957	20503.7559	14628.6982	16597.0684	13781.1387	14519.6592	18420.6855	22349.6523	15055.998
1.6011	17578.2383	22188.8809	20127.3281	15975.7139	20003.3633	22696.6582	17690.3047	28057.2402	13571.0283	13647.8057	18549.793	15058.8174	20134.543	14652.8711	15724.4814	13328.5781	14346.708	18307.2617	22185.4961	14536.0303
1.7345	16961.2109	20829.6445	21691.8203	16507.1855	19717.5918	23073.1035	17298.3867	28582.8438	14259.7041	13953.1016	18880.6953	15503.1875	18162.1777	14628.9463	15655.0225	14516.0098	13892.6572	18546.8008	20539.2363	13343.7998
1.8679	16846.5586	21812.0156	22447.1855	16478.2461	19523.8945	23482.4258	17444.4512	27677.9258	14525.5029	14084.7168	18306.0195	14813.0938	16785.6914	14835.6719	15649.3242	14769.9492	13790.5059	19990.0273	19338.9766	13240.1738
2.0013	17370.8594	21914.6055	23666.0488	17613.2227	17901.9238	22124.6992	18785.7676	24771.8867	14250.2451	14701.3604	18411.6094	15032.6064	14933.7822	14360.3438	14512.1768	17546.7656	12217.4141	21054.5508	18874.9258	13176.2822
2.1347	16334.7559	21079.3438	22672.1348	18174.6328	16976.6406	20357.5605	18119.6172	22915.0039	14985.667	16274.2256	19128.8906	14684.2812	13958.3564	14346.8721	15083.7549	21388.0781	12231.4746	19676.6992	18039.4531	13877.1523
2.2682	17215.9727	21185.8359	22866.9883	19113.8555	16461.334	20489.2031	16893.0156	19332.5703	15390.584	17577.0176	18764.1094	14644.7227	13239.9561	15313.8271	15244.9756	23291.5176	12317.8496	18279.1641	18827.2441	14266.7842
2.4016	18625.9688	20087.0312	21911.5781	19898.7578	15604.168	20642.998	16245.9883	18036.2656	16336.3857	18262.2109	19267.4512	15744.3457	13252.6113	17243.6445	14440.1279	23921.4551	13198.124	16090.543	18468.3984	15080.4922
2.535	22192.3516	19473.1562	21483.3945	20681.8262	14634.3613	21029.2109	15517.5986	16472.3066	17710.0078	16313.3564	18601.7031	17009.5273	13582.7207	18551.6035	14943.083	21452.7031	14173.8643	15795.6201	16482.6055	16009.0723
2.6684	23297.4668	19860.0703	22454.0938	21239.8574	15707.001	20539.4746	16312.1484	17596.8809	18202.6543	14456.4248	18687.0254	15171.2539	13736.3262	18837.3613	14200.2949	18600.8359	13464.3721	16552.252	16027.6055	16927.3574
2.8019	21880.582	20948.959	22531.3652	19555.0059	16414.9648	19256.5684	15997.0176	18517.2637	16124.5654	14385.6768	17255.3281	12555.3975	13428.9844	16344.1104	13552.1865	16048.6641	14786.4336	16892.7305	16759.4844	18899.416
2.9353	19275.9121	21139	20632.9199	17271.8398	16886.4629	18030.248	16007.5576	19510.6426	15292.5322	13808.7715	16714.2617	11493.9072	12852.0156	14704.124	12896.2783	14977.0791	15016.4141	18025.0977	17170.4453	22279.4238
3.0687	17529.5762	19130.0684	18824.4434	15717.4697	16013.4502	17198.0664	15660.7773	19556.0488	14590.623	13573.9023	16396.2695	10803.7451	12962.4922	13377.5723	12266.0127	15318.7471	14352.7217	18071.3652	15598.9434	23677.4551
3.2021	16757.9883	18367.8848	16434.0703	13928.2412	15027.7812	15505.8682	14554.8984	18379.7227	13645.3564	13497.6826	16343.4287	10544.335	12435.4902	13723.04	12373.5469	14866.3545	13498.3408	17294.5879	13434.3584	21555.0957
3.3355	15748.7705	17403.9531	15203.2051	13984.4521	13898.2939	14994.0518	13810.9785	16432.7227	12965.8486	13059.3467	15662.4502	10944.1016	12816.1045	16235.7236	11938.3721	NaN	12659.1152	16349.1855	12805.3428	18655.2676
3.469	15540.9668	17348.7891	13721.1553	13570.1475	13450.2812	14691.3828	13696.6416	15755.1641	11884.2402	13326.8477	14953.3945	11040.7363	11983.3652	20131.5938	12564.0049	NaN	12906.9775	14564.6416	13125.8037	17074.1016
3.6024	15969.3643	17165.1543	12756.9863	12064.8389	13492.0098	16237.1816	13369.6836	15489.167	11977.2061	12012.252	14680.6621	11133.8975	11963.6494	22143.6152	12348.8408	NaN	12268.8125	14175.1758	12621.8535	15370.498
3.7358	15695.8047	19514.7676	12160.8779	11890.5742	NaN	NaN	13283.8271	15110.5088	10811.6035	13698.0605	14593.2334	NaN	12723.9502	18168.9648	12176.6123	NaN	NaN	14053.2021	12103.1846	NaN
3.8692	15861.5684	NaN	12771.4775	12068.2754	NaN	NaN	13215.1377	14730.6738	NaN	13125.4766	15081.2598	NaN	13540.165	16463.6562	12335.4131	NaN	NaN	13345.1963	11807.126	NaN
4.0027	14857.9668	NaN	NaN	13085.4082	NaN	NaN	NaN	14891.1895	NaN	NaN	15333.3193	NaN	12890.2109	14421.5645	NaN	NaN	NaN	13396.4189	12143.3955	NaN
4.1361	13628.0605	NaN	NaN	13754.1865	NaN	NaN	NaN	13995.873	NaN	NaN	15884.0488	NaN	NaN	14958.3193	NaN	NaN	NaN	13560.377	12295.7461	NaN
4.2695	14249.9648	NaN	NaN	14541.0146	NaN	NaN	NaN	14954.6016	NaN	NaN	NaN	NaN	NaN	14508.5693	NaN	NaN	NaN	13019.6992	NaN	NaN
4.4029	NaN	NaN	NaN	NaN	NaN	NaN	NaN	NaN	NaN	NaN	NaN	NaN	NaN	14415.2617	NaN	NaN	NaN	NaN	NaN	NaN
4.5363	NaN	NaN	NaN	NaN	NaN	NaN	NaN	NaN	NaN	NaN	NaN	NaN	NaN	14610.0967	NaN	NaN	NaN	NaN	NaN	NaN
4.6698	NaN	NaN	NaN	NaN	NaN	NaN	NaN	NaN	NaN	NaN	NaN	NaN	NaN	NaN	NaN	NaN	NaN	NaN	NaN	NaN
4.8032	NaN	NaN	NaN	NaN	NaN	NaN	NaN	NaN	NaN	NaN	NaN	NaN	NaN	NaN	NaN	NaN	NaN	NaN	NaN	NaN
4.9366	NaN	NaN	NaN	NaN	NaN	NaN	NaN	NaN	NaN	NaN	NaN	NaN	NaN	NaN	NaN	NaN	NaN	NaN	NaN	NaN
5.07	NaN	NaN	NaN	NaN	NaN	NaN	NaN	NaN	NaN	NaN	NaN	NaN	NaN	NaN	NaN	NaN	NaN	NaN	NaN	NaN
5.2035	NaN	NaN	NaN	NaN	NaN	NaN	NaN	NaN	NaN	NaN	NaN	NaN	NaN	NaN	NaN	NaN	NaN	NaN	NaN	NaN
5.3369	NaN	NaN	NaN	NaN	NaN	NaN	NaN	NaN	NaN	NaN	NaN	NaN	NaN	NaN	NaN	NaN	NaN	NaN	NaN	NaN
5.4703	NaN	NaN	NaN	NaN	NaN	NaN	NaN	NaN	NaN	NaN	NaN	NaN	NaN	NaN	NaN	NaN	NaN	NaN	NaN	NaN
5.6037	NaN	NaN	NaN	NaN	NaN	NaN	NaN	NaN	NaN	NaN	NaN	NaN	NaN	NaN	NaN	NaN	NaN	NaN	NaN	NaN
5.7371	NaN	NaN	NaN	NaN	NaN	NaN	NaN	NaN	NaN	NaN	NaN	NaN	NaN	NaN	NaN	NaN	NaN	NaN	NaN	NaN
5.8706	NaN	NaN	NaN	NaN	NaN	NaN	NaN	NaN	NaN	NaN	NaN	NaN	NaN	NaN	NaN	NaN	NaN	NaN	NaN	NaN
