0.00000,36691.172
0.13342,35299.980
0.26684,35503.367
0.40027,34631.453
0.53369,33682.629
0.66711,33742.328
0.80053,34352.230
0.93395,36044.559
1.06737,35202.391
1.20080,35546.727
1.33422,36034.133
1.46764,36907.082
1.60106,37871.434
1.73448,38309.512
1.86791,38870.992
2.00133,44305.461
2.13475,51870.418
2.26817,78503.742
2.40159,109962.961
2.53502,115629.695
2.66844,82046.055
2.80186,56429.613
2.93528,48400.266
3.06870,40350.992
3.20212,38492.684
