X,Y
0.00000,15003.958
0.13342,14994.688
0.26684,14323.095
0.40027,14545.467
0.53369,14614.272
0.66711,14967.312
0.80053,14550.956
0.93395,14812.969
1.06737,15186.724
1.20080,15418.844
1.33422,15488.216
1.46764,16287.995
1.60106,18673.176
1.73448,21583.793
1.86791,25080.574
2.00133,24873.789
2.13475,19591.875
2.26817,16423.457
2.40159,15445.296
