0.00000,14604.489
0.13342,15343.352
0.26684,15538.862
0.40027,16759.381
0.53369,20854.219
0.66711,25607.041
0.80053,26844.859
0.93395,24638.111
1.06737,22996.617
1.20080,22180.646
1.33422,20139.186
1.46764,19029.037
1.60106,17744.090
1.73448,17596.535
1.86791,17086.232
2.00133,16955.998
2.13475,15317.738
2.26817,13826.172
2.40159,13089.964
2.53502,13552.553
2.66844,13066.007
