X,Y
0.00000,13378.439
0.13342,14821.830
0.26684,16807.168
0.40027,18638.766
0.53369,17786.256
0.66711,18834.113
0.80053,17995.619
0.93395,15211.514
1.06737,12895.712
1.20080,12266.356
1.33422,12163.579
1.46764,12509.022
