0.00000,35814.051
0.13342,35542.207
0.26684,35782.578
0.40027,33997.023
0.53369,37033.168
0.66711,37411.293
0.80053,35508.508
0.93395,36112.793
1.06737,37022.223
1.20080,36977.875
1.33422,38443.402
1.46764,36511.730
1.60106,39194.523
1.73448,47161.168
1.86791,64157.156
2.00133,80455.750
2.13475,77003.438
2.26817,59306.086
2.40159,45320.586
2.53502,41736.656
2.66844,39921.719
