x	Y_20180130_15109_43_1g
0	24284.75
0.1334	23782.984
0.2668	23048.922
0.4003	23473.379
0.5337	22253.02
0.6671	24161.76
0.8005	24694.697
0.934	22164.168
1.0674	24541.754
1.2008	22998.287
1.3342	23797.184
1.4676	23821.307
1.6011	25538.76
1.7345	26492.434
1.8679	30061.385
2.0013	39964.902
2.1348	58048.836
2.2682	64688.133
2.4016	51179.625
2.535	35433.371
2.6684	27039.951
2.8019	26217.447
2.9353	NaN
3.0687	NaN
3.2021	NaN
3.3356	NaN
3.469	NaN
3.6024	NaN
3.7358	NaN
3.8692	NaN
4.0027	NaN
4.1361	NaN
4.2695	NaN
4.4029	NaN
4.5363	NaN
