x	Y_20180514_15100b_12_2g	Y_20180514_15100b_14_9g	Y_20180514_15100b_16_10g	Y_20180514_15100b_25_3g
0	15104.453	9915.214	12321.483	11015.3
0.1334	14632.159	17300.609	12148.249	10840.136
0.2668	13535.94	20129.432	12346.452	10985.159
0.4003	13490.466	22212.373	11925.253	11580.242
0.5337	14893.208	19686.881	11713.455	13141.117
0.6671	18405.023	17394.338	12142.658	16910.676
0.8005	20950.35	16460.051	13657.453	20551.672
0.934	20920.121	15957.839	16221.294	19077.76
1.0674	18951.666	16320.976	17689.375	18232.715
1.2008	18453.211	16795.016	18258.762	18004.111
1.3342	18013.299	14839.531	16997.064	17961.537
1.4676	17186.58	15146.762	16440.797	18055.477
1.6011	15932.01	14742.812	15665.722	17744.18
1.7345	16617.898	14490.64	17284.873	16689.436
1.8679	17258.451	15486.425	16502.178	16330.315
2.0013	17311.484	15842.033	16469.305	17057.074
2.1348	16433.637	16568.291	17363.01	17805.566
2.2682	16655.896	16191.014	18045.27	18461.719
2.4016	16564.416	16026.746	19067.285	18524.328
2.535	16924.014	15368.205	18321.824	19529.781
2.6684	15644.536	14594.651	18217.234	18723.82
2.8019	14678.146	14651.098	17125.158	17611.926
2.9353	14429.502	13783.142	16368.243	18425.883
3.0687	13587.581	13168.959	16536.264	17993.74
3.2021	12716.568	12874.746	16034.599	17423.361
3.3356	13117.232	13239.475	16280.789	16870.094
3.469	13271.409	12900.79	15610.103	15922.77
3.6024	13224.027	13319.204	14875.62	14898.915
3.7358	13398.675	13248.249	14587.381	14872.636
3.8692	13531.672	NaN	14926.629	13917.358
4.0027	13895.489	NaN	14138.704	13765.346
4.1361	13870.583	NaN	13722.482	NaN
4.2695	NaN	NaN	13452.313	NaN
4.4029	NaN	NaN	NaN	NaN
4.5363	NaN	NaN	NaN	NaN
4.6698	NaN	NaN	NaN	NaN
