0.00000,12379.419
0.13342,12833.755
0.26684,14040.292
0.40027,15576.665
0.53369,17358.898
0.66711,17464.059
0.80053,17238.957
0.93395,16118.273
1.06737,14664.207
1.20080,14389.303
1.33422,14586.411
1.46764,15127.860
1.60106,14398.525
1.73448,13240.395
1.86791,13006.898
2.00133,13635.870
2.13475,12987.708
2.26817,12759.979
2.40159,12460.050
2.53502,12166.059
