x	Y_20180514_15100_1_3g	Y_20180514_15100_1_7g	Y_20180514_15100_10_5g	Y_20180514_15100_11_2g	Y_20180514_15100_11_5g	Y_20180514_15100_12_1g	Y_20180514_15100_12_7g	Y_20180514_15100_12_9g	Y_20180514_15100_13_1g	Y_20180514_15100_13_2g	Y_20180514_15100_13_7g	Y_20180514_15100_13_8g	Y_20180514_15100_14_2g	Y_20180514_15100_14_8g	Y_20180514_15100_16_2g	Y_20180514_15100_16_3g	Y_20180514_15100_16_7g	Y_20180514_15100_17_3g	Y_20180514_15100_19_1g	Y_20180514_15100_19_2g	Y_20180514_15100_19_3g	Y_20180514_15100_21_2g	Y_20180514_15100_23_11g	Y_20180514_15100_23_1g	Y_20180514_15100_23_2g	Y_20180514_15100_23_3g	Y_20180514_15100_23_5g	Y_20180514_15100_25_1g	Y_20180514_15100_26_2g	Y_20180514_15100_27_2g	Y_20180514_15100_27_5g	Y_20180514_15100_28_4g	Y_20180514_15100_28_5g	Y_20180514_15100_28_6g	Y_20180514_15100_28_7g	Y_20180514_15100_3_2g	Y_20180514_15100_3_4g	Y_20180514_15100_30_2g	Y_20180514_15100_30_8g	Y_20180514_15100_31_2g	Y_20180514_15100_31_3g	Y_20180514_15100_31_4g	Y_20180514_15100_31_5g	Y_20180514_15100_32_2g	Y_20180514_15100_33_1g	Y_20180514_15100_33_4g	Y_20180514_15100_4_13g	Y_20180514_15100_4_9g	Y_20180514_15100_5_3g	Y_20180514_15100_5_4g	Y_20180514_15100_6_2g	Y_20180514_15100_6_6g	Y_20180514_15100_7_6g	Y_20180514_15100_7_9g	Y_20180514_15100_8_2g	Y_20180514_15100_8_4g	Y_20180514_15100_8_5g	Y_20180514_15100_9_6g
0	14504.9238	14732.2002	15949.9766	12948.5898	13323.3271	16532.8008	13080.1416	13531.2422	14164.4756	14741.7246	13443.5205	15288.2129	13859.5879	14144.3594	17341.3145	13538.3242	12907.1982	14159.4033	14432.1152	17130.3066	16261.9932	14187.5713	13722.0605	13741.5371	13372.5889	14996.8809	14768.5469	16916.3574	11531.6113	14630.8984	11953.4004	11338.2051	14638.0547	14383.5146	18272.3789	16069.6445	11452.0996	13287.1406	15681.0664	16470.3438	13855.9014	12368.1201	15139.6387	12050.1943	13308.8311	15743.4004	14416.7588	16586.5117	15407.9844	13628.043	14262.5918	16913.1738	12967.6006	13378.3867	13875.5273	13257.2969	16503.9512	12153.4795
0.1334	15731.6133	14926.1953	15438.0928	12789.8682	14155.8643	17265.1035	14251.5361	13554.6807	13764.7812	15381.7725	13635.6807	15573.4043	16599.084	14618.8652	17002.0469	13352.3584	13468.0361	14827.7344	14742.7656	18622.1133	15809.3115	14000.498	13955.3027	14259.3359	13137.8818	15580.8789	16183.043	19445.9062	11891.8545	17231.1191	11881.4473	10961.1641	15578.2832	17247.0234	18377.9922	16528.207	13036.1758	13832.042	16067.5996	16926.5195	14483.2852	12393.5674	16380.1914	12554.7051	14837.0527	14631.0205	16067.6768	16322.7314	16109.4277	13506.793	15694.6758	19410.6133	13487.5791	14307.8545	13694.8174	14520.6758	18834.0312	13439.3008
0.2668	19864.9199	14444.4141	19062.2246	13406.5215	13941.6396	20732.2344	14041.2803	14544.4287	13999.3555	18041.3203	14248.8564	15310.9189	20119.1738	15091.5674	17819.7461	14322.2695	15280.0127	16813.8945	17405.6523	21271.0215	15394.4795	15347.3721	15798.7012	16325.2617	13274.9795	17941.1426	20012.959	23486.0137	13087.5566	23823.7949	13935.2578	12111.9248	17382.0312	20364.5703	19031.0273	19301.8555	12549.5586	14951.9736	17670.1953	18177.7812	15885.0117	14414.1465	16934.0332	15542.2031	16295.5918	15055.3174	19252.3047	18020.8477	19611.7148	14980.2471	17333.8066	22269.1699	14522.1797	14188.4287	14852.8223	15053.5322	21418.2715	13771.3975
0.4003	25383.8008	18506.9512	22207.2051	14385.1768	15056.8145	25029.1406	14137.8682	16367.667	13988.7939	22787.4531	15562.9512	16474.5078	19303.7441	16797.3613	20234.6738	15467.9424	18256.3008	20924.3047	22490.0684	23115.1992	17171.7188	17507.4453	17808.6777	21677.6641	13225.4512	23475.2637	23357.9844	29258.498	14826.5674	28806.1348	17138.375	13043.1729	19993.9902	19588.4512	20244.2715	24191.0488	12820.2373	17205.4258	20813.9395	22355.8047	18102.1172	17528.4102	17950.8281	19890.2383	20198.0254	16042.8018	26234.8457	23019.8379	25215.2324	17168.9688	20192.9688	24548.041	16776.2441	15860.6377	17545.8594	18018.5195	18322.1445	15660.3086
0.5337	28875.1016	24273.5352	20591.1973	20117.9609	16008.583	25341.4277	15586.8965	19442.9766	14125.8604	29201.2246	18225.7812	18593.834	15749.3926	20367.6758	23501.2168	18143.6719	20291.9395	25977.6504	26576.502	25304.3613	19713.168	20133.6797	19408.5703	23722.4492	14123.4551	29488.2012	23679.1172	30264.9883	18277.7871	27496.6875	24341.293	15830.0967	19980.1816	17118.5137	26609.7578	26485.2949	14448.0703	23822.3574	25262.6836	23708.9941	19865.5293	22791.7441	22691.1113	25391.8574	21603.5996	17942.9453	30500.7188	26211.5586	28644.6445	20736.5684	22335	20686.0762	19017.7715	20442.4688	20406.1152	19204.6113	15529.8975	17342.0508
0.6671	27104.1992	23403.9238	18786.041	24453.1035	19113.9004	19514.3418	18962.8887	21487.916	17789.4121	28680.1348	20421.2969	20774.9336	14274.5967	25169.0957	22809.6699	24383.7129	21972.1973	25058.1191	25564.3164	24246.623	23951.1758	22437.5176	17714.7188	23277.4473	15319.8535	30326.9727	19760.373	25094.9219	19746.334	21138.8203	32426.3066	19592.7773	19736.0449	16086.1562	31532.0996	22133.2441	15626.3926	26596.6621	26719.8359	25326.9766	19889.457	25918.1367	28788.6211	28402.6699	19849.4473	22084.9512	25677.8105	21680.5723	25452.7227	28243.6152	21597.7988	17254.4922	20764.6719	19720.7734	19903.0078	18619.3984	15728.9014	18387.0449
0.8005	21108.1855	20186.0625	17166.2109	23051.6914	18951.6992	15058.1514	21124.7051	20799.8672	21399.8418	24157.2227	20158.3887	20314.2441	14630.6963	27588.127	20450.9746	28697.5625	19462.8125	21670.4668	22048.4551	19793.5801	26179.7734	20655.582	16028.5244	20942.9883	17221.3945	26355.25	18793.7129	20587.4316	19572.1777	18986.1602	32596.5078	19611.7812	20974.6641	16816.2754	27934.1211	19698.3945	16488.9102	22197.9746	24283.0156	23899.2051	20982.1914	23123.4043	31274.2754	25621.7852	19041.1621	25288.5898	20129.1914	17917.1484	20139.3086	33770.5586	18490.0703	15440.9365	20469.8379	17986.9883	18806.207	16649.4375	17180.332	17073.1406
0.934	18093.1172	17909.916	15093.7998	18200.4258	16749.752	14325.292	18925.9551	18341.4531	23602.6367	24038.332	17383.3184	18055.3867	14130.6328	26076.2617	19788.0059	24772.377	17357.125	20783.3809	18153.2363	16846.832	23370.584	17236.8262	14668.9688	19593.0391	17688.6641	22973.9062	19054.2734	18187.9082	18651.4844	18020.8086	28686.248	17504.7754	19475.334	16732.3164	22216.8828	17534.3672	16858.4766	19508.1133	22634.6055	20507.8105	20173.5449	20709.2598	26522.5215	21545.7715	18033.4531	22604.1172	16943.6777	18365.2324	18278.9336	31430.1094	16616.8184	15683.8467	18477.4316	18617.3867	18659.6914	15615.6201	17612.0957	16627.8281
1.0674	16543.2793	16669.2734	14240.7363	16469.1895	14331.4385	14634.7441	16818.7266	16057.7266	22427.4863	22978.2266	16408.4453	16100.0498	15342.167	23211.9941	18109.0547	19556.1953	15841.9395	19163.6621	17251.9082	15140.4746	18362.8535	14914.5977	15168.2891	19766.5957	16636.2891	21174.1133	19695.4297	16800.1328	16952.5938	16435.8027	26288.2383	16139.0176	16793.1074	15381.8125	17367.5469	16614.7949	17600.1602	17552.6348	22051.8477	19049.8906	18594.002	18618.6035	23702.5234	19199.1055	20535.5234	21445.2832	15555.751	19750.8574	18229.457	25874.7109	15682.542	15019.2363	17819.3945	17136.75	18668.2754	13952.0723	17925.8828	15313.0635
1.2008	17490.8164	16447.0566	14142.9707	15861.6602	13320.4424	18501.5664	15952.043	15344.2012	20094.2695	21988.0254	16436.3438	16607.8984	15624.6855	20785.9707	16345.833	17734.0117	16560.6562	18113.752	16168.4502	14857.292	16087.5713	14457.1543	14493.5391	18687.0059	16075.7705	20970.5352	19466.3438	16400.3633	16305.5352	14689.9668	25147.873	16166.2529	15188.3115	15095.9434	16588.082	16203.5332	15560.1973	17341.8242	20843.1992	18621.6738	17877.6836	19085.2285	20693.0664	17617.7129	23848.9043	22966.5469	15370.6787	20307.3359	18442.0527	21590.0098	14008.5527	15556.0225	16987.7734	16212.585	16425.168	14289.4336	17326.3945	14585.1338
1.3342	17112.377	16808.5938	14164.7725	15761.6982	12945.3867	19969.0801	16153.2373	14198.2197	19146.5723	22849.4961	17632.832	16255.4775	16521.0117	20485.3574	16078.8672	15747.998	15429.7686	15973.5908	15520.2881	15358.0527	15533.4814	13929.5977	14921.5801	19001.8223	15253.8311	19528.2637	20830.7402	15631.3037	15581.0156	15051.5977	22169.7617	16242.0303	14520.2295	16622.6016	15214.1875	16989.957	15102.1699	17322.9277	21257.6211	18407.9766	16932.3008	17139.3945	17580.0547	16620.5273	21553.8965	22253.4512	15069.3955	21596.0566	19641.4648	19360.7656	13528.1816	17006.7734	15153.0537	15719.8838	15430.6045	14604.7119	16683.8008	16051.3369
1.4676	16782.4141	15354.0898	14225.4414	14460.3633	12581.1602	22440.332	15778.0801	13659.5273	17836.5918	20357.6191	15697.3711	16057.0752	17210.8262	20708.2832	17573.6074	15050.8691	14187.6406	15439.1006	14511.1299	16572.7168	16232.7891	14382.2559	15286.5469	17954.3828	14282.6826	19952.3203	19748.9492	15680.4883	16656.6035	14784.3164	20918.2441	15787.7529	14596.7773	15875.6035	15620.0508	18081.2695	14157.5312	16181.8193	18512.4277	17795.2266	16189.1074	16593.7324	16253.8711	15251.2754	19015.4824	19528.5059	16331.6934	21028.5039	19166.4121	18689.6777	14046.5146	17224.1191	14571.6045	16505.5234	15573.0967	15525.3301	15398.002	16579.9316
1.6011	17784.3105	16788.9961	14885.6768	13685.5225	12193.3008	24254.6992	16304.1611	12577.4863	18757.4102	20696.2695	15727.2021	16512.1113	16538.9355	20582.8691	19999.3691	15360.498	15081.7412	16157.0078	13215.8076	20137.6895	15398.541	14828.9434	15861.1035	15836.7031	13345.0225	18647.293	18940.2109	16468.6836	17081.9395	14715.6924	20442.623	15789.6426	14592.1836	15110.7783	16031.0957	18413.1074	13764.0986	14431.9707	17002.7793	19070.0176	15868.1943	16331.0703	16035.4297	15587.4297	17461.3125	19177.1992	14830.3281	19647.0957	18721.2969	18239.0059	14887.415	15570.9346	13364.5752	18789.1406	15516.585	16515.416	15200.0635	16786.9082
1.7345	16410.9043	16427.0996	14532.001	14152.5918	12443.4004	21648.1328	17883.5742	12364.5801	19581.8984	18626.4922	15033.9795	15938.0332	16349.4658	18604.4688	21152.3418	18180.416	16500.168	16487.9512	12918.0254	21322.2715	15467.832	14135.8955	15138.9707	15184.6035	12974.0107	17441.8945	19534.8926	15469.5146	17999.2539	14800.4238	21686.3145	14316.6318	13928.3428	13946.6465	16216.4629	20916.9512	14084.0088	14664.1357	15303.166	18502.3438	16454.1133	16059.0322	17010.3262	16692.3516	15022.127	18627.0176	15887.5186	19095.4121	19007.7012	18665.8691	14209.8506	15444.0234	14096.875	19535.9746	16035.6592	17503.834	14235.6309	17096.0605
1.8679	14649.9756	15465.6113	14031.5254	14221.1797	12094.4961	17818.3027	20002.0508	11526.4707	21617.2969	18837.3594	15815.9902	15226.9922	15618.9268	17186.8281	20052.332	19436.1328	17288.5977	15055.8779	14146.0342	19824.9043	15792.5342	14405.7656	13811.5254	14227.9404	12932.9209	15664.7295	18937.2422	14763.126	18805.7617	14791.9648	21237.9043	13837.9941	13741.79	12708.2314	16968.752	20774.9414	13593.749	15237.0762	13879.4688	19053.166	16878.7207	16007.1602	16612.4375	18226.7383	16370.8916	18346.0078	15699.4072	19334.1426	18232.4941	18029.7969	14291.2842	14244.416	14345.5078	17734.6777	14515.1465	16793.2363	14601.2891	16971.8691
2.0013	14356.3262	12771.6006	14026.833	13916.4941	12259.2861	14868.7109	20720.0703	12622.1709	23005.2461	20548.8809	16153.4434	14898.0039	14349.0859	16238.1172	18714.5664	19873.5918	16893.7227	14519.8818	15889.2832	16841.4961	16136.0752	13886.1191	12895.4033	14539.7324	12913.3955	15010.4658	18262.4316	14465.6367	19219.8652	13236.2393	20542.4082	15113.9717	13451.0615	12426.1611	16326.8604	18445.8145	14173.2461	14585.2861	13478.376	19765.9941	15984.3584	15864.5137	15711.1064	19495.459	17245.7969	16554.7793	15479.0459	18534.3398	17722.877	17057.0273	14270.001	14536.4199	13929.667	15092.9004	14423.752	14952.2822	13251.793	16458.4785
2.1347	13565.3711	12633.5049	13058.7832	13000.4062	12336.5439	14495.5068	21338.1484	12995.4268	21808.7891	22081.1953	14867.1006	13780.8604	13448.332	15233.0723	16774.8164	18952.2891	15551.043	14152.4453	17983.1465	15865.1094	15774.4189	13727.252	12209.1943	13575.6797	12775.2217	14514.1738	16297.7871	13508.0186	17913.3496	13205.2578	17350.1777	15222.3662	13920.833	12627.9854	14921.6328	16640.082	14182.6973	13299.4365	13750.1777	17377.1953	14651.5967	15473.7119	15065.1689	19565.4023	15258.7041	14569.4619	15180.5693	17024.2148	17174.3633	17095.3184	13340.1582	12892.167	14844.25	14005.6504	14232.1201	13929.4707	13324.2568	15388.2305
2.2682	13439.1162	12516.333	12204.4336	12749.8115	13225.665	13619.8252	20480.5742	12866.2588	18603.4258	18835.4863	15020.1133	13922.0742	12695.7178	14016.6816	15147.9346	17467.0039	14496.0771	14023.7822	18629.9043	15331.2031	15724.498	13779.3281	12197.1729	13993.5771	13642.5479	14693.5615	15539.4141	13775.2715	15996.6953	12991.9883	15264.4004	15641.6006	14147.9473	12749.0205	15618.8369	15319.459	NaN	13105.2461	14250.1426	16539.9258	14706.9453	14974.4346	13568.96	17717.3223	13746.1465	15872.8291	14606.1885	15912.3965	16238.375	15730.9102	12540.8877	13115.5088	14465.8711	13187.166	14630.7393	14132.3984	13352.4121	14139.667
2.4016	12758.7002	12520.1152	12217.4658	13369.0176	14091.3105	14414.7207	18725.2402	12563.1357	16338.6895	16830.8301	14227.8125	13320.0723	12769.0166	13528.1914	15131.5596	15874.0176	13673.1826	13902.2471	18285.3926	14763.8184	15279.5771	12986.9932	12807.7393	13404.457	14590.9893	14888.9395	15125.1084	13975.7256	15056.9756	13496.7539	13734.541	14892.6104	12934.8467	12026.9785	14179.6943	15253.126	NaN	12614.9014	13340.3379	16233.0967	14700.8877	14004.8008	13062.959	15801.832	13271.8652	14115.7344	14644.7988	15798.4639	14840.2939	14081.6016	13314.0156	12963.1875	14275.0654	13427.166	13631.6719	13277.7168	13351.4561	13744.1055
2.535	12877.8701	12389.5576	12059.2715	12960.2139	13651.0576	14284.1104	17577.9082	12965.6807	14297.5195	14569.5957	14433.793	13776.2559	13453.9648	12572.0479	14835.4629	15111.9805	13478.4893	13975.0352	16405.2617	15029.3838	14824.8936	13075.3154	12586.3828	13917.2305	14770.6367	NaN	14520.0615	13043.8418	15614.6914	13259.71	14234.832	14041.1943	NaN	11988.9805	NaN	14771.1553	NaN	12931.2451	13831.2334	14814.9424	14434.3496	13606.5762	12394.6416	14868.9023	13136.0479	13816.0098	13586.3223	15279.3545	13860.625	13363.2129	13344.8994	12849.0293	14476.2451	12393.8545	13860.1045	13147.54	14068.3721	12867.2646
2.6684	13428.7617	NaN	11826.4316	12691.6465	13568.8643	14293.5645	16106.54	12823.6904	13686.8154	14655.3779	13723.6396	14126.0615	12859.085	11711.0479	14550.124	14904.4326	13598.8643	NaN	16267.7227	NaN	15077.207	12952.0498	12622.0039	NaN	14317.8115	NaN	14360.541	14168.1445	14923.4434	NaN	14651.0039	13922.709	NaN	NaN	NaN	14485.0615	NaN	13087.8125	13962.1035	NaN	15424.5635	13121.6406	12544.2617	14335.0762	NaN	13739.3301	13899.7959	16385.6094	13969.8066	12939.71	13618.2773	NaN	14622.3789	12879.2139	13739.9834	13001.7939	NaN	14010.3584
2.8019	13035.9873	NaN	NaN	13186.7227	13086.0225	NaN	15980.4482	NaN	13529.0566	14235.7607	13909.5918	NaN	NaN	11485.7344	14799.8682	14289.4639	13533.3828	NaN	16295.0117	NaN	15350.624	12414.5566	NaN	NaN	14149.1211	NaN	14579.3506	14051.1426	NaN	NaN	14933.0156	14901.4395	NaN	NaN	NaN	14653.0713	NaN	12751.4443	13165.8379	NaN	14478.1367	12716.8691	12895.4512	13825.6445	NaN	NaN	14568.3857	17232.6953	NaN	13437.208	13768.0566	NaN	NaN	12951.249	13998.9316	NaN	NaN	13946.0381
2.9353	NaN	NaN	NaN	NaN	13205.6826	NaN	15567.1836	NaN	13241.0957	13828.4785	13734.9902	NaN	NaN	12319.9453	NaN	NaN	NaN	NaN	15034.4004	NaN	14722.7969	NaN	NaN	NaN	13515.9531	NaN	NaN	13785.3477	NaN	NaN	14200.8662	NaN	NaN	NaN	NaN	13848.2412	NaN	13130.4951	13383.3984	NaN	13913.9326	12945.9375	12626.2422	14039.8271	NaN	NaN	NaN	NaN	NaN	12726.7539	13549.3779	NaN	NaN	13345.3906	13669.3428	NaN	NaN	NaN
3.0687	NaN	NaN	NaN	NaN	NaN	NaN	15639.1816	NaN	13611.582	NaN	NaN	NaN	NaN	11775.7061	NaN	NaN	NaN	NaN	14896.3916	NaN	14538.6943	NaN	NaN	NaN	13972.6611	NaN	NaN	NaN	NaN	NaN	NaN	NaN	NaN	NaN	NaN	NaN	NaN	13131.4346	13618.5293	NaN	13879.3945	13752.6836	13022.4521	14167.4648	NaN	NaN	NaN	NaN	NaN	13070.208	NaN	NaN	NaN	NaN	NaN	NaN	NaN	NaN
3.2021	NaN	NaN	NaN	NaN	NaN	NaN	15090.5723	NaN	12538.3867	NaN	NaN	NaN	NaN	NaN	NaN	NaN	NaN	NaN	NaN	NaN	14978.0273	NaN	NaN	NaN	NaN	NaN	NaN	NaN	NaN	NaN	NaN	NaN	NaN	NaN	NaN	NaN	NaN	NaN	NaN	NaN	NaN	NaN	NaN	NaN	NaN	NaN	NaN	NaN	NaN	NaN	NaN	NaN	NaN	NaN	NaN	NaN	NaN	NaN
3.3355	NaN	NaN	NaN	NaN	NaN	NaN	14545.9131	NaN	NaN	NaN	NaN	NaN	NaN	NaN	NaN	NaN	NaN	NaN	NaN	NaN	14385.6768	NaN	NaN	NaN	NaN	NaN	NaN	NaN	NaN	NaN	NaN	NaN	NaN	NaN	NaN	NaN	NaN	NaN	NaN	NaN	NaN	NaN	NaN	NaN	NaN	NaN	NaN	NaN	NaN	NaN	NaN	NaN	NaN	NaN	NaN	NaN	NaN	NaN
3.469	NaN	NaN	NaN	NaN	NaN	NaN	NaN	NaN	NaN	NaN	NaN	NaN	NaN	NaN	NaN	NaN	NaN	NaN	NaN	NaN	NaN	NaN	NaN	NaN	NaN	NaN	NaN	NaN	NaN	NaN	NaN	NaN	NaN	NaN	NaN	NaN	NaN	NaN	NaN	NaN	NaN	NaN	NaN	NaN	NaN	NaN	NaN	NaN	NaN	NaN	NaN	NaN	NaN	NaN	NaN	NaN	NaN	NaN
3.6024	NaN	NaN	NaN	NaN	NaN	NaN	NaN	NaN	NaN	NaN	NaN	NaN	NaN	NaN	NaN	NaN	NaN	NaN	NaN	NaN	NaN	NaN	NaN	NaN	NaN	NaN	NaN	NaN	NaN	NaN	NaN	NaN	NaN	NaN	NaN	NaN	NaN	NaN	NaN	NaN	NaN	NaN	NaN	NaN	NaN	NaN	NaN	NaN	NaN	NaN	NaN	NaN	NaN	NaN	NaN	NaN	NaN	NaN
3.7358	NaN	NaN	NaN	NaN	NaN	NaN	NaN	NaN	NaN	NaN	NaN	NaN	NaN	NaN	NaN	NaN	NaN	NaN	NaN	NaN	NaN	NaN	NaN	NaN	NaN	NaN	NaN	NaN	NaN	NaN	NaN	NaN	NaN	NaN	NaN	NaN	NaN	NaN	NaN	NaN	NaN	NaN	NaN	NaN	NaN	NaN	NaN	NaN	NaN	NaN	NaN	NaN	NaN	NaN	NaN	NaN	NaN	NaN
3.8692	NaN	NaN	NaN	NaN	NaN	NaN	NaN	NaN	NaN	NaN	NaN	NaN	NaN	NaN	NaN	NaN	NaN	NaN	NaN	NaN	NaN	NaN	NaN	NaN	NaN	NaN	NaN	NaN	NaN	NaN	NaN	NaN	NaN	NaN	NaN	NaN	NaN	NaN	NaN	NaN	NaN	NaN	NaN	NaN	NaN	NaN	NaN	NaN	NaN	NaN	NaN	NaN	NaN	NaN	NaN	NaN	NaN	NaN
4.0027	NaN	NaN	NaN	NaN	NaN	NaN	NaN	NaN	NaN	NaN	NaN	NaN	NaN	NaN	NaN	NaN	NaN	NaN	NaN	NaN	NaN	NaN	NaN	NaN	NaN	NaN	NaN	NaN	NaN	NaN	NaN	NaN	NaN	NaN	NaN	NaN	NaN	NaN	NaN	NaN	NaN	NaN	NaN	NaN	NaN	NaN	NaN	NaN	NaN	NaN	NaN	NaN	NaN	NaN	NaN	NaN	NaN	NaN
4.1361	NaN	NaN	NaN	NaN	NaN	NaN	NaN	NaN	NaN	NaN	NaN	NaN	NaN	NaN	NaN	NaN	NaN	NaN	NaN	NaN	NaN	NaN	NaN	NaN	NaN	NaN	NaN	NaN	NaN	NaN	NaN	NaN	NaN	NaN	NaN	NaN	NaN	NaN	NaN	NaN	NaN	NaN	NaN	NaN	NaN	NaN	NaN	NaN	NaN	NaN	NaN	NaN	NaN	NaN	NaN	NaN	NaN	NaN
4.2695	NaN	NaN	NaN	NaN	NaN	NaN	NaN	NaN	NaN	NaN	NaN	NaN	NaN	NaN	NaN	NaN	NaN	NaN	NaN	NaN	NaN	NaN	NaN	NaN	NaN	NaN	NaN	NaN	NaN	NaN	NaN	NaN	NaN	NaN	NaN	NaN	NaN	NaN	NaN	NaN	NaN	NaN	NaN	NaN	NaN	NaN	NaN	NaN	NaN	NaN	NaN	NaN	NaN	NaN	NaN	NaN	NaN	NaN
4.4029	NaN	NaN	NaN	NaN	NaN	NaN	NaN	NaN	NaN	NaN	NaN	NaN	NaN	NaN	NaN	NaN	NaN	NaN	NaN	NaN	NaN	NaN	NaN	NaN	NaN	NaN	NaN	NaN	NaN	NaN	NaN	NaN	NaN	NaN	NaN	NaN	NaN	NaN	NaN	NaN	NaN	NaN	NaN	NaN	NaN	NaN	NaN	NaN	NaN	NaN	NaN	NaN	NaN	NaN	NaN	NaN	NaN	NaN
4.5363	NaN	NaN	NaN	NaN	NaN	NaN	NaN	NaN	NaN	NaN	NaN	NaN	NaN	NaN	NaN	NaN	NaN	NaN	NaN	NaN	NaN	NaN	NaN	NaN	NaN	NaN	NaN	NaN	NaN	NaN	NaN	NaN	NaN	NaN	NaN	NaN	NaN	NaN	NaN	NaN	NaN	NaN	NaN	NaN	NaN	NaN	NaN	NaN	NaN	NaN	NaN	NaN	NaN	NaN	NaN	NaN	NaN	NaN
4.6698	NaN	NaN	NaN	NaN	NaN	NaN	NaN	NaN	NaN	NaN	NaN	NaN	NaN	NaN	NaN	NaN	NaN	NaN	NaN	NaN	NaN	NaN	NaN	NaN	NaN	NaN	NaN	NaN	NaN	NaN	NaN	NaN	NaN	NaN	NaN	NaN	NaN	NaN	NaN	NaN	NaN	NaN	NaN	NaN	NaN	NaN	NaN	NaN	NaN	NaN	NaN	NaN	NaN	NaN	NaN	NaN	NaN	NaN
4.8032	NaN	NaN	NaN	NaN	NaN	NaN	NaN	NaN	NaN	NaN	NaN	NaN	NaN	NaN	NaN	NaN	NaN	NaN	NaN	NaN	NaN	NaN	NaN	NaN	NaN	NaN	NaN	NaN	NaN	NaN	NaN	NaN	NaN	NaN	NaN	NaN	NaN	NaN	NaN	NaN	NaN	NaN	NaN	NaN	NaN	NaN	NaN	NaN	NaN	NaN	NaN	NaN	NaN	NaN	NaN	NaN	NaN	NaN
4.9366	NaN	NaN	NaN	NaN	NaN	NaN	NaN	NaN	NaN	NaN	NaN	NaN	NaN	NaN	NaN	NaN	NaN	NaN	NaN	NaN	NaN	NaN	NaN	NaN	NaN	NaN	NaN	NaN	NaN	NaN	NaN	NaN	NaN	NaN	NaN	NaN	NaN	NaN	NaN	NaN	NaN	NaN	NaN	NaN	NaN	NaN	NaN	NaN	NaN	NaN	NaN	NaN	NaN	NaN	NaN	NaN	NaN	NaN
5.07	NaN	NaN	NaN	NaN	NaN	NaN	NaN	NaN	NaN	NaN	NaN	NaN	NaN	NaN	NaN	NaN	NaN	NaN	NaN	NaN	NaN	NaN	NaN	NaN	NaN	NaN	NaN	NaN	NaN	NaN	NaN	NaN	NaN	NaN	NaN	NaN	NaN	NaN	NaN	NaN	NaN	NaN	NaN	NaN	NaN	NaN	NaN	NaN	NaN	NaN	NaN	NaN	NaN	NaN	NaN	NaN	NaN	NaN
