X,Y
0.00000,36885.797
0.13342,35698.125
0.26684,38532.195
0.40027,38445.039
0.53369,38763.758
0.66711,37449.934
0.80053,37774.684
0.93395,38158.746
1.06737,37380.715
1.20080,37465.555
1.33422,35705.227
1.46764,36729.312
1.60106,37431.082
1.73448,37067.215
1.86791,37570.188
2.00133,36434.953
2.13475,37022.730
2.26817,36661.531
2.40159,36717.223
2.53502,37686.723
2.66844,38181.961
2.80186,38716.398
2.93528,43865.867
3.06870,53066.773
3.20212,68538.406
3.33555,73180.930
3.46897,58733.090
3.60239,47408.711
3.73581,41520.586
