X,Y
0.00000,12849.725
0.13342,12724.594
0.26684,14467.946
0.40027,17272.881
0.53369,19698.043
0.66711,17829.508
0.80053,16265.181
0.93395,14416.905
1.06737,14311.876
1.20080,14977.086
1.33422,15684.648
1.46764,16260.854
1.60106,17320.373
1.73448,16198.007
1.86791,15642.138
2.00133,14522.203
2.13475,14809.736
2.26817,13628.299
2.40159,14717.545
