0.0000	34850.0547
0.1334	35331.0508
0.2668	34608.2070
0.4003	33999.3906
0.5337	34263.3320
0.6671	34209.6602
0.8005	34552.3125
0.9340	34442.8867
1.0674	34040.8320
1.2008	33292.6211
1.3342	35406.8984
1.4676	36013.4883
1.6011	38961.2891
1.7345	43455.1523
1.8679	54321.1719
2.0013	81070.2656
2.1347	104793.5234
2.2682	85404.2656
2.4016	57375.0273
2.5350	41711.0156
2.6684	37326.4922
2.8019	36386.8203
2.9353	35408.1055
3.0687	34747.7383
