0.00000,37595.508
0.13342,38925.707
0.26684,36780.566
0.40027,36184.590
0.53369,38514.078
0.66711,36349.984
0.80053,37841.879
0.93395,36727.012
1.06737,38083.449
1.20080,38201.117
1.33422,39786.891
1.46764,39988.812
1.60106,39129.883
1.73448,41418.367
1.86791,45926.695
2.00133,55111.621
2.13475,76999.273
2.26817,120904.109
2.40159,162820.828
2.53502,144359.219
2.66844,92601.859
2.80186,60503.309
2.93528,49932.344
3.06870,43875.949
