x	Y_20180514_15100_1_2g	Y_20180514_15100_1_7g	Y_20180514_15100_10_1g	Y_20180514_15100_10_5g	Y_20180514_15100_11_10g	Y_20180514_15100_11_3g	Y_20180514_15100_11_4g	Y_20180514_15100_12_10g	Y_20180514_15100_12_2g	Y_20180514_15100_12_4g	Y_20180514_15100_12_5g	Y_20180514_15100_12_6g	Y_20180514_15100_12_9g	Y_20180514_15100_14_1g	Y_20180514_15100_14_9g	Y_20180514_15100_15_2g	Y_20180514_15100_15_3g	Y_20180514_15100_15_5g	Y_20180514_15100_17_2g	Y_20180514_15100_17_3g	Y_20180514_15100_19_2g	Y_20180514_15100_19_4g	Y_20180514_15100_19_6g	Y_20180514_15100_21_1g	Y_20180514_15100_21_3g	Y_20180514_15100_21_7g	Y_20180514_15100_23_11g	Y_20180514_15100_23_3g	Y_20180514_15100_23_4g	Y_20180514_15100_27_4g	Y_20180514_15100_28_2g	Y_20180514_15100_28_3g	Y_20180514_15100_28_5g	Y_20180514_15100_28_7g	Y_20180514_15100_3_5g	Y_20180514_15100_31_6g	Y_20180514_15100_32_4g	Y_20180514_15100_4_11g	Y_20180514_15100_4_8g	Y_20180514_15100_5_2g	Y_20180514_15100_5_7g	Y_20180514_15100_6_1g	Y_20180514_15100_7_2g	Y_20180514_15100_7_5g	Y_20180514_15100_7_7g	Y_20180514_15100_8_1g	Y_20180514_15100_8_2g	Y_20180514_15100_8_4g	Y_20180514_15100_8_5g	Y_20180514_15100_8_7g	Y_20180514_15100_9_10g	Y_20180514_15100_9_2g	Y_20180514_15100_9_6g
0	14360.2441	14732.2002	13504.457	15949.9766	15559.2373	12899.7773	13871.1016	13040.3721	16371.2861	13176.1328	13706.5791	15866.6582	13531.2422	14162.917	17938.4902	14310.835	12112.2959	13894.7607	13226.1074	14159.4033	17130.3066	16825.6797	12408.0996	11928.5352	13337.3828	14301.4531	13722.0605	14996.8809	13227.0166	14686.6465	12618.0029	13075.8877	14638.0547	18272.3789	14424.1357	17205.5879	11777.3174	12302.3281	14370.6055	14151.7061	15283.9795	13022.4385	14375.2139	11520.0381	14483.2031	12894.2393	13875.5273	13257.2969	16503.9512	14115.1504	13424.1338	15929.6963	12153.4795
0.1334	15393.3447	14926.1953	16121.6621	15438.0928	15026.6758	13138.3672	14363.2061	13758.0645	15243.6768	14549.1465	13749.7637	15812.0693	13554.6807	15153.3779	18968.2305	13724.8271	12573.3926	14362.9072	13019.4971	14827.7344	18622.1133	18823.6406	13699.3008	12277.4736	14276.2129	15153.0146	13955.3027	15580.8789	13800.6875	15616.502	13077.9609	15347.9023	15578.2832	18377.9922	14081.0898	20551.1758	11446.0342	12746.7998	13917.0479	14126.3975	15630.7344	14095.8604	14113.7217	11779.8818	13237.9512	13897.9434	13694.8174	14520.6758	18834.0312	17035.6055	13058.333	16258.2383	13439.3008
0.2668	17354.5254	14444.4141	19789.9082	19062.2246	15026.2041	13822.5654	15039.9287	15007.5107	15651.9404	18888.7168	14301.6973	18037.1582	14544.4287	15050.417	24806.9785	15059.9326	12056.6182	15057.2646	13922.7432	16813.8945	21271.0215	24311.1816	18687.6172	13509.6299	17279.6309	17915.8047	15798.7012	17941.1426	15958.9814	17534.7578	13051.0645	17375.0195	17382.0312	19031.0273	15267.3721	25750.0586	13027.1143	13776.3447	14710.5254	14059.1328	15244.125	13795.3555	15812.5918	12052.3691	13671.9102	15493.5957	14852.8223	15053.5322	21418.2715	19601.4727	12959.1182	17230.9707	13771.3975
0.4003	18887.2598	18506.9512	26323.832	22207.2051	16148.9424	15207.1289	16423.3242	17010.8438	20052.002	23216.6543	15998.957	20245.1406	16367.667	17361.4727	28997.9824	19579.9609	12897.5059	15294.7959	15260.6992	20924.3047	23115.1992	32255.8066	25833.3887	17723.8223	20535.1328	21120.2266	17808.6777	23475.2637	20159.2246	19094.9121	14916.8311	20264.2031	19993.9902	20244.2715	15644.6582	25250.0879	16217.5645	15844.8701	17443.0742	15510.1943	15250.0986	16118.1797	16392.2832	13682.2422	15000.2607	19510.2852	17545.8594	18018.5195	18322.1445	18261.7422	14607.04	17127.998	15660.3086
0.5337	21983.168	24273.5352	28037.9023	20591.1973	18415.7891	17284.666	18867.9707	20615.3105	23622.0703	24042.0059	17258.3496	24581.1387	19442.9766	21988.9648	25092.7754	24498.8789	15267.4258	16016.6045	17449.2051	25977.6504	25304.3613	34302.625	29273.5488	22723.6797	18272.9434	25038.9316	19408.5703	29488.2012	21166.8633	17130.3398	15060.9902	21617.4922	19980.1816	26609.7578	17409.0938	23018.9727	19720.3086	19658.1992	20899.998	19481.3008	16659.2422	18291.9434	18030.2148	15363.2051	17872.5195	23610.1133	20406.1152	19204.6113	15529.8975	16112.373	17383.2793	20434.6406	17342.0508
0.6671	24980.9473	23403.9238	25535.0918	18786.041	22061.1211	18626.3086	19456.5566	20733.5723	27863.4258	21126.3926	18963.6348	23500.6484	21487.916	27764.4258	23806.541	24106.4492	18456.5059	17259.0273	19327.0605	25058.1191	24246.623	28610.1387	26780.457	21866.127	15435.6328	23580.4707	17714.7188	30326.9727	18861.7949	15362.8193	16739.0039	19954.209	19736.0449	31532.0996	19844.8652	20071.2051	23032.918	24876.9863	22037.9609	20708.4746	19219.7383	22480.8633	17616.9004	19803.4453	20047.3457	23675.9395	19903.0078	18619.3984	15728.9014	15413.4473	19349.9766	22629.7617	18387.0449
0.8005	22292.1641	20186.0625	24873.125	17166.2109	21463.5195	18226.8809	17685.0508	19516.3711	25126.0996	20181.1543	20106.2676	17609.2617	20799.8672	25195.5645	19892.3672	21723.0117	19175.1621	18864.7871	18865.2539	21670.4668	19793.5801	21614.9922	26455.5195	19102.7891	14552.8125	20845.7559	16028.5244	26355.25	17935.1211	14571.1123	15925.7266	18292.4082	20974.6641	27934.1211	22425.8418	18149.2695	20314.6152	23198.7988	19803.6094	18354.084	20677.498	25498.1289	16438.8672	21310.9609	17818.6172	21235.1602	18806.207	16649.4375	17180.332	15170.8408	17932.3789	19801.6367	17073.1406
0.934	20543.7598	17909.916	24915.4629	15093.7998	17829.1992	16999.3418	16131.9492	17866.3125	22119.8223	21292.8105	18522.3926	15029.0039	18341.4531	19823.9531	19990.1934	17859.6719	17202.8711	19613.8594	16303.4404	20783.3809	16846.832	19509.5059	27583.707	17389.3203	14217.9873	19596.6211	14668.9688	22973.9062	20616.2285	13855.9727	17548.4492	16365.6064	19475.334	22216.8828	24671.5527	16630.1582	17655.1973	19849.6895	18437.1445	16539.7227	21563.873	21570.0566	15568.374	20414.6719	16869.3828	17732.1504	18659.6914	15615.6201	17612.0957	15694.9912	16950.0879	17896.1582	16627.8281
1.0674	20458.6289	16669.2734	22771.8535	14240.7363	15583.5303	15699.2607	18375.4238	16374.542	21225.2285	22767.3691	16417.0195	14796.668	16057.7266	17586.9922	17927.7461	16869.8691	15397.751	18302.8457	17168.9043	19163.6621	15140.4746	18410.3945	25583.127	17022.7168	13391.3799	21320.2988	15168.2891	21174.1133	21693.1816	14075.5195	20047.8047	16293.7285	16793.1074	17367.5469	21813.8984	16068.7373	17066.5938	16077.9893	17677.4551	14669.7324	21494.4414	19586.377	14357.4932	18871.3691	15477.9346	15567.5166	18668.2754	13952.0723	17925.8828	16744.8516	16016.6514	17001.6016	15313.0635
1.2008	19248.8262	16447.0566	21225.4375	14142.9707	13838.0078	15200.2422	19373.3672	15882.1377	19254.8438	26647.4375	14884.2139	14255.5771	15344.2012	18148.0918	16733.6406	16763.0566	14947.9854	16828.3711	16618.3203	18113.752	14857.292	19492.9648	21388.2734	16935.8535	12610.3672	21587.4746	14493.5391	20970.5352	19789.9082	15189.0713	19680.9688	16274.043	15188.3115	16588.082	20804.6191	14993.6338	17191.2285	16225.8906	17631.3301	14805.4766	21363.0664	16821.9609	12845.8838	18667.7422	15630.7832	15107.8994	16425.168	14289.4336	17326.3945	16737.0938	16358.4248	15690.2852	14585.1338
1.3342	17017.8457	16808.5938	17623.3047	14164.7725	14566.8008	15122.5264	18809.4004	16836.4297	18609.9648	30111.3164	14294.0742	15921.0947	14198.2197	19252.625	16585.9004	16217.8779	14991.9209	16746.4297	17124.1816	15973.5908	15358.0527	19900.9004	18343.4863	17987.6699	12187.8174	21798.5938	14921.5801	19528.2637	17250.2852	15377.8613	16342.2266	15809.0938	14520.2295	15214.1875	20604.3184	13852.4727	16467.5273	15841.7588	16825.4805	15132.9219	18237.2246	15831.8672	12943.6641	18584.8145	16149.9883	14431.6719	15430.6045	14604.7119	16683.8008	15042.3096	16364.6367	14632.6348	16051.3369
1.4676	15112.2588	15354.0898	17196.2188	14225.4414	14478.8877	15793.6484	17142.25	16348.3027	21042.7969	30338.7715	15712.0273	16063.168	13659.5273	18462.9023	16312.6865	16794.5176	14995.8242	16769.8418	17202.2988	15439.1006	16572.7168	19332.8086	16191.5791	17674.668	11044.3135	19183.7676	15286.5469	19952.3203	16781.5625	17078.5762	15299.2734	15788.7305	14596.7773	15620.0508	18918.707	13516.0508	16003.3037	15476.9414	17828.5391	14946.1572	15259.0186	14913.5459	12854.9492	17132.2207	17443.0273	14265.2637	15573.0967	15525.3301	15398.002	14188.8857	16608.4141	14094.4043	16579.9316
1.6011	14687.5264	16788.9961	15990.2207	14885.6768	15063.8721	16753.7695	16980	15638.1416	21916.1055	24609.8379	16341.8721	15606.4062	12577.4863	16139.0479	14936.0361	16093.4746	15086.1748	15835.4961	17417.0684	16157.0078	20137.6895	17147.2109	14471.6904	16565.8379	11311.5938	16917.4707	15861.1035	18647.293	15303.4072	18153.3086	13565.084	15287.4658	14592.1836	16031.0957	19142.9688	13300.0938	15498.1465	14430.0732	16746.6113	14139.2012	13996.3506	13386.3369	12592.5381	17326.168	16419.1816	13484.5674	15516.585	16515.416	15200.0635	13966.1572	17688.752	14692.0645	16786.9082
1.7345	14133.9287	16427.0996	14385.584	14532.001	17218.416	17816.7363	16062.8574	14658.9561	19390.416	18656.0859	16674.7852	15591.2002	12364.5801	16192.8076	13907.5674	14803.5107	NaN	14960.5684	18512.8262	16487.9512	21322.2715	15292.0596	13835.2686	15067.874	12036.9746	15479.8613	15138.9707	17441.8945	14733.1484	18200.0801	13787.9922	14300.2549	13928.3428	16216.4629	18539.2676	12737.8896	15030.3047	14138.127	15378.6846	13360.9814	14015.499	12443.0342	13166.9707	20451.1758	17259.2656	12808.8115	16035.6592	17503.834	14235.6309	13743.7549	17861.6816	15163.835	17096.0605
1.8679	13418.4023	15465.6113	14588.9463	14031.5254	19644.6133	15417.7627	15408.9775	13651.8867	17047.9941	17020.0625	16596.7344	15648.1387	11526.4707	15774.4092	13460.0693	14821.8945	NaN	14580.2988	18989.8301	15055.8779	19824.9043	14730.6748	13162.5156	14088.5527	11958.2207	13820.0449	13811.5254	15664.7295	14274.0547	NaN	12954.832	14781.6924	13741.79	16968.752	17669.4004	13830.4727	13653.6514	14405.0527	13977.2236	13455.6533	14023.5908	12458.4482	13658.0273	22805.7988	19275.4297	12465.4297	14515.1465	16793.2363	14601.2891	14046.9434	17431.1133	14310.7842	16971.8691
2.0013	12839.4062	12771.6006	14610.5869	14026.833	22035.9043	14001.9951	15076.8242	13391.8613	17770.5234	14498.2617	15845.7988	16962.7637	12622.1709	16193.25	13778.7432	15444.001	NaN	14450.167	19037.8457	14519.8818	16841.4961	13631.8047	11892.6875	12866.0771	12122.4668	13755.0898	12895.4033	15010.4658	13163.9922	NaN	13172.9072	14523.252	13451.0615	16326.8604	16365.6064	13563.6016	12668.7969	13077.667	13476.2373	13143.543	NaN	11961.2275	12948.8311	22474.1621	21291.6992	12959.5195	14423.752	14952.2822	13251.793	15043.7314	15171.6338	13404.248	16458.4785
2.1347	12831.8311	12633.5049	13220.6689	13058.7832	19718.2598	13898.5508	14711.1016	13602.0996	NaN	14649.0713	15898.4609	17908.3945	12995.4268	15909.3467	NaN	15242.8408	NaN	14158.7598	17315.8613	14152.4453	15865.1094	14202.9082	11518.8252	12447.3701	12197.6064	13395.7939	12209.1943	14514.1738	12880.4658	NaN	NaN	13946.2207	13920.833	14921.6328	14688.5234	13079.6865	13116.8799	12869.1543	14195.709	13627.7012	NaN	11827.5732	12957.8672	18600.6875	NaN	13288.0088	14232.1201	13929.4707	13324.2568	NaN	13621.8584	13622.6953	15388.2305
2.2682	13114.3516	12516.333	14163.2275	12204.4336	15644.4287	12684.709	NaN	12927.5254	NaN	NaN	14324.7178	17088.8906	12866.2588	14261.415	NaN	15529.085	NaN	13599.0703	15052.5693	14023.7822	15331.2031	13386.4883	12504.4082	12564.0762	12832.1855	13464.248	12197.1729	14693.5615	12721.874	NaN	NaN	13417.5449	14147.9473	15618.8369	13708.1055	13143.8438	12576.7354	13089.3789	13400.0117	13304.1816	NaN	11661.6406	12983.0381	15645.2959	NaN	13026.625	14630.7393	14132.3984	13352.4121	NaN	13117.2959	14125.6396	14139.667
2.4016	13261.8994	12520.1152	NaN	12217.4658	14214.9873	13146.9814	NaN	13469.2988	NaN	NaN	14569.9229	NaN	12563.1357	14451.9131	NaN	15685.6631	NaN	12838.749	14547.3291	13902.2471	14763.8184	12734.0918	12644.208	13007.7871	NaN	14173.5977	12807.7393	14888.9395	12156.5947	NaN	NaN	13989.7764	12934.8467	14179.6943	14447.1504	12569.8799	12743.0176	13417.3877	13328.0498	13226.083	NaN	11855.1172	NaN	14131.2754	NaN	12243.5439	13631.6719	13277.7168	13351.4561	NaN	12280.5947	14104.1504	13744.1055
2.535	12832.2354	12389.5576	NaN	12059.2715	14161.6826	13848.1348	NaN	13336.085	NaN	NaN	NaN	NaN	12965.6807	14647.4414	NaN	NaN	NaN	NaN	14325.6699	13975.0352	15029.3838	NaN	11722.5938	NaN	NaN	14353.6377	12586.3828	NaN	NaN	NaN	NaN	13480.1934	NaN	NaN	14292.2295	NaN	13545.459	14184.1572	NaN	NaN	NaN	11631.1904	NaN	NaN	NaN	12838.7246	13860.1045	13147.54	14068.3721	NaN	NaN	13907.5244	12867.2646
2.6684	NaN	NaN	NaN	11826.4316	NaN	13339.7275	NaN	13356.2354	NaN	NaN	NaN	NaN	12823.6904	14292.6777	NaN	NaN	NaN	NaN	14057.9102	NaN	NaN	NaN	NaN	NaN	NaN	14128.207	12622.0039	NaN	NaN	NaN	NaN	14447.7451	NaN	NaN	13593.3252	NaN	NaN	NaN	NaN	NaN	NaN	NaN	NaN	NaN	NaN	13507.4727	13739.9834	13001.7939	NaN	NaN	NaN	14461.9473	14010.3584
2.8019	NaN	NaN	NaN	NaN	NaN	13449.1885	NaN	NaN	NaN	NaN	NaN	NaN	NaN	NaN	NaN	NaN	NaN	NaN	14158.0488	NaN	NaN	NaN	NaN	NaN	NaN	NaN	NaN	NaN	NaN	NaN	NaN	NaN	NaN	NaN	NaN	NaN	NaN	NaN	NaN	NaN	NaN	NaN	NaN	NaN	NaN	NaN	13998.9316	NaN	NaN	NaN	NaN	NaN	13946.0381
2.9353	NaN	NaN	NaN	NaN	NaN	NaN	NaN	NaN	NaN	NaN	NaN	NaN	NaN	NaN	NaN	NaN	NaN	NaN	13423.1113	NaN	NaN	NaN	NaN	NaN	NaN	NaN	NaN	NaN	NaN	NaN	NaN	NaN	NaN	NaN	NaN	NaN	NaN	NaN	NaN	NaN	NaN	NaN	NaN	NaN	NaN	NaN	13669.3428	NaN	NaN	NaN	NaN	NaN	NaN
3.0687	NaN	NaN	NaN	NaN	NaN	NaN	NaN	NaN	NaN	NaN	NaN	NaN	NaN	NaN	NaN	NaN	NaN	NaN	NaN	NaN	NaN	NaN	NaN	NaN	NaN	NaN	NaN	NaN	NaN	NaN	NaN	NaN	NaN	NaN	NaN	NaN	NaN	NaN	NaN	NaN	NaN	NaN	NaN	NaN	NaN	NaN	NaN	NaN	NaN	NaN	NaN	NaN	NaN
3.2021	NaN	NaN	NaN	NaN	NaN	NaN	NaN	NaN	NaN	NaN	NaN	NaN	NaN	NaN	NaN	NaN	NaN	NaN	NaN	NaN	NaN	NaN	NaN	NaN	NaN	NaN	NaN	NaN	NaN	NaN	NaN	NaN	NaN	NaN	NaN	NaN	NaN	NaN	NaN	NaN	NaN	NaN	NaN	NaN	NaN	NaN	NaN	NaN	NaN	NaN	NaN	NaN	NaN
3.3355	NaN	NaN	NaN	NaN	NaN	NaN	NaN	NaN	NaN	NaN	NaN	NaN	NaN	NaN	NaN	NaN	NaN	NaN	NaN	NaN	NaN	NaN	NaN	NaN	NaN	NaN	NaN	NaN	NaN	NaN	NaN	NaN	NaN	NaN	NaN	NaN	NaN	NaN	NaN	NaN	NaN	NaN	NaN	NaN	NaN	NaN	NaN	NaN	NaN	NaN	NaN	NaN	NaN
3.469	NaN	NaN	NaN	NaN	NaN	NaN	NaN	NaN	NaN	NaN	NaN	NaN	NaN	NaN	NaN	NaN	NaN	NaN	NaN	NaN	NaN	NaN	NaN	NaN	NaN	NaN	NaN	NaN	NaN	NaN	NaN	NaN	NaN	NaN	NaN	NaN	NaN	NaN	NaN	NaN	NaN	NaN	NaN	NaN	NaN	NaN	NaN	NaN	NaN	NaN	NaN	NaN	NaN
3.6024	NaN	NaN	NaN	NaN	NaN	NaN	NaN	NaN	NaN	NaN	NaN	NaN	NaN	NaN	NaN	NaN	NaN	NaN	NaN	NaN	NaN	NaN	NaN	NaN	NaN	NaN	NaN	NaN	NaN	NaN	NaN	NaN	NaN	NaN	NaN	NaN	NaN	NaN	NaN	NaN	NaN	NaN	NaN	NaN	NaN	NaN	NaN	NaN	NaN	NaN	NaN	NaN	NaN
3.7358	NaN	NaN	NaN	NaN	NaN	NaN	NaN	NaN	NaN	NaN	NaN	NaN	NaN	NaN	NaN	NaN	NaN	NaN	NaN	NaN	NaN	NaN	NaN	NaN	NaN	NaN	NaN	NaN	NaN	NaN	NaN	NaN	NaN	NaN	NaN	NaN	NaN	NaN	NaN	NaN	NaN	NaN	NaN	NaN	NaN	NaN	NaN	NaN	NaN	NaN	NaN	NaN	NaN
3.8692	NaN	NaN	NaN	NaN	NaN	NaN	NaN	NaN	NaN	NaN	NaN	NaN	NaN	NaN	NaN	NaN	NaN	NaN	NaN	NaN	NaN	NaN	NaN	NaN	NaN	NaN	NaN	NaN	NaN	NaN	NaN	NaN	NaN	NaN	NaN	NaN	NaN	NaN	NaN	NaN	NaN	NaN	NaN	NaN	NaN	NaN	NaN	NaN	NaN	NaN	NaN	NaN	NaN
4.0027	NaN	NaN	NaN	NaN	NaN	NaN	NaN	NaN	NaN	NaN	NaN	NaN	NaN	NaN	NaN	NaN	NaN	NaN	NaN	NaN	NaN	NaN	NaN	NaN	NaN	NaN	NaN	NaN	NaN	NaN	NaN	NaN	NaN	NaN	NaN	NaN	NaN	NaN	NaN	NaN	NaN	NaN	NaN	NaN	NaN	NaN	NaN	NaN	NaN	NaN	NaN	NaN	NaN
4.1361	NaN	NaN	NaN	NaN	NaN	NaN	NaN	NaN	NaN	NaN	NaN	NaN	NaN	NaN	NaN	NaN	NaN	NaN	NaN	NaN	NaN	NaN	NaN	NaN	NaN	NaN	NaN	NaN	NaN	NaN	NaN	NaN	NaN	NaN	NaN	NaN	NaN	NaN	NaN	NaN	NaN	NaN	NaN	NaN	NaN	NaN	NaN	NaN	NaN	NaN	NaN	NaN	NaN
4.2695	NaN	NaN	NaN	NaN	NaN	NaN	NaN	NaN	NaN	NaN	NaN	NaN	NaN	NaN	NaN	NaN	NaN	NaN	NaN	NaN	NaN	NaN	NaN	NaN	NaN	NaN	NaN	NaN	NaN	NaN	NaN	NaN	NaN	NaN	NaN	NaN	NaN	NaN	NaN	NaN	NaN	NaN	NaN	NaN	NaN	NaN	NaN	NaN	NaN	NaN	NaN	NaN	NaN
4.4029	NaN	NaN	NaN	NaN	NaN	NaN	NaN	NaN	NaN	NaN	NaN	NaN	NaN	NaN	NaN	NaN	NaN	NaN	NaN	NaN	NaN	NaN	NaN	NaN	NaN	NaN	NaN	NaN	NaN	NaN	NaN	NaN	NaN	NaN	NaN	NaN	NaN	NaN	NaN	NaN	NaN	NaN	NaN	NaN	NaN	NaN	NaN	NaN	NaN	NaN	NaN	NaN	NaN
4.5363	NaN	NaN	NaN	NaN	NaN	NaN	NaN	NaN	NaN	NaN	NaN	NaN	NaN	NaN	NaN	NaN	NaN	NaN	NaN	NaN	NaN	NaN	NaN	NaN	NaN	NaN	NaN	NaN	NaN	NaN	NaN	NaN	NaN	NaN	NaN	NaN	NaN	NaN	NaN	NaN	NaN	NaN	NaN	NaN	NaN	NaN	NaN	NaN	NaN	NaN	NaN	NaN	NaN
4.6698	NaN	NaN	NaN	NaN	NaN	NaN	NaN	NaN	NaN	NaN	NaN	NaN	NaN	NaN	NaN	NaN	NaN	NaN	NaN	NaN	NaN	NaN	NaN	NaN	NaN	NaN	NaN	NaN	NaN	NaN	NaN	NaN	NaN	NaN	NaN	NaN	NaN	NaN	NaN	NaN	NaN	NaN	NaN	NaN	NaN	NaN	NaN	NaN	NaN	NaN	NaN	NaN	NaN
4.8032	NaN	NaN	NaN	NaN	NaN	NaN	NaN	NaN	NaN	NaN	NaN	NaN	NaN	NaN	NaN	NaN	NaN	NaN	NaN	NaN	NaN	NaN	NaN	NaN	NaN	NaN	NaN	NaN	NaN	NaN	NaN	NaN	NaN	NaN	NaN	NaN	NaN	NaN	NaN	NaN	NaN	NaN	NaN	NaN	NaN	NaN	NaN	NaN	NaN	NaN	NaN	NaN	NaN
4.9366	NaN	NaN	NaN	NaN	NaN	NaN	NaN	NaN	NaN	NaN	NaN	NaN	NaN	NaN	NaN	NaN	NaN	NaN	NaN	NaN	NaN	NaN	NaN	NaN	NaN	NaN	NaN	NaN	NaN	NaN	NaN	NaN	NaN	NaN	NaN	NaN	NaN	NaN	NaN	NaN	NaN	NaN	NaN	NaN	NaN	NaN	NaN	NaN	NaN	NaN	NaN	NaN	NaN
5.07	NaN	NaN	NaN	NaN	NaN	NaN	NaN	NaN	NaN	NaN	NaN	NaN	NaN	NaN	NaN	NaN	NaN	NaN	NaN	NaN	NaN	NaN	NaN	NaN	NaN	NaN	NaN	NaN	NaN	NaN	NaN	NaN	NaN	NaN	NaN	NaN	NaN	NaN	NaN	NaN	NaN	NaN	NaN	NaN	NaN	NaN	NaN	NaN	NaN	NaN	NaN	NaN	NaN
