0.0000	14219.4033
0.1334	14576.2900
0.2668	15601.6250
0.4003	18683.8516
0.5337	25860.2148
0.6671	32821.7578
0.8005	32139.9863
0.9340	23205.6309
1.0674	21049.6816
1.2008	20471.0000
1.3342	19948.1016
1.4676	18730.2930
1.6011	18694.3535
1.7345	19437.5176
1.8679	19446.6387
2.0013	18489.5215
2.1347	16650.3750
2.2682	15271.5771
2.4016	14030.0332
2.5350	13771.7471
2.6684	13706.7549
2.8019	13828.3369
2.9353	13670.5625
3.0687	12924.4541
3.2021	11918.0898
3.3355	12350.4658
3.4690	13215.4561
