0.0000	14997.8135
0.1334	17825.1895
0.2668	21495.5742
0.4003	21037.2324
0.5337	18984.6738
0.6671	16296.9160
0.8005	15916.2461
0.9340	15222.3389
1.0674	14828.6152
1.2008	14520.1133
1.3342	14396.1123
1.4676	14694.5859
1.6011	14575.5918
1.7345	14890.3887
1.8679	15429.5840
2.0013	15692.6709
2.1347	14952.3818
2.2682	13799.8740
2.4016	13082.2979
2.5350	12871.8057
2.6684	12912.6680
2.8019	12960.2109
