x	Y_20180514_15323_1_10g	Y_20180514_15323_10_4g	Y_20180514_15323_15_6g	Y_20180514_15323_17_7g	Y_20180514_15323_19_6g	Y_20180514_15323_2_4g	Y_20180514_15323_20_21g	Y_20180514_15323_22_14g	Y_20180514_15323_24_3g	Y_20180514_15323_25_8g	Y_20180514_15323_25_9g	Y_20180514_15323_26_11g	Y_20180514_15323_27_8g	Y_20180514_15323_28_11g	Y_20180514_15323_29_4g	Y_20180514_15323_3_2g	Y_20180514_15323_3_5g	Y_20180514_15323_4_7g	Y_20180514_15323_5_2g	Y_20180514_15323_6_7g	Y_20180514_15323_8_5g
0	34802.5625	31999.6172	30458.5059	33513.168	33438.0039	35327.4805	30045.3379	29567.2812	41231.1094	28828.7441	28430.2188	30601.1191	49738.9102	32536.3574	32228.5332	35318.2539	32291.8066	33376.5391	38397.3359	31231.4844	30620
0.1334	34250.3828	31199.5098	29751.4102	34516.1289	33009.5742	34488.707	30017.7676	30241.7676	37610.5273	28171.4902	29228.9453	30038.4648	47829.1094	35138.0312	30908.1172	34660.1719	31270.6133	33236.1367	34354.6367	30846.0508	29921.0742
0.2668	34520.7539	30756.7754	30124.3945	33044.0586	34336.332	35487.3398	29965.748	29398.1523	34100.2109	28799.2852	26910.9902	29643.3281	41013.8516	35054.7539	31900.1816	33925.7539	33518.4102	32050.3906	31362.5273	30353.3105	30042.2695
0.4003	34097.0938	30069.4648	30217.1953	33123.5469	33972.7422	35411.582	31229.502	28315.1719	36277.5156	28871.6621	27004.0059	30962.7051	39129.2734	35051.2539	34778.6562	33453.0625	33371.9922	30123.3281	31259.1211	30942.498	31094.7305
0.5337	35460.8516	29748.3535	29762.8047	33372.4258	34384.8398	35174.9453	31702.8711	28958.8809	34541.1484	28499.7656	29101.2246	31795.9512	37394.5742	34665.7852	35713.2852	34208.2188	33579.1758	31984.0312	31028.2871	33305.7578	29694.543
0.6671	35496.8828	31875.6992	32208.1074	33594.8984	35797.1523	34351.1094	31923.1309	29477.7793	36354.7461	28476.1738	29010.4883	32633.7266	36075.2734	35219.8281	35072.8086	33815.2578	32032.8984	31971	32077.6973	31130.1465	30131.1777
0.8005	35099.8086	31128.8945	30477.0938	33176.0039	35427.0273	36209.0195	31293.5078	28981.1719	35478.9961	29638.8379	29245.4531	31657.0625	36237.8867	34472.6719	34592.8008	34448.0586	33681.957	30986.8516	31264.6562	32420.3398	31318.6504
0.934	35966.2812	29746.4375	29594.123	33745.6523	35088.5273	36253.3828	31131.3887	29767.0293	33175.5234	29679.7949	29263.627	33009.3789	35275.0234	34919.6328	34603.6211	34294.5742	32514.6328	33152.5078	30903.4355	31692.1738	29569.5586
1.0674	35937.2578	30254.7168	29782.5566	33182.7227	34005	35048.4609	29668.7969	29483.0176	32582.8203	28500.0391	29926.3887	31758.6562	36278.8359	35355.2188	34863.1523	34288.418	31757.8887	31975.0508	29767.0684	31420.9102	31990.3145
1.2008	36929.1953	31751.2578	30344.5957	34607.6914	34528.125	35305.375	29184.1426	29400.916	34169.25	29310.5547	30311.8965	34398.2109	36567.9922	35189.9062	34985.4414	33725.2695	32303.3477	32219.2051	29775.2344	30891.5527	31308.3242
1.3342	35027.168	30992.0215	31323.1992	34758.125	36285.6172	36612.4297	30434.418	29427.7383	35176.4688	30297.1562	28973.3066	33939.1172	35912.4688	34447.7188	34254.1094	35731.8828	33930.5469	31592.918	29176	30806.0215	29538.7539
1.4676	36478.1445	30773.6406	30611.9473	34356.2539	34318.2539	36536.7812	29761.3867	30249.0801	34439.0625	31312.6309	28531.1758	33236.6914	35158.8164	34002.2695	35316.793	35200.8594	32763.8301	30353.7324	30549.3691	31520.0215	29342.4863
1.6011	36547.7656	30641.4082	29966.9355	34877.2383	33718.1641	35340.8398	29270.3555	28807.1152	33152.1328	31863.0215	28209.9277	33764.6211	37088.168	33688.7383	33838.543	33523.082	34221.2422	30525.625	29933.4629	31532.3262	29680.6016
1.7345	37349.4336	32689.6797	30383.1152	35427.9375	34577.8164	34703.3828	29549.4629	29559.4746	33338.5195	30840.8008	28697.918	33362.1953	35715.9609	34819.4062	33825.4492	34395.3477	34671.7148	30990.0586	31574.5996	31229.543	29169.0098
1.8679	36315.6758	31830.502	30995.5332	34686.5195	34946.25	35248.1445	29730.8848	28805.0996	35636.4414	30067.8555	29393.2969	32067.9453	36611.8711	34524.5039	33582.0156	34418.6758	35438.2852	29007.6758	29439.4629	30441.0703	30138.6777
2.0013	36837.0586	33367.1094	30684.6504	37437.2109	35961.4883	35778.9961	29339.0918	32146.5137	33371.8828	30100.3027	27622.4512	32826.0703	36047.9531	35290.9688	34043.8828	34821.5117	35581.0234	29697.9453	29749.9102	30693.7266	30649.666
2.1347	35876.3711	32598.4863	31292.041	35750.9688	34334.9609	35833.4414	29565.0664	31297.8652	34091.0469	31427.1855	28595.5195	33362.9688	35738.9219	34657.7188	35229.3164	35153.6758	35072.3047	29804.2754	29694.6094	31867.8789	29895.459
2.2682	33958.0078	31200.875	30766.8594	33285.293	34525.8711	36607.5781	30415.6035	30432.4727	33859.3203	29687.3203	28657.4727	32956.4492	37264.0703	34636.6562	34623.1328	34447.4258	33479.1484	30251.1133	29578.3145	31371.2773	29751.4473
2.4016	35448.8086	31842.5332	31497.7363	34537.6562	34469.3711	35452.2617	29871.0117	30983.0449	33192.3906	30167.8301	28883.3379	33606.5742	37444.1133	34424.0195	31822.6172	36371.2031	33731.2891	31683.0176	29845.1113	31593.127	31362.1152
2.535	34251.6328	32770.6953	31189.3887	33245.043	34535.543	34228.2969	30706.1641	30252.9805	32832.2891	30576.7129	27062.2695	32473.5859	36688.9922	34243.5625	33444.2422	36164.8398	34402.6875	31183.8105	30169.5117	30145.043	30822.127
2.6684	36284.6094	32343.8242	31492.502	34417.6992	35010.9844	34928.207	33169.457	30782.3184	34115.0273	29978.543	29273.0371	32462.7832	37685.375	35226.9883	35131.0039	35704.5586	34547.8086	32220.0215	30828.5293	31451.5059	31767.4648
2.8019	35501.8672	31244.7969	31366.9453	34405.8867	34689.75	36261.9883	34272.5	31784.5215	33904.8633	29696.5391	30306.6445	33450.0352	43503.1172	34822.9844	35641.7305	36995.7852	34060.7227	33081.6562	31631.8672	32288.3398	30707.1992
2.9353	37160.9883	30968.8926	32289.6699	35847.8789	35737.8125	34978.043	40472.4805	31618.9727	35473.2188	31186.8672	28224.6758	33438.7109	53849.5	35180.5	37772.0234	40895.3164	34136.9688	34698.7852	35135.1133	31938.9551	32046.1074
3.0687	36534.9453	30280.5566	33242.5195	39323.2188	37511.4844	35627.1836	54607.0195	34457.0156	39028.207	32690.1562	30270.8516	33797.5234	80369.8984	37072.332	40281.707	42306.1094	36092.4023	39239.8945	43587.9102	31997.4883	33910.8945
3.2021	40412.3594	32473.5918	35727.1836	43844.293	39956.668	37752.8164	83511.5938	39380.0625	51877.5703	40625.5625	31069.2441	36210.9414	119828.8438	37739.6094	47875.5625	47583.4961	40441.1094	45353.3164	62592.6797	31945.6152	34817.1914
3.3355	45364.1992	34930.3086	41844.2422	54901.6836	45226.5859	44614.1641	96581.2188	51596.3984	81334.2969	55346.75	33693.0352	37733.1133	127506.3672	40061.457	64861.9023	62647.8203	46650.3242	63369.332	96339.9141	34096.2344	42031.6641
3.469	56536.6953	37168.5938	57620.5664	82524.1875	59915.7734	60437.1914	76055.3359	80492.7969	103612.1328	82223.5625	41588.8555	43791.5195	90256.0156	49281.2344	104651.1797	85835.6875	46660.1445	69994.5781	106080.8281	36710.457	61987.0352
3.6024	88564.1562	48583.9141	95704.4141	98494.4844	83178.1719	82833.1953	46680.8594	107558.8359	85531.1016	90984.3828	63670.8086	58746.4922	61908.0391	66032.5781	129534.8359	91370.5469	44507.8906	54444.7031	76519.7969	41902.2227	100596.625
3.7358	121764.1406	61624.4062	138971.9375	79885.8281	99570.9922	93392.1719	37832.4023	93158.8984	54698.7812	70472.3672	102874.5859	91364.0625	47163.2344	77094.1016	105849.2578	66615.6172	NaN	43252.4453	51919.6367	63690.8398	139134.4375
3.8692	111575.375	56719.5703	123017.7891	55021.0703	91758.7969	70521.0312	32687.1816	59271.9805	45448.3359	48673.6211	115640.4766	106330.1875	NaN	64713.9414	69400.3125	50075.2148	NaN	36120.293	41925.0703	113076.6719	122938.4922
4.0027	81826.2266	42658.8906	75869.1875	43147.6172	69662.1719	50391.2422	NaN	42288.2812	39060.9648	39698.668	84656.9531	77276.1953	NaN	48142.8203	52938.8086	43995.7656	NaN	35546.8203	NaN	166044.875	72660.2188
4.1361	65245.8711	36858.4023	49694.5938	37525.9453	50604.2773	42033.7148	NaN	36364.457	35815.8242	35749.8711	55921.8828	52969.5938	NaN	40942.043	NaN	47786.4609	NaN	32296.6816	NaN	158960.1094	44887.8906
4.2695	53423.082	33657.2148	41127.1328	NaN	NaN	40150.6484	NaN	33659.8594	NaN	NaN	41548.4688	43407.5352	NaN	NaN	NaN	NaN	NaN	33526.5156	NaN	100008.3594	37434.3945
4.4029	44636.1758	NaN	39180.1055	NaN	NaN	NaN	NaN	33361.2734	NaN	NaN	NaN	39824.0508	NaN	NaN	NaN	NaN	NaN	32504.0625	NaN	61524.75	34078.4375
4.5363	40017.1406	NaN	NaN	NaN	NaN	NaN	NaN	NaN	NaN	NaN	NaN	37645.6484	NaN	NaN	NaN	NaN	NaN	NaN	NaN	45656.582	NaN
4.6698	NaN	NaN	NaN	NaN	NaN	NaN	NaN	NaN	NaN	NaN	NaN	NaN	NaN	NaN	NaN	NaN	NaN	NaN	NaN	40393.7148	NaN
4.8032	NaN	NaN	NaN	NaN	NaN	NaN	NaN	NaN	NaN	NaN	NaN	NaN	NaN	NaN	NaN	NaN	NaN	NaN	NaN	NaN	NaN
4.9366	NaN	NaN	NaN	NaN	NaN	NaN	NaN	NaN	NaN	NaN	NaN	NaN	NaN	NaN	NaN	NaN	NaN	NaN	NaN	NaN	NaN
5.07	NaN	NaN	NaN	NaN	NaN	NaN	NaN	NaN	NaN	NaN	NaN	NaN	NaN	NaN	NaN	NaN	NaN	NaN	NaN	NaN	NaN
5.2035	NaN	NaN	NaN	NaN	NaN	NaN	NaN	NaN	NaN	NaN	NaN	NaN	NaN	NaN	NaN	NaN	NaN	NaN	NaN	NaN	NaN
5.3369	NaN	NaN	NaN	NaN	NaN	NaN	NaN	NaN	NaN	NaN	NaN	NaN	NaN	NaN	NaN	NaN	NaN	NaN	NaN	NaN	NaN
5.4703	NaN	NaN	NaN	NaN	NaN	NaN	NaN	NaN	NaN	NaN	NaN	NaN	NaN	NaN	NaN	NaN	NaN	NaN	NaN	NaN	NaN
5.6037	NaN	NaN	NaN	NaN	NaN	NaN	NaN	NaN	NaN	NaN	NaN	NaN	NaN	NaN	NaN	NaN	NaN	NaN	NaN	NaN	NaN
5.7371	NaN	NaN	NaN	NaN	NaN	NaN	NaN	NaN	NaN	NaN	NaN	NaN	NaN	NaN	NaN	NaN	NaN	NaN	NaN	NaN	NaN
5.8706	NaN	NaN	NaN	NaN	NaN	NaN	NaN	NaN	NaN	NaN	NaN	NaN	NaN	NaN	NaN	NaN	NaN	NaN	NaN	NaN	NaN
6.004	NaN	NaN	NaN	NaN	NaN	NaN	NaN	NaN	NaN	NaN	NaN	NaN	NaN	NaN	NaN	NaN	NaN	NaN	NaN	NaN	NaN
6.1374	NaN	NaN	NaN	NaN	NaN	NaN	NaN	NaN	NaN	NaN	NaN	NaN	NaN	NaN	NaN	NaN	NaN	NaN	NaN	NaN	NaN
6.2708	NaN	NaN	NaN	NaN	NaN	NaN	NaN	NaN	NaN	NaN	NaN	NaN	NaN	NaN	NaN	NaN	NaN	NaN	NaN	NaN	NaN
6.4042	NaN	NaN	NaN	NaN	NaN	NaN	NaN	NaN	NaN	NaN	NaN	NaN	NaN	NaN	NaN	NaN	NaN	NaN	NaN	NaN	NaN
6.5377	NaN	NaN	NaN	NaN	NaN	NaN	NaN	NaN	NaN	NaN	NaN	NaN	NaN	NaN	NaN	NaN	NaN	NaN	NaN	NaN	NaN
6.6711	NaN	NaN	NaN	NaN	NaN	NaN	NaN	NaN	NaN	NaN	NaN	NaN	NaN	NaN	NaN	NaN	NaN	NaN	NaN	NaN	NaN
