0.00000,13375.400
0.13342,12801.598
0.26684,16436.781
0.40027,22002.461
0.53369,27332.428
0.66711,27858.742
0.80053,24025.119
0.93395,21534.186
1.06737,19197.516
1.20080,18249.305
1.33422,17359.301
1.46764,13867.202
1.60106,13654.915
1.73448,14158.284
1.86791,13178.498
2.00133,13271.843
2.13475,11505.239
