0.0000	31731.1738
0.1334	30247.2852
0.2668	29408.1602
0.4003	30112.7422
0.5337	31317.8555
0.6671	30820.2715
0.8005	30570.7012
0.9340	30770.7227
1.0674	33225.2266
1.2008	31549.0039
1.3342	31838.6758
1.4676	31155.5469
1.6011	30553.7070
1.7345	32349.2051
1.8679	32276.9766
2.0013	32390.3203
2.1347	34092.3984
2.2682	39026.7578
2.4016	50816.7383
2.5350	71224.4453
2.6684	79377.4922
2.8019	62058.1562
2.9353	42495.1836
3.0687	36723.5312
3.2021	34179.0195
3.3355	34609.2461
