0.00000,32945.992
0.13342,30522.326
0.26684,32275.170
0.40027,32552.287
0.53369,31521.971
0.66711,34463.438
0.80053,33566.887
0.93395,32725.557
1.06737,34751.188
1.20080,34175.027
1.33422,32369.176
1.46764,34758.422
1.60106,33657.043
1.73448,35335.504
1.86791,39145.422
2.00133,37811.172
2.13475,45315.098
2.26817,56936.289
2.40159,85347.117
2.53502,100587.164
2.66844,74316.109
2.80186,49648.570
2.93528,39177.422
3.06870,35229.508
