x	Y_20180514_15338_c1_1_11g	Y_20180514_15338_c1_1_13g	Y_20180514_15338_c1_1_3g	Y_20180514_15338_c1_10_11g	Y_20180514_15338_c1_10_2g	Y_20180514_15338_c1_10_3g	Y_20180514_15338_c1_11_5g	Y_20180514_15338_c1_13_4g	Y_20180514_15338_c1_14_3g	Y_20180514_15338_c1_14_8g	Y_20180514_15338_c1_15_1g	Y_20180514_15338_c1_16_2g	Y_20180514_15338_c1_16_5g	Y_20180514_15338_c1_16_7g	Y_20180514_15338_c1_16_9g	Y_20180514_15338_c1_17_2g	Y_20180514_15338_c1_18_1g	Y_20180514_15338_c1_18_4g	Y_20180514_15338_c1_19_4g	Y_20180514_15338_c1_20_8g	Y_20180514_15338_c1_3_1g	Y_20180514_15338_c1_4_1g	Y_20180514_15338_c1_5_4g	Y_20180514_15338_c1_6_1g	Y_20180514_15338_c1_6_7g	Y_20180514_15338_c1_7_12g	Y_20180514_15338_c1_7_3g	Y_20180514_15338_c1_7_6g	Y_20180514_15338_c1_7_7g	Y_20180514_15338_c1_8_10g	Y_20180514_15338_c1_9_1g
0	32511.6855	31633.0625	30405.4004	34225.7695	33164.6914	31638.8301	33179.8984	31656.9727	30886.3984	31273.459	33064.3672	31623.5625	34254.3398	27392.3672	33289.3789	29665.1309	32112.7871	34338.625	31853.3711	30028.9102	29536.1973	31290.9219	29065.4668	25690.1309	26779.7891	32360.9316	32147.2598	32704.7422	31911.416	28635.5137	26414.1328
0.1334	32906.0195	30299.9336	30148.2109	34505.5273	33649.1719	31360.0078	31643.5781	31542.0605	32135.9395	31960.9238	31785.5566	32632.75	34945.1953	28557.4277	34624.9141	29002.5762	32265.6133	32195.6484	32146.3398	30462.877	30836.2754	29398.1738	31821.4004	26457.9883	27246.1465	32038.8516	30799.9961	32000.2109	30094.1914	29043.6875	27365.8672
0.2668	32222.3574	30361.1836	29538.6094	32942.1133	33763.5977	32713.2129	31763.9688	32571.0879	32384.3262	31827.916	31085.6387	32207.8535	35059.2656	27770.0273	32177.5547	30909.0996	31945.8105	33253.8281	32669.8789	29088.0684	32608.4668	31055.3984	31118.873	26366.043	27084.6953	31604.9961	29897.3926	30921.082	30812.6191	30587.6426	27420.334
0.4003	33248.9219	31042.8984	28927.002	35237.1953	34092.0781	34483.8125	32216.9707	32635.6211	33302.4453	30184.8145	30797.6172	32028.1348	35175.707	26642.7578	31940.3613	29225.5508	32119.8594	33921.4141	32545.0371	30671.7285	31036.2715	32268.2637	31974.0176	27639.1465	25971.4219	31280.582	30455.8594	30952.4023	29697.3867	31962.0195	28135.3379
0.5337	32588.7148	31865.2324	30794.0078	33734.6992	34287.6602	33031.7109	32890.4961	32442.9434	33515.1367	31580.2637	31740.5918	32468.6836	36197.7305	28521.4434	33340.5312	29029.0957	32191.7402	31668.2461	31269.8867	29681.2559	30668.0117	30926.0234	31111.5039	26901.4766	25418.6035	31412.6211	29354.75	31585.582	30068.7285	29274.3184	27736.4199
0.6671	32102.623	32463.4707	28815.1699	34518.2031	34005.125	31833.5234	31731.4668	32518.2188	31461.084	30755.7188	31848.9258	31612.1289	34491.7031	27702.332	33675.4766	27448.6543	32285.1484	31271.6289	32353.8828	30864.916	30663.0488	30933.873	31336.8066	27068.6211	26283.7734	31971.2305	29700.0508	31075.9219	31041.8828	29171.957	27577.3418
0.8005	32640.127	31604.5234	30219.9863	34346.3711	33490.0781	32660.916	32389.9043	33663.9141	33777.0664	31811.8652	31719.8027	33400.8359	33510.7266	27794.4297	32656.3047	27818.0156	30525.123	31752.8984	30788.293	28158.0293	31375.1582	30911.3086	30152.7168	27156.9883	28095.9141	31223.0078	30655.4082	31019.8281	31342.3867	28375.4785	28502.7227
0.934	32424.2617	32455.873	29187.6777	33820.3516	33656.8984	32280.8633	33398.8281	32462.8848	32986.4648	31268.2754	31521.2539	33645.875	35606.6992	28886.127	33781.5391	29145.3828	30298.541	32610.666	29970.627	29449.2168	30681.1875	31562.4961	29872.6465	27416.8652	25926.6699	32171.3789	31814.5938	31581.75	31316.3711	28329.7637	28002.3496
1.0674	33187.7656	31689.1289	29457.8867	34745.3828	33853.5625	33184.1406	32172.7832	31983.2168	33322.5039	30337.1074	31444.5039	33949.6602	34678.6211	29314.291	34085.1758	29034.3828	29775.498	32379.8242	29662.8379	29162.1934	30626.3398	30792.5547	30050.2422	26982.3281	24708.5371	30052.4688	33474.7148	31132.5234	31088.5098	29473.0215	28642.5137
1.2008	31177.7773	30232.8867	29275.0664	34097.9141	33061.7734	33660.4492	31094.7969	32537.75	34156.543	29706.1719	31782.5098	33573.7773	34704.6406	28847.8086	34054.8828	29454.3125	31491.875	32789.8516	30708.7012	29519.4297	29370.0547	30237.9062	29442.4629	26445.0293	25805.707	30016.75	30127.3281	30877.7559	31793.9375	29399.6172	30072.125
1.3342	31281.7227	30451.3164	29699.9219	32025.748	32919.957	35315.2812	35690.0781	32665.1074	33981.3789	30591.7383	32670.5625	33796.3008	35180.5938	29229.9902	34229.4453	30638	31092.0781	33617.0195	30484.6211	30490.7324	27511.252	28930.2969	29617.4121	26995.0352	26408.627	30682.7266	30565.4141	31127.9102	32758.3965	30344.043	30200.7285
1.4676	33797.9062	31254.6855	29639.7148	34575.6719	32951.2852	35466.9023	36417.7461	32157.6719	34250.4414	31357.8105	31352.1758	32074.8281	35043.1914	29215.4199	34712.832	31611.8691	30884.1914	33736.1797	31269.457	30868.8262	28565.7207	27793.498	29675.8652	26846.1328	26582.9395	31158.7852	32728.1621	31546.8965	30388.8496	30704.293	28213.6035
1.6011	31450.3086	32466.4434	28686.873	33834.6016	33432.2422	34452.9141	33133.8398	32072.1562	34657.4336	28793.918	33213.6758	32693.5605	34000.25	29612.2109	35218.8164	34956.6719	31699.8477	34291.6992	32919.0078	29088.3281	29715.1875	28659.2227	30837.0527	26487.7051	26447.1348	29942.2812	31914.1094	31017.2559	31169.0879	34139.3242	28599.793
1.7345	32603.8379	33188.7109	29421.8086	34320.6094	33330.0039	32716.3633	32465.8574	32229.9766	34265.3086	30278.3652	32512.0273	33570.3359	33064.5352	29386.416	34660.6445	44411.4844	30780.4316	34618.7539	38133.5078	29428.1016	29689.0371	30036.582	30274.0508	26745.3613	26810.6934	28859.3379	32531.2832	30429.6309	32133.0742	37936.7422	28275.252
1.8679	32365.2578	34530.8125	30165.6035	34417.1875	34091.0938	32911.5312	34141.9883	33482.5586	33145.9219	30418.8828	32754.3223	33083.5664	34373.1484	30942.4609	33078.875	63881.0781	32479.6367	34215.7031	48681.8789	31277.875	30509.2363	29933.9102	30093.1309	27562.7344	27863.7949	30824.3438	31329.3379	29599.25	35012.4961	45911.6484	28443.8828
2.0013	32565.8242	38442.2852	31101.3262	32783.8633	33270.5547	31483.9395	33166.6641	32857.4609	33895.0781	31838.9609	34236.207	33577.8828	34700.4414	34304.3008	34553.4648	72846.0859	32887.6445	35084.8828	52817.8164	30832.7441	30833.6582	30317.8574	29169.875	27101.3984	30283.0332	30624.9199	31445.3594	31845.6914	42036.6328	68945.9219	29956.1973
2.1347	33125.4531	54315.2188	33222.2852	34994.9766	36887.2852	31934.4707	32097.2363	32842.1992	33606.7734	33084.6641	37694.8672	33959.7656	35632.1914	36505.8008	34362.9453	58579.9453	37100.0391	38044.2148	44508.4414	33157.7461	32351.4414	30855.3945	29903.2793	26313.1816	32990.0547	30923.4043	31409.7129	31944.373	55406.7891	115866.6172	30458.3828
2.2682	33405.2656	76509.5312	33568.5156	33876.4766	42779.9883	33000.875	36498.5547	35515.7812	34066.8984	34430.4531	49336.8477	35996.7188	45566.6406	39126.8984	35237.1094	43737.6719	45436.4141	47356.8203	NaN	36201.9414	33800.4727	31938.6387	31112.9629	26842.8047	39400.7383	31350.4062	32502.0117	33376.2656	57772.875	132187.9375	31816.8379
2.4016	34403.7734	95567.6719	37274.4688	36021.2148	51673.332	33643.957	39860.2383	40428.0312	33140.625	38192.6328	76021.5547	37738.5547	67338.3828	55599.9141	38901.0312	34331.2539	64217.4766	70481.9531	NaN	48882.0781	35794.1992	34077.3242	31291.0176	28298.0547	57170.4102	32673.0449	31916.002	35364.625	45847.6992	96621.0391	35512.0234
2.535	36037.918	85016.5469	47964.1992	40060.0117	69175.1562	37317.9023	54071.6758	53524.1445	35522.8359	47862.9688	103247.5703	43427.9414	106136.3203	85630.75	47805.7891	NaN	90032.2031	100949.5469	NaN	70988.625	45216.5	36164.7188	31584.3867	28832.7598	92597.9297	34169.9844	32590.8965	44917.0586	35281.793	63091.1719	45296.2734
2.6684	41678.6406	57734.1172	60974.2188	40605.9023	93960.2891	53104.9531	82108.3984	84554.1562	37882.5703	75909.0156	91353.9531	53921.3984	117046.9688	100979.6719	71739.9375	NaN	85183.4609	105187.1406	NaN	106149.8203	60709.5703	47165.5977	35920.9492	32320.2402	101567.5859	38296.1914	33621.4336	60485.0781	32582.0605	49622.0781	69679.7578
2.8019	55153.625	44762.3672	61131.0156	52111.0508	109828.7734	86765.2891	96590.6797	112453.7578	40434.832	118664.0078	62123.4766	85873.3594	80804.7422	78292.9297	111345.3516	NaN	60957.4453	75357.2812	NaN	105770.7656	68216.0312	64447.2734	41739.3945	39560.0039	75638.3359	50887.6641	41260.4844	76763.25	30573.4551	40638.3906	110323.2109
2.9353	63170.6992	NaN	46307.5078	75984.7188	98323.7969	120772.6641	68857.7969	108870.1641	48147.2031	124902.9609	45822.9375	115298.4297	53089.8906	52157.4258	139082.125	NaN	42830.7266	48521.4766	NaN	68356.8438	55496.8633	70418.5312	53979.207	52923.5	51470.168	75859.8203	55776.8477	71524.0781	31019.168	35101.0078	130264.8516
3.0687	53001.8945	NaN	38419.1289	103978.6797	68152	110473.875	45876.2734	72907.4844	71892.0078	89830.0156	39859.5234	109023.5234	41960.9414	39537.9531	115634.5547	NaN	35914.1914	39346.8594	NaN	46486.9102	43984.1367	56654.3398	59585.3867	74063.0781	42987.043	85194.7734	71708.2422	50406.707	NaN	32214.7441	99452.3281
3.2021	41401.0898	NaN	NaN	94700.2266	48172.8047	73182.2969	NaN	47606.1641	112537.1328	54343.9961	NaN	74121.0625	NaN	34621.1602	69696.9531	NaN	NaN	36127.0547	NaN	34895.2734	36478.6641	44451.0859	50010.4531	71790.7734	NaN	64183.6641	68737.0938	38864.0078	NaN	NaN	65398.5625
3.3355	35993.3398	NaN	NaN	64825.4492	39243.3516	48710.9844	NaN	38209.1094	132241.3281	39723.2656	NaN	51117.1562	NaN	32890.1406	44916.9102	NaN	NaN	NaN	NaN	NaN	NaN	35990.4141	38067.5977	54370.8008	NaN	44392.8242	52417.6953	33800.5078	NaN	NaN	49417.4141
3.469	35578.0391	NaN	NaN	45954.8867	NaN	40581.793	NaN	NaN	101965.1172	NaN	NaN	41565.9062	NaN	NaN	37732.5352	NaN	NaN	NaN	NaN	NaN	NaN	NaN	33766.1289	42286.5391	NaN	35385.082	40331.7617	32190.7305	NaN	NaN	41908.9609
3.6024	33386.6172	NaN	NaN	42221.4102	NaN	NaN	NaN	NaN	64858.6523	NaN	NaN	NaN	NaN	NaN	35948.1445	NaN	NaN	NaN	NaN	NaN	NaN	NaN	30855.7793	36334.0625	NaN	31973.9102	33706.0547	NaN	NaN	NaN	37689.0781
3.7358	33259.0156	NaN	NaN	NaN	NaN	NaN	NaN	NaN	47380.1016	NaN	NaN	NaN	NaN	NaN	NaN	NaN	NaN	NaN	NaN	NaN	NaN	NaN	NaN	NaN	NaN	30871.6797	32266.957	NaN	NaN	NaN	NaN
3.8692	NaN	NaN	NaN	NaN	NaN	NaN	NaN	NaN	39808.9648	NaN	NaN	NaN	NaN	NaN	NaN	NaN	NaN	NaN	NaN	NaN	NaN	NaN	NaN	NaN	NaN	NaN	NaN	NaN	NaN	NaN	NaN
4.0027	NaN	NaN	NaN	NaN	NaN	NaN	NaN	NaN	36838.6445	NaN	NaN	NaN	NaN	NaN	NaN	NaN	NaN	NaN	NaN	NaN	NaN	NaN	NaN	NaN	NaN	NaN	NaN	NaN	NaN	NaN	NaN
4.1361	NaN	NaN	NaN	NaN	NaN	NaN	NaN	NaN	36569.8867	NaN	NaN	NaN	NaN	NaN	NaN	NaN	NaN	NaN	NaN	NaN	NaN	NaN	NaN	NaN	NaN	NaN	NaN	NaN	NaN	NaN	NaN
4.2695	NaN	NaN	NaN	NaN	NaN	NaN	NaN	NaN	NaN	NaN	NaN	NaN	NaN	NaN	NaN	NaN	NaN	NaN	NaN	NaN	NaN	NaN	NaN	NaN	NaN	NaN	NaN	NaN	NaN	NaN	NaN
4.4029	NaN	NaN	NaN	NaN	NaN	NaN	NaN	NaN	NaN	NaN	NaN	NaN	NaN	NaN	NaN	NaN	NaN	NaN	NaN	NaN	NaN	NaN	NaN	NaN	NaN	NaN	NaN	NaN	NaN	NaN	NaN
4.5363	NaN	NaN	NaN	NaN	NaN	NaN	NaN	NaN	NaN	NaN	NaN	NaN	NaN	NaN	NaN	NaN	NaN	NaN	NaN	NaN	NaN	NaN	NaN	NaN	NaN	NaN	NaN	NaN	NaN	NaN	NaN
4.6698	NaN	NaN	NaN	NaN	NaN	NaN	NaN	NaN	NaN	NaN	NaN	NaN	NaN	NaN	NaN	NaN	NaN	NaN	NaN	NaN	NaN	NaN	NaN	NaN	NaN	NaN	NaN	NaN	NaN	NaN	NaN
4.8032	NaN	NaN	NaN	NaN	NaN	NaN	NaN	NaN	NaN	NaN	NaN	NaN	NaN	NaN	NaN	NaN	NaN	NaN	NaN	NaN	NaN	NaN	NaN	NaN	NaN	NaN	NaN	NaN	NaN	NaN	NaN
4.9366	NaN	NaN	NaN	NaN	NaN	NaN	NaN	NaN	NaN	NaN	NaN	NaN	NaN	NaN	NaN	NaN	NaN	NaN	NaN	NaN	NaN	NaN	NaN	NaN	NaN	NaN	NaN	NaN	NaN	NaN	NaN
5.07	NaN	NaN	NaN	NaN	NaN	NaN	NaN	NaN	NaN	NaN	NaN	NaN	NaN	NaN	NaN	NaN	NaN	NaN	NaN	NaN	NaN	NaN	NaN	NaN	NaN	NaN	NaN	NaN	NaN	NaN	NaN
5.2035	NaN	NaN	NaN	NaN	NaN	NaN	NaN	NaN	NaN	NaN	NaN	NaN	NaN	NaN	NaN	NaN	NaN	NaN	NaN	NaN	NaN	NaN	NaN	NaN	NaN	NaN	NaN	NaN	NaN	NaN	NaN
5.3369	NaN	NaN	NaN	NaN	NaN	NaN	NaN	NaN	NaN	NaN	NaN	NaN	NaN	NaN	NaN	NaN	NaN	NaN	NaN	NaN	NaN	NaN	NaN	NaN	NaN	NaN	NaN	NaN	NaN	NaN	NaN
5.4703	NaN	NaN	NaN	NaN	NaN	NaN	NaN	NaN	NaN	NaN	NaN	NaN	NaN	NaN	NaN	NaN	NaN	NaN	NaN	NaN	NaN	NaN	NaN	NaN	NaN	NaN	NaN	NaN	NaN	NaN	NaN
5.6037	NaN	NaN	NaN	NaN	NaN	NaN	NaN	NaN	NaN	NaN	NaN	NaN	NaN	NaN	NaN	NaN	NaN	NaN	NaN	NaN	NaN	NaN	NaN	NaN	NaN	NaN	NaN	NaN	NaN	NaN	NaN
5.7371	NaN	NaN	NaN	NaN	NaN	NaN	NaN	NaN	NaN	NaN	NaN	NaN	NaN	NaN	NaN	NaN	NaN	NaN	NaN	NaN	NaN	NaN	NaN	NaN	NaN	NaN	NaN	NaN	NaN	NaN	NaN
5.8706	NaN	NaN	NaN	NaN	NaN	NaN	NaN	NaN	NaN	NaN	NaN	NaN	NaN	NaN	NaN	NaN	NaN	NaN	NaN	NaN	NaN	NaN	NaN	NaN	NaN	NaN	NaN	NaN	NaN	NaN	NaN
