x	Y_20180514_15100b_15_7g	Y_20180514_15100b_16_6g	Y_20180514_15100b_16_9g	Y_20180514_15100b_17_7g	Y_20180514_15100b_18_7g	Y_20180514_15100b_5_3g	Y_20180514_15100b_9_9g
0	33270.285	33405.07	32562.871	33796.055	35277.977	31367.639	33467.301
0.1334	32319.543	33306.609	32605.326	34081.848	34044.188	32277.613	31829.123
0.2668	33527.379	33946.445	33033.062	33847.066	34607.098	32685.801	32199.502
0.4003	31756.227	34820.801	32577.951	31345.684	35029.895	33258.23	31991.5
0.5337	31949.807	32875.344	33504.164	33598.102	34886.375	31796.371	32447.734
0.6671	31630.369	33336.621	34927.312	34741.145	34111	32369.373	35170.77
0.8005	32846.789	32331.488	33233.129	33501.191	35176.812	33493.41	33013.477
0.934	33769.32	32181.619	33632.422	34147.047	36297.391	32466.633	34252.598
1.0674	33371.078	32044.953	33649.891	33892.844	37064.504	32053.875	34032.027
1.2008	34762.699	33367.051	32598.029	33821.203	39138.129	33624.629	38757.164
1.3342	33816.145	32469.109	32907.93	33694.156	42646.473	34692.996	44385.305
1.4676	34448.785	33488.453	34564.262	33875.191	59128.828	34554.852	59402.793
1.6011	33395.688	34684.453	34717.961	34072.73	85186.594	34219.688	95655.422
1.7345	33845.918	39406.07	33615.461	35936.738	94552.883	33063.48	125930.117
1.8679	33644.391	55215.664	34599.914	38973.457	71568.242	35166.434	97643.969
2.0013	33974.34	83716.328	38448.074	43867.402	50102.617	35294.812	59988.809
2.1348	34612.305	98700.664	47101.793	47329.219	41199.195	39137.309	NaN
2.2682	36648.863	76289.984	56971.035	45826.453	38215.641	45647.789	NaN
2.4016	41744.227	51838.883	57450.297	39990.758	35022.82	53420.488	NaN
2.535	55818.637	41119.883	45052.156	34932.707	NaN	50535.598	NaN
2.6684	61732.184	36147.422	37264.461	34602.457	NaN	42110.098	NaN
2.8019	49913.371	35718.16	33931.883	NaN	NaN	36364.297	NaN
2.9353	39153.754	NaN	NaN	NaN	NaN	35205.395	NaN
3.0687	36886.488	NaN	NaN	NaN	NaN	34482.312	NaN
3.2021	NaN	NaN	NaN	NaN	NaN	NaN	NaN
3.3356	NaN	NaN	NaN	NaN	NaN	NaN	NaN
3.469	NaN	NaN	NaN	NaN	NaN	NaN	NaN
3.6024	NaN	NaN	NaN	NaN	NaN	NaN	NaN
3.7358	NaN	NaN	NaN	NaN	NaN	NaN	NaN
3.8692	NaN	NaN	NaN	NaN	NaN	NaN	NaN
4.0027	NaN	NaN	NaN	NaN	NaN	NaN	NaN
4.1361	NaN	NaN	NaN	NaN	NaN	NaN	NaN
4.2695	NaN	NaN	NaN	NaN	NaN	NaN	NaN
4.4029	NaN	NaN	NaN	NaN	NaN	NaN	NaN
4.5363	NaN	NaN	NaN	NaN	NaN	NaN	NaN
4.6698	NaN	NaN	NaN	NaN	NaN	NaN	NaN
