X,Y
0.00000,10683.302
0.13342,11084.480
0.26684,11364.806
0.40027,12295.913
0.53369,13669.869
0.66711,16114.071
0.80053,16773.617
0.93395,16706.262
1.06737,16815.551
1.20080,17642.436
1.33422,18182.152
1.46764,19764.094
1.60106,18729.168
1.73448,18495.008
1.86791,17685.029
2.00133,16917.887
2.13475,15034.150
2.26817,13307.859
2.40159,13266.633
2.53502,12825.897
2.66844,12942.440
2.80186,12116.546
