0.00000,13863.861
0.13342,14313.291
0.26684,14280.055
0.40027,15237.728
0.53369,16731.873
0.66711,17363.939
0.80053,18675.820
0.93395,17359.812
1.06737,17257.438
1.20080,16922.539
1.33422,19415.326
1.46764,21236.344
1.60106,20817.496
1.73448,18752.598
1.86791,15296.463
2.00133,13473.568
2.13475,12939.419
2.26817,13273.965
2.40159,13326.363
2.53502,14716.567
