x	Y_20180514_15338_c1_12_1g	Y_20180514_15338_c1_13_2g	Y_20180514_15338_c1_19_2g	Y_20180514_15338_c1_29_1g	Y_20180514_15338_c1_4_2g	Y_20180514_15338_c1_9_7g
0	30390.551	30477.594	27391.113	32451.701	30198.533	29078.633
0.1334	29638.059	31227.656	29593.557	31055.34	29702.787	29166.617
0.2668	30116.74	31303.006	28715.775	31434.824	28508.023	29308.732
0.4003	29711.031	31635.824	28910.084	32461.877	28833.127	29610.537
0.5337	29345.631	32709.129	28650.807	32453.818	29636.107	29257.467
0.6671	28709.764	32327.178	27347.566	31572.057	29982.176	28780.658
0.8005	29164.695	33638.992	27173.029	31788.307	28854.811	28560.734
0.934	29251.078	33552.359	28403.191	32167.342	30338.605	28563.529
1.0674	29687.33	34229.387	29232.516	33045.676	30777.189	30431.285
1.2008	30892.197	34124.473	28985.889	34794.043	29800.879	31756.305
1.3342	30330.602	32032.086	28600.256	34151.164	29376.604	30882.516
1.4676	30895.279	32503.086	27756.074	34148.93	29737.225	31297.072
1.6011	32033.383	33205.773	27011.209	34445.691	31025.932	31915.404
1.7345	33207.961	33596.914	28753.758	34019.145	30249.33	31379.08
1.8679	32544.846	34673.492	28122.02	33744.875	29926.656	31479.613
2.0013	32667.828	33794.824	28362.959	32674.25	29353.84	30500.541
2.1348	33013.883	33772.293	28062.312	33156.828	29371.611	30503.42
2.2682	34272.555	34983.32	29861.475	34369.996	30774.596	30797.355
2.4016	33476.277	36102.59	29179.584	34062.035	29610.84	32245.494
2.535	33355.984	35185.348	30152.379	32348.225	29977.227	32260.438
2.6684	33290.105	34851.809	29318.699	33836.004	31544.836	32674.311
2.8019	33721.863	35431.039	31779.307	36021.973	30714	39078.656
2.9353	34162.789	38396.078	35137.117	37937.34	32131.434	47362.184
3.0687	37600.668	44611.551	40789.348	40500.102	30459.684	48362.234
3.2021	45573.605	46636.738	43747.422	47898.34	31171.697	45337.363
3.3356	52135.812	43154.191	41344.461	53358.355	30412.834	37940.699
3.469	48954.059	37772.688	37677.43	47794.684	30208.498	34565.316
3.6024	38371.805	35660.281	36880.453	39597.918	28556.59	34514.609
3.7358	35381.785	36600.234	36076.934	34012.234	29247.924	34229.438
3.8692	35872.281	35794.09	NaN	33022.781	30438.77	34621.887
4.0027	35886.922	37378.598	NaN	33150.957	31775.422	32268.48
4.1361	34790.672	37258.84	NaN	32388.404	31394.658	NaN
4.2695	NaN	35987.906	NaN	31634.482	32972.516	NaN
4.4029	NaN	NaN	NaN	32438.158	34119.668	NaN
4.5363	NaN	NaN	NaN	NaN	37394.078	NaN
4.6698	NaN	NaN	NaN	NaN	41515.004	NaN
4.8032	NaN	NaN	NaN	NaN	41918.988	NaN
4.9366	NaN	NaN	NaN	NaN	34315.574	NaN
5.07	NaN	NaN	NaN	NaN	30980.98	NaN
5.2035	NaN	NaN	NaN	NaN	NaN	NaN
5.3369	NaN	NaN	NaN	NaN	NaN	NaN
5.4703	NaN	NaN	NaN	NaN	NaN	NaN
