0.0000	31553.3223
0.1334	32158.6113
0.2668	32905.3164
0.4003	33639.2500
0.5337	32168.2344
0.6671	32441.2480
0.8005	34005.5703
0.9340	33232.6602
1.0674	33850.6797
1.2008	35868.8516
1.3342	41028.3281
1.4676	52724.3750
1.6011	70774.0469
1.7345	80004.8359
1.8679	66287.6094
2.0013	49107.0586
2.1347	40005.1250
2.2682	35939.0898
2.4016	34070.8164
2.5350	34428.9766
