0.0000	17205.5879
0.1334	20551.1758
0.2668	25750.0586
0.4003	25250.0879
0.5337	23018.9727
0.6671	20071.2051
0.8005	18149.2695
0.9340	16630.1582
1.0674	16068.7373
1.2008	14993.6338
1.3342	13852.4727
1.4676	13516.0508
1.6011	13300.0938
1.7345	12737.8896
1.8679	13830.4727
2.0013	13563.6016
2.1347	13079.6865
2.2682	13143.8438
2.4016	12569.8799
