0.0000	13121.8008
0.1334	13769.9561
0.2668	15400.3525
0.4003	17883.7754
0.5337	21989.3750
0.6671	25248.7637
0.8005	24648.3887
0.9340	19559.1953
1.0674	16620.9531
1.2008	15957.4648
1.3342	14662.7217
1.4676	14306.3193
1.6011	14050.9873
1.7345	14333.2578
1.8679	14388.3574
2.0013	15272.7637
2.1347	15665.9268
2.2682	16550.9023
2.4016	15786.1924
2.5350	16093.4160
2.6684	15291.2031
2.8019	14779.9277
2.9353	14648.0176
3.0687	13613.2744
3.2021	13543.8438
3.3355	13377.4580
3.4690	13170.9521
3.6024	13121.9990
3.7358	13300.8936
3.8692	12699.2109
