0.00000,14732.757
0.13342,15417.754
0.26684,16006.412
0.40027,19022.875
0.53369,22160.217
0.66711,25280.535
0.80053,24964.764
0.93395,25454.422
1.06737,23853.484
1.20080,21707.090
1.33422,19948.234
1.46764,19403.773
1.60106,18781.797
1.73448,16601.789
1.86791,15348.263
2.00133,14190.089
2.13475,14056.265
2.26817,13510.510
2.40159,12917.120
2.53502,12855.278
2.66844,12892.635
