0.00000,37618.340
0.13342,36696.461
0.26684,36230.648
0.40027,36695.684
0.53369,37747.266
0.66711,37557.773
0.80053,37708.906
0.93395,38040.352
1.06737,36117.125
1.20080,36361.727
1.33422,36870.281
1.46764,40461.629
1.60106,46700.445
1.73448,61343.629
1.86791,89259.406
2.00133,103767.867
2.13475,76711.352
2.26817,51391.297
2.40159,46726.316
2.53502,44234.613
2.66844,43474.562
2.80186,39019.383
