x	Y_20180514_15338_c2_1_1g	Y_20180514_15338_c2_10_4g	Y_20180514_15338_c2_12_11g	Y_20180514_15338_c2_12_12g	Y_20180514_15338_c2_12_3g	Y_20180514_15338_c2_12_4g	Y_20180514_15338_c2_13_2g	Y_20180514_15338_c2_13_3g	Y_20180514_15338_c2_14_3g	Y_20180514_15338_c2_15_4g	Y_20180514_15338_c2_16_7g	Y_20180514_15338_c2_19_3g	Y_20180514_15338_c2_21_4g	Y_20180514_15338_c2_21_5g	Y_20180514_15338_c2_21_7g	Y_20180514_15338_c2_22_2g	Y_20180514_15338_c2_23_1g	Y_20180514_15338_c2_23_3g	Y_20180514_15338_c2_23_4g	Y_20180514_15338_c2_25_2g	Y_20180514_15338_c2_25_3g	Y_20180514_15338_c2_26_6g	Y_20180514_15338_c2_27_2g	Y_20180514_15338_c2_27_3g	Y_20180514_15338_c2_29_2g	Y_20180514_15338_c2_29_3g	Y_20180514_15338_c2_29_4g	Y_20180514_15338_c2_29_5g	Y_20180514_15338_c2_3_2g	Y_20180514_15338_c2_3_5g	Y_20180514_15338_c2_30_1g	Y_20180514_15338_c2_30_3g	Y_20180514_15338_c2_31_1g	Y_20180514_15338_c2_31_2g	Y_20180514_15338_c2_31_5g	Y_20180514_15338_c2_32_2g	Y_20180514_15338_c2_32_3g	Y_20180514_15338_c2_32_4g	Y_20180514_15338_c2_33_3g	Y_20180514_15338_c2_33_5g	Y_20180514_15338_c2_34_4g	Y_20180514_15338_c2_34_5g	Y_20180514_15338_c2_34_6g	Y_20180514_15338_c2_34_9g	Y_20180514_15338_c2_35_4g	Y_20180514_15338_c2_36_1g	Y_20180514_15338_c2_4_4g	Y_20180514_15338_c2_6_2g	Y_20180514_15338_c2_7_4g	Y_20180514_15338_c2_8_3g	Y_20180514_15338_c2_9_5g	Y_20180514_15338_c2_9_6g
0	11443.091	9728.793	10091	12337.729	12000.47	10720.814	11989.092	11247.693	10234.577	9565.208	17836.555	10539.987	10478.487	10652.695	14121.825	11234.536	11175.391	13148.118	12636.608	10269.878	12798.135	13401.744	12117.415	14500.979	12700.844	10991.488	10487.001	15002.895	9514.008	10256.366	11986.233	13266.6	12598.24	10314.845	14947.388	9202.465	11495.337	10462.655	10211.504	12412.588	12533.658	11432.051	13163.808	11974.462	9416.015	13970.725	9694.772	12779.69	13418.676	11892.452	11602.965	11788.9
0.1334	11256.623	10158.098	10748.027	12142.724	11789.834	10388.83	11982.93	12099.546	10516.268	9644.497	16772.053	10323.224	10299.24	11547.1	15152.026	11818.861	10864.083	12868.551	12677.334	10138.87	13967.263	13501.18	12336.396	14924.151	12408.912	10956.948	11188.906	15970.281	10523.294	9634.634	11881.553	12588.916	13336.918	11033.724	15684.989	9106.878	11497.754	10376.985	10528.499	12750.169	13323.171	11268.681	13370.486	12052.521	9342.166	15012.852	9593.052	11961.742	12869.636	11712.447	12023.312	12053.065
0.2668	10875.67	10763.13	11178.533	13074.316	11381.467	10510.632	11803.716	13961.068	11282.75	10239.248	16418.857	10630.59	9892.284	12278.8	15241.062	11851.905	10543.231	13336.522	11591.215	11290.13	13682.519	13897.688	10978.196	14741.149	11484.775	10955.108	11916.213	16199.434	11010.271	10270.358	11629.734	13100.283	13015.568	11814.865	16202.588	9250.366	10945.98	10679.949	9883.696	12356.095	13639.833	11954.903	12685.381	12156.206	9618.353	15505.274	9839.782	12082.164	12590.021	11640.923	13231.039	14338.155
0.4003	11445.794	11434.108	12638.759	13732.114	11771.77	11217.351	12148.797	15939.911	11463.246	11103.375	18693.006	10272.543	10009.485	12831.33	15714.393	13232.016	10591.655	14140.647	11985.596	12982.43	14360.492	14581.623	11391.285	15021.178	10732.195	10636.516	12570.151	15880.374	12275.713	10730.693	11112.903	13598.561	14495.616	12770.335	16446.537	9730.41	11204.15	10713.085	10051.075	12856.971	13821.986	12144.558	12433.924	11889.46	10191.287	16003.795	10264.888	12451.381	12757.688	11288.854	12818.737	15887.757
0.5337	12209.012	12545.879	14794.416	13280.872	14954.54	12914.692	12883.962	16045.133	12674.011	12053.92	22861.045	10713.125	10705.618	13950.004	16146.09	14519.045	11594.683	17454.492	12161.298	15863.236	15340.627	14430.323	12077.413	15685.45	10839.681	10335.981	13520.732	14919.095	13431.795	12706.516	11161.339	16376.173	15240.696	12926.604	19234.414	10999.052	11076.814	12347.408	10756.599	13344.976	14988.807	13928.447	11370.12	12358.286	10803.439	15793.05	11767.539	12705.396	12710.959	12252.592	13443.807	18260.131
0.6671	12759.733	13126.696	17070.098	14820.081	16942.738	15522.93	12975.432	14765.565	13936.617	12816.725	27876.877	11302.161	10794.915	13723.044	16808.824	16008.163	13119.962	19529.291	13568.041	17986.66	14533.994	17241.875	13093.565	17739.342	11178.505	10716.476	15032.869	16342.189	14985.791	14510.158	11659.057	19032.094	16558.877	13371.298	22387.404	13555.773	12781.22	13279.151	11437.473	14127.377	15210.923	16601.119	11814.11	12418.285	11097.53	14644.883	15062.411	12790.983	13749.911	13971.43	14613.422	19061.287
0.8005	13352.594	13465.234	19175.414	15993.579	16889.037	17774.924	13336.622	13735.77	15724.355	13833.782	27746.623	11988.756	11559.955	13322.695	18064.553	17635.297	14990.868	18974.965	16678.031	18704.088	14667.771	20673.494	14645.137	19665.955	12992.132	11348.883	16663.514	16196.866	16966.934	17706.135	12230.209	21061.18	16661.311	13988.059	19364.494	15268.029	15228.772	14820.585	13792.631	15328.975	16949.059	17313.668	12323.91	13440.896	12155.054	16102.288	18663.574	14116.958	13483.226	15487.151	18208.469	19569.215
0.934	15047.806	14788.299	19226.955	19236.355	16511.41	16896.355	12948.029	13565.396	14699.799	14850.803	23556.855	12991.631	13647.669	14701.709	17779.949	16934.938	15962.693	17311.641	18070.121	15934.228	15605.997	26684.934	17580.391	18454.873	14930.812	14417.248	19375.943	17312.256	17611.184	17501.451	12972.959	19129.48	17085.703	16635.246	18046.635	17265.227	14868.64	16150.098	15030.647	15091.335	19124.699	16970.061	14558.087	14491.006	13495.07	19025.025	19517.305	16490.969	15067.934	15761.205	21642.611	17223.375
1.0674	17353.113	15478.947	20411.506	21261.615	16280.427	16492.404	14030.149	13180.695	13187.92	16281.38	21260.588	14651.139	16544.328	16287.748	18047.391	14878.581	20135.428	16865.328	18068.117	15192.94	19234.891	26554.941	21439.051	17229.113	14971.152	17392.438	19165.936	19066.523	17163.43	15290.936	13754.987	17593.932	18111.115	19210.922	17727.381	16728.129	15104.973	16074.492	16672.447	15534.236	23072.709	19021.449	19601.283	17231.4	15314.098	20993.098	19595.863	18404.439	17671.414	15284.213	20819.695	17757.785
1.2008	17587.064	19614.504	20475.365	22131.553	15513.756	16621.607	15965.034	13127.25	13342.517	16995.078	20852.762	16344.148	18938.047	17562.051	16508.125	13943.188	24495.971	16515.805	18386.283	15458.267	18646.674	21445.49	21010.887	16006.28	14535.816	19244.01	16998.641	20129.4	15874.636	13522.548	15159.672	16908.969	17338.584	19286.062	16541.9	15029.982	15336.578	17624.887	18032.717	14887.217	25430.379	16856.133	24831.66	19761.529	14425.73	21866.398	20104.584	18934.85	18698.646	14962.112	19316.291	17048.666
1.3342	17064.051	20477.861	23671.848	20862.738	14656.192	17962.137	16640.062	13039.08	13144.413	18425.711	17362.672	17313.273	21768.984	17765.686	15702.572	13981.757	27242.391	16044.131	18260.957	14999.045	18430.646	18096.604	19856.33	16178.213	14620.141	19541.488	14918.923	20083.494	16164.872	13461.006	17226.82	16333.006	17947.523	18849.504	15260.488	14281.656	14835.689	17552.768	17691.652	14154.495	23767.309	14418.063	24417.65	19314.164	14717.259	20465.699	20697.812	17734.311	17786.025	14811.225	19024.52	16643.805
1.4676	16214.83	17924.111	22686.738	19319.541	14865.431	18736.467	16275.429	12073.741	12580.746	18507.859	16914.537	16790.471	21029.451	16222.124	15758.134	14177.013	24209.619	16449.965	18253.924	16412.283	17241.463	16757.527	20687.158	16298.983	13314.185	20245.152	13521.319	18244.104	16375.922	13183.564	19274.99	17305.744	18473.373	19353.477	14295.097	13621.662	14746.929	16659.541	17683.168	13046.829	21718.42	13987.435	21834.971	19264.602	14775.197	19222.582	22186.141	16316.208	15251.224	14517.684	20270.672	16759.822
1.6011	15869.43	16447.055	21293.273	17124.352	15078.324	19533.549	14660.384	12326.049	11950.572	16977.25	16668.713	16544.162	19329.912	14744.311	14934.167	13237.117	22743.572	14826.637	19413.977	15925.619	15313.855	16355.836	19813.277	15974.729	13922.172	19267.338	13196.952	16642.072	16769.996	13206.394	18482.348	15933.425	17293.328	17642.023	14751.932	13699.443	15079.085	15648.052	16819.363	13602.445	20296.627	13480.807	19862.07	19770.676	14294.418	18152.145	22432.762	14840.567	15230.141	13626.299	20555.871	15974.958
1.7345	15098.641	16272.235	22226.275	15605.248	15096.867	21190.184	13787.11	12533.006	11482.91	17537.016	15711.877	16203.97	17000.574	13863.459	13925.882	12780.309	20691.877	14822.837	17888.539	15058.687	14948.978	15887.766	19018.012	14810.156	14343.988	19637.639	12911.703	15518.583	15760.928	12581.557	17213.164	15932.595	17104.41	17377.906	14536.862	13904.118	14107.343	14384.118	16054	NaN	19519.371	12944.53	17474.781	18201.514	14034.118	17996.104	20241.939	13451.199	15107.47	13512.481	18184.391	16016.897
1.8679	14620.744	16395.523	22987.953	14428.298	14757.473	21678.516	13939.429	12361.257	10958.391	17839.152	15364.164	16362.311	17146.174	14538.092	13771.613	12498.452	18479.51	16095.22	17056.623	14317.923	13836.702	15179.115	16878.678	14745.913	14143.688	20724.469	12387.38	15520.655	15430.106	14275.209	16909.559	16462.697	14871.868	18104.051	13665.841	14640.434	15080.336	14291.711	15631.586	NaN	16801.973	12789.143	17852.086	16292.421	13643.165	16753.715	18081.074	12913.539	14419.319	13025.292	16126.542	14258.902
2.0013	13972.566	14927.276	24670.893	13646.864	14231.22	20470.43	13707.498	12356.408	11392.002	17064.289	16146.7	16995.559	15590.137	13729.832	14196.339	12635.106	17100.281	14906.392	17304.201	14276.747	13790.776	14885.014	17029.264	14311.204	14212.56	18954.408	12885.132	15235.849	14689.582	13683.719	16227.881	17443.787	14130.708	17844.383	13913.715	14452.208	14577.125	13239.808	14354.305	NaN	16126.818	13014.847	15743.056	14480.337	12911.729	15981.23	16852.447	13006.231	14157.854	12251.839	14386.645	13511.757
2.1348	13859.008	14834.503	24408.891	13441.615	14259.395	19464.424	13029.81	11531.044	10538.415	16177.327	15633.344	16322.793	14709.271	13566.814	13659.021	11941.867	16960.414	14425.594	14868.363	14642.641	13887.83	14229.775	16089.298	13832.429	14117.408	17437.365	13118.673	14581.939	14780.168	NaN	14895.267	NaN	13537.873	16692.852	15051.652	14302.25	NaN	12449.612	12937.023	NaN	14511.151	13857.317	14496.924	14974.083	13412.654	15883.949	15958.131	12375.933	13734.769	12719.612	14085.359	12983.35
2.2682	13354.196	14713.545	19955.645	13218.573	15345.035	19646.402	13191.752	NaN	10195.268	15126.342	14598.612	15565.803	14864.316	NaN	14071.622	12205.394	16312.099	14161.16	14808.12	13909.496	13573.063	14503.741	15634.115	13491.821	13452.158	16016.926	13147.703	14607.609	13885.429	NaN	14758.982	NaN	12378.291	15833.665	NaN	13419.938	NaN	12953.648	12360.222	NaN	14356.096	12902.519	14713.116	14644.025	12476.496	14940.815	16195.149	12368.322	12520.716	12926.156	14315.031	13160.522
2.4016	13083.337	14072.04	15733.195	13526.341	14115.482	18880.932	NaN	NaN	10268.094	15284.528	15365.785	14900.706	14660.935	NaN	13468.396	11896.355	15504.705	14534.268	14063.62	13814.705	12736.337	14024.939	15289.503	13816.865	12893.971	14969.304	12438.197	15075.24	14096.725	NaN	14543.927	NaN	12560.163	16407.711	NaN	NaN	NaN	12470.641	12827.216	NaN	14586.44	13132.638	14758.749	13839.241	12482.484	14409.723	14891.688	12944.279	12520.187	12953.34	13293.222	13678.249
2.535	NaN	14266.782	14679.604	12665.977	14062.349	18008.941	NaN	NaN	10558.034	14187.356	NaN	14707.148	14307.338	NaN	NaN	NaN	13915.324	NaN	13957.057	13628.524	12430.771	13725.235	14854.972	13952.277	13658.417	14058.288	12984.953	14099.096	13640.128	NaN	13850.459	NaN	12185.113	16196.941	NaN	NaN	NaN	12144.841	12579.077	NaN	13920.608	14632.489	13971.093	14066.682	12490.211	14054.803	14166.349	NaN	12624.791	12905.383	12832.632	13136.749
2.6684	NaN	14008.397	14601.401	NaN	13616.221	16714.447	NaN	NaN	NaN	14588.61	NaN	14478.108	14758.208	NaN	NaN	NaN	13300.903	NaN	13570.885	13076.726	11197.633	14019.255	15320.175	NaN	13588.304	14454.772	12890.393	14030.55	NaN	NaN	13881.104	NaN	11723.751	15433.155	NaN	NaN	NaN	12278.414	12802.973	NaN	13663.685	14891.6	13745.375	12969.402	12532.52	NaN	13745.075	NaN	12147.469	12605.633	NaN	12704.77
2.8019	NaN	14692.66	NaN	NaN	NaN	15581.759	NaN	NaN	NaN	15030.001	NaN	14390.397	14878.94	NaN	NaN	NaN	13405.716	NaN	14661.325	13265.457	NaN	14054.025	16110.67	NaN	NaN	14361.365	NaN	NaN	NaN	NaN	14033.916	NaN	11789.904	14876.016	NaN	NaN	NaN	12027.265	12375.651	NaN	13038.595	14928.443	13544.062	13231.492	12566.698	NaN	13040.306	NaN	11753.126	NaN	NaN	12454.597
2.9353	NaN	14292.923	NaN	NaN	NaN	15590.111	NaN	NaN	NaN	15597.282	NaN	NaN	14462.08	NaN	NaN	NaN	13350.514	NaN	NaN	14020.978	NaN	NaN	NaN	NaN	NaN	14407.538	NaN	NaN	NaN	NaN	15494.624	NaN	11902.433	13967.597	NaN	NaN	NaN	NaN	12068.222	NaN	12345.006	NaN	13787.783	12473.955	12035.745	NaN	12598.8	NaN	12201.348	NaN	NaN	NaN
3.0687	NaN	14035.475	NaN	NaN	NaN	14820.06	NaN	NaN	NaN	16432.225	NaN	NaN	13891.748	NaN	NaN	NaN	13700.39	NaN	NaN	13972.058	NaN	NaN	NaN	NaN	NaN	14051.007	NaN	NaN	NaN	NaN	16340.777	NaN	NaN	NaN	NaN	NaN	NaN	NaN	12517.891	NaN	11396.574	NaN	14313.318	12057.136	11696.304	NaN	13484.1	NaN	11411.903	NaN	NaN	NaN
3.2021	NaN	NaN	NaN	NaN	NaN	14723.84	NaN	NaN	NaN	17922.811	NaN	NaN	NaN	NaN	NaN	NaN	13600.065	NaN	NaN	NaN	NaN	NaN	NaN	NaN	NaN	13699.826	NaN	NaN	NaN	NaN	NaN	NaN	NaN	NaN	NaN	NaN	NaN	NaN	12769.59	NaN	11096.308	NaN	NaN	NaN	NaN	NaN	14830.513	NaN	NaN	NaN	NaN	NaN
3.3356	NaN	NaN	NaN	NaN	NaN	14833.197	NaN	NaN	NaN	NaN	NaN	NaN	NaN	NaN	NaN	NaN	14534.523	NaN	NaN	NaN	NaN	NaN	NaN	NaN	NaN	13432.066	NaN	NaN	NaN	NaN	NaN	NaN	NaN	NaN	NaN	NaN	NaN	NaN	12219.07	NaN	11115.793	NaN	NaN	NaN	NaN	NaN	14179.784	NaN	NaN	NaN	NaN	NaN
3.469	NaN	NaN	NaN	NaN	NaN	14316.005	NaN	NaN	NaN	NaN	NaN	NaN	NaN	NaN	NaN	NaN	15357.847	NaN	NaN	NaN	NaN	NaN	NaN	NaN	NaN	13741.435	NaN	NaN	NaN	NaN	NaN	NaN	NaN	NaN	NaN	NaN	NaN	NaN	12581.112	NaN	10954.39	NaN	NaN	NaN	NaN	NaN	14148.498	NaN	NaN	NaN	NaN	NaN
3.6024	NaN	NaN	NaN	NaN	NaN	14332.892	NaN	NaN	NaN	NaN	NaN	NaN	NaN	NaN	NaN	NaN	15582.867	NaN	NaN	NaN	NaN	NaN	NaN	NaN	NaN	14058.289	NaN	NaN	NaN	NaN	NaN	NaN	NaN	NaN	NaN	NaN	NaN	NaN	11848.326	NaN	11259.03	NaN	NaN	NaN	NaN	NaN	NaN	NaN	NaN	NaN	NaN	NaN
3.7358	NaN	NaN	NaN	NaN	NaN	14669.533	NaN	NaN	NaN	NaN	NaN	NaN	NaN	NaN	NaN	NaN	14365.584	NaN	NaN	NaN	NaN	NaN	NaN	NaN	NaN	NaN	NaN	NaN	NaN	NaN	NaN	NaN	NaN	NaN	NaN	NaN	NaN	NaN	NaN	NaN	NaN	NaN	NaN	NaN	NaN	NaN	NaN	NaN	NaN	NaN	NaN	NaN
3.8692	NaN	NaN	NaN	NaN	NaN	14277.47	NaN	NaN	NaN	NaN	NaN	NaN	NaN	NaN	NaN	NaN	14232.315	NaN	NaN	NaN	NaN	NaN	NaN	NaN	NaN	NaN	NaN	NaN	NaN	NaN	NaN	NaN	NaN	NaN	NaN	NaN	NaN	NaN	NaN	NaN	NaN	NaN	NaN	NaN	NaN	NaN	NaN	NaN	NaN	NaN	NaN	NaN
4.0027	NaN	NaN	NaN	NaN	NaN	13228.062	NaN	NaN	NaN	NaN	NaN	NaN	NaN	NaN	NaN	NaN	NaN	NaN	NaN	NaN	NaN	NaN	NaN	NaN	NaN	NaN	NaN	NaN	NaN	NaN	NaN	NaN	NaN	NaN	NaN	NaN	NaN	NaN	NaN	NaN	NaN	NaN	NaN	NaN	NaN	NaN	NaN	NaN	NaN	NaN	NaN	NaN
4.1361	NaN	NaN	NaN	NaN	NaN	12464.171	NaN	NaN	NaN	NaN	NaN	NaN	NaN	NaN	NaN	NaN	NaN	NaN	NaN	NaN	NaN	NaN	NaN	NaN	NaN	NaN	NaN	NaN	NaN	NaN	NaN	NaN	NaN	NaN	NaN	NaN	NaN	NaN	NaN	NaN	NaN	NaN	NaN	NaN	NaN	NaN	NaN	NaN	NaN	NaN	NaN	NaN
4.2695	NaN	NaN	NaN	NaN	NaN	NaN	NaN	NaN	NaN	NaN	NaN	NaN	NaN	NaN	NaN	NaN	NaN	NaN	NaN	NaN	NaN	NaN	NaN	NaN	NaN	NaN	NaN	NaN	NaN	NaN	NaN	NaN	NaN	NaN	NaN	NaN	NaN	NaN	NaN	NaN	NaN	NaN	NaN	NaN	NaN	NaN	NaN	NaN	NaN	NaN	NaN	NaN
4.4029	NaN	NaN	NaN	NaN	NaN	NaN	NaN	NaN	NaN	NaN	NaN	NaN	NaN	NaN	NaN	NaN	NaN	NaN	NaN	NaN	NaN	NaN	NaN	NaN	NaN	NaN	NaN	NaN	NaN	NaN	NaN	NaN	NaN	NaN	NaN	NaN	NaN	NaN	NaN	NaN	NaN	NaN	NaN	NaN	NaN	NaN	NaN	NaN	NaN	NaN	NaN	NaN
4.5363	NaN	NaN	NaN	NaN	NaN	NaN	NaN	NaN	NaN	NaN	NaN	NaN	NaN	NaN	NaN	NaN	NaN	NaN	NaN	NaN	NaN	NaN	NaN	NaN	NaN	NaN	NaN	NaN	NaN	NaN	NaN	NaN	NaN	NaN	NaN	NaN	NaN	NaN	NaN	NaN	NaN	NaN	NaN	NaN	NaN	NaN	NaN	NaN	NaN	NaN	NaN	NaN
4.6698	NaN	NaN	NaN	NaN	NaN	NaN	NaN	NaN	NaN	NaN	NaN	NaN	NaN	NaN	NaN	NaN	NaN	NaN	NaN	NaN	NaN	NaN	NaN	NaN	NaN	NaN	NaN	NaN	NaN	NaN	NaN	NaN	NaN	NaN	NaN	NaN	NaN	NaN	NaN	NaN	NaN	NaN	NaN	NaN	NaN	NaN	NaN	NaN	NaN	NaN	NaN	NaN
4.8032	NaN	NaN	NaN	NaN	NaN	NaN	NaN	NaN	NaN	NaN	NaN	NaN	NaN	NaN	NaN	NaN	NaN	NaN	NaN	NaN	NaN	NaN	NaN	NaN	NaN	NaN	NaN	NaN	NaN	NaN	NaN	NaN	NaN	NaN	NaN	NaN	NaN	NaN	NaN	NaN	NaN	NaN	NaN	NaN	NaN	NaN	NaN	NaN	NaN	NaN	NaN	NaN
4.9366	NaN	NaN	NaN	NaN	NaN	NaN	NaN	NaN	NaN	NaN	NaN	NaN	NaN	NaN	NaN	NaN	NaN	NaN	NaN	NaN	NaN	NaN	NaN	NaN	NaN	NaN	NaN	NaN	NaN	NaN	NaN	NaN	NaN	NaN	NaN	NaN	NaN	NaN	NaN	NaN	NaN	NaN	NaN	NaN	NaN	NaN	NaN	NaN	NaN	NaN	NaN	NaN
5.07	NaN	NaN	NaN	NaN	NaN	NaN	NaN	NaN	NaN	NaN	NaN	NaN	NaN	NaN	NaN	NaN	NaN	NaN	NaN	NaN	NaN	NaN	NaN	NaN	NaN	NaN	NaN	NaN	NaN	NaN	NaN	NaN	NaN	NaN	NaN	NaN	NaN	NaN	NaN	NaN	NaN	NaN	NaN	NaN	NaN	NaN	NaN	NaN	NaN	NaN	NaN	NaN
5.2035	NaN	NaN	NaN	NaN	NaN	NaN	NaN	NaN	NaN	NaN	NaN	NaN	NaN	NaN	NaN	NaN	NaN	NaN	NaN	NaN	NaN	NaN	NaN	NaN	NaN	NaN	NaN	NaN	NaN	NaN	NaN	NaN	NaN	NaN	NaN	NaN	NaN	NaN	NaN	NaN	NaN	NaN	NaN	NaN	NaN	NaN	NaN	NaN	NaN	NaN	NaN	NaN
