0.00000,33817.555
0.13342,32894.934
0.26684,33140.211
0.40027,32948.410
0.53369,32153.832
0.66711,31662.857
0.80053,32660.287
0.93395,32057.045
1.06737,31841.488
1.20080,30834.348
1.33422,31070.424
1.46764,31786.209
1.60106,33513.355
1.73448,32723.500
1.86791,34486.910
2.00133,35723.043
2.13475,39724.539
2.26817,52855.773
2.40159,80981.383
2.53502,113057.695
2.66844,108120.922
2.80186,70998.828
2.93528,49767.105
3.06870,40865.992
3.20212,38093.844
