0.00000,32756.727
0.13342,31738.383
0.26684,34372.484
0.40027,33324.574
0.53369,33406.336
0.66711,33762.992
0.80053,34400.977
0.93395,35404.457
1.06737,34795.516
1.20080,33005.762
1.33422,32842.242
1.46764,32520.918
1.60106,32305.988
1.73448,34734.562
1.86791,33921.098
2.00133,34312.613
2.13475,33698.953
2.26817,33520.457
2.40159,33976.461
2.53502,34403.438
2.66844,34984.336
2.80186,35972.645
2.93528,39940.539
3.06870,49331.461
3.20212,70809.344
3.33555,94757.156
3.46897,90669.500
3.60239,64792.004
3.73581,45143.559
3.86923,37819.305
