0.00000,17230.209
0.13342,18563.170
0.26684,20314.416
0.40027,23674.945
0.53369,25414.111
0.66711,30274.438
0.80053,37610.469
0.93395,37349.980
1.06737,32879.324
1.20080,28210.799
1.33422,25578.195
1.46764,22455.119
1.60106,21265.234
1.73448,19961.438
1.86791,17252.570
2.00133,15514.784
2.13475,14239.994
2.26817,13502.039
2.40159,13164.841
