0.0000	32234.7461
0.1334	31483.6309
0.2668	32680.6875
0.4003	33500.1719
0.5337	34259.0703
0.6671	34788.5430
0.8005	33967.0938
0.9340	33460.4727
1.0674	33597.6875
1.2008	33594.5664
1.3342	32761.8906
1.4676	32597.8555
1.6011	34168.7031
1.7345	36353.7305
1.8679	36461.7969
2.0013	40936.0156
2.1347	52515.0703
2.2682	73936.2891
2.4016	86960.6016
2.5350	68352.7734
2.6684	46689.5078
2.8019	36619.6914
2.9353	36724.3438
3.0687	36415.3594
3.2021	38455.9609
3.3355	39972.2539
3.4690	38202.3945
