0.00000,14367.506
0.13342,16186.763
0.26684,18067.152
0.40027,20117.646
0.53369,22585.939
0.66711,22881.570
0.80053,22489.492
0.93395,21094.182
1.06737,19508.473
1.20080,19242.338
1.33422,19340.760
1.46764,17319.680
1.60106,17318.959
1.73448,18967.953
1.86791,20541.650
2.00133,21398.092
2.13475,21487.027
2.26817,20264.211
2.40159,18530.307
2.53502,17020.553
2.66844,15139.180
2.80186,13410.875
2.93528,12944.965
