0.0000	29983.0664
0.1334	31612.3555
0.2668	32352.8203
0.4003	32201.6250
0.5337	32217.9766
0.6671	31602.7383
0.8005	32185.2520
0.9340	31338.2988
1.0674	31801.9180
1.2008	33711.7422
1.3342	36481.8711
1.4676	42010.1836
1.6011	59506.6758
1.7345	85241.1719
1.8679	95158.6406
2.0013	70596.1250
2.1347	50313.1133
2.2682	40895.9023
2.4016	34820.7656
