X,Y
0.00000,12986.385
0.13342,13084.448
0.26684,13631.113
0.40027,15608.112
0.53369,18567.615
0.66711,21247.715
0.80053,19987.730
0.93395,16118.342
1.06737,14294.513
1.20080,13021.495
1.33422,12536.726
