0.00000,39782.242
0.13342,39127.945
0.26684,39137.309
0.40027,38744.492
0.53369,38929.469
0.66711,38844.512
0.80053,39675.324
0.93395,39157.363
1.06737,39539.363
1.20080,42390.477
1.33422,42092.238
1.46764,48390.098
1.60106,60618.516
1.73448,87628.250
1.86791,127465.438
2.00133,126867.133
2.13475,85864.109
2.26817,59604.371
2.40159,50800.930
2.53502,46062.047
