X,Y
0.00000,33331.836
0.13342,33206.176
0.26684,33886.613
0.40027,32152.117
0.53369,33162.020
0.66711,33693.969
0.80053,34203.375
0.93395,34879.812
1.06737,38383.996
1.20080,44499.684
1.33422,58572.531
1.46764,89521.133
1.60106,138361.734
1.73448,156123.109
1.86791,125410.305
2.00133,77791.961
2.13475,52490.273
2.26817,41934.129
