0.00000,10407.913
0.13342,10344.635
0.26684,10409.732
0.40027,12305.896
0.53369,14455.637
0.66711,18213.816
0.80053,23580.721
0.93395,24978.527
1.06737,24188.645
1.20080,24554.855
1.33422,24152.934
1.46764,22727.656
1.60106,21617.516
1.73448,20228.312
1.86791,19525.779
2.00133,18583.766
2.13475,17073.725
2.26817,15045.637
2.40159,13081.869
2.53502,12259.479
2.66844,11430.966
2.80186,11055.496
2.93528,10873.661
3.06870,10604.868
3.20212,11766.979
3.33555,11573.007
