0.00000,37483.793
0.13342,38095.922
0.26684,37943.641
0.40027,38555.062
0.53369,38703.785
0.66711,37774.727
0.80053,36682.820
0.93395,38364.395
1.06737,37527.699
1.20080,36189.523
1.33422,38016.328
1.46764,40041.586
1.60106,43154.668
1.73448,53530.391
1.86791,73627.562
2.00133,83629.688
2.13475,71251.414
2.26817,50630.043
