0.0000	13919.8428
0.1334	13657.3828
0.2668	14330.6660
0.4003	15119.6162
0.5337	16406.2871
0.6671	15420.1553
0.8005	14261.4355
0.9340	14557.8828
1.0674	15128.7832
1.2008	15856.8779
1.3342	16895.0039
1.4676	17940.0859
1.6011	18534.7051
1.7345	19707.2500
1.8679	20236.9688
