0.00000,12908.636
0.13342,13622.938
0.26684,13811.290
0.40027,15045.267
0.53369,17000.582
0.66711,18611.053
0.80053,17369.430
0.93395,17376.348
1.06737,17054.852
1.20080,16631.559
1.33422,16332.710
1.46764,15414.489
1.60106,14851.235
1.73448,14241.602
1.86791,14464.107
2.00133,13579.787
2.13475,13095.445
2.26817,12285.834
2.40159,12524.271
2.53502,13101.160
2.66844,12990.811
