0.00000,40475.645
0.13342,39014.289
0.26684,37507.586
0.40027,38531.586
0.53369,37863.668
0.66711,36832.855
0.80053,37148.355
0.93395,36911.754
1.06737,37463.242
1.20080,37886.879
1.33422,37827.281
1.46764,39712.141
1.60106,39769.582
1.73448,44708.613
1.86791,57487.480
2.00133,88276.258
2.13475,134048.984
2.26817,146184.984
2.40159,108053.828
2.53502,70022.516
2.66844,52647.516
2.80186,45250.523
