0.00000,34920.430
0.13342,34565.211
0.26684,33051.074
0.40027,34642.977
0.53369,33400.988
0.66711,33418.234
0.80053,34034.219
0.93395,32517.910
1.06737,31802.279
1.20080,32004.701
1.33422,32782.359
1.46764,32544.715
1.60106,32794.922
1.73448,34434.531
1.86791,39113.059
2.00133,47277.387
2.13475,69643.617
2.26817,107510.156
2.40159,116676.773
2.53502,83543.875
2.66844,52805.984
2.80186,42152.449
2.93528,37687.258
