x	Y_20180514_15338_c2_12_11g	Y_20180514_15338_c2_19_6g	Y_20180514_15338_c2_29_5g	Y_20180514_15338_c2_8_7g
0	12523.2168	14317.0674	12329.3154	11978.8555
0.1334	12767.4141	17165.6738	12378.8447	13260.2393
0.2668	14697.4922	24657.7168	12872.083	16443.8125
0.4003	19746.7031	31859.668	15522.2783	19693.3672
0.5337	23873.1855	29477.7871	20669.9492	20589.291
0.6671	21308.5723	23395.2031	26176.875	19668.6523
0.8005	19668.7598	19632.8809	26512.6387	18794.7148
0.934	17920.4082	18773.8711	22770.6406	18135.7832
1.0674	17349.4473	18878.916	19600.3125	16548.1094
1.2008	17833.5742	19109.0879	17867.5059	16485.9551
1.3342	18276.5781	19647.5723	15408.0781	15331.8242
1.4676	18263.3906	18825.4375	15837.1533	16686.9492
1.6011	19314.9707	19391.7793	16192.5029	16115.2676
1.7345	19087.6289	19487.4297	15750.7314	16003.1221
1.8679	20258.3223	19113.5703	16901.3516	15329.71
2.0013	19436.4043	18595.5625	17118.4297	15205.7402
2.1347	20400.5059	19031.0332	18276.6719	15410.0859
2.2682	20208.252	20654.8535	19065.7793	15672.2295
2.4016	18900.3359	19475.7734	21551.3066	16142.0713
2.535	18974.1914	18903.4453	20907.3945	16252.3877
2.6684	17311.4492	16774.1797	21944.6582	15480.7285
2.8019	16117.6367	15149.8359	24277.8105	16028.1895
2.9353	16417.4805	14162.5273	25764.6094	15334.4043
3.0687	17985.7676	13667.7529	27198.3457	14394.1152
3.2021	17915.6816	12504.208	23544.5762	14656.5371
3.3355	17208.8203	12129.8789	19442.8125	15732.9766
3.469	15499.8613	12039.3965	17806.6367	14294.6865
3.6024	13963.2607	11781.6836	14845.4785	14748.6396
3.7358	12525.248	12428.0967	13522.6709	14452.5391
3.8692	12307.377	12376.4443	12803.5703	14128.8076
4.0027	12035.7871	12563.5469	11890.1455	14392.7559
4.1361	12849.6387	NaN	12536.6934	14356.0664
4.2695	12294.9912	NaN	12541.2988	14860.9854
4.4029	NaN	NaN	12809.7891	NaN
4.5363	NaN	NaN	NaN	NaN
4.6698	NaN	NaN	NaN	NaN
4.8032	NaN	NaN	NaN	NaN
4.9366	NaN	NaN	NaN	NaN
5.07	NaN	NaN	NaN	NaN
5.2035	NaN	NaN	NaN	NaN
5.3369	NaN	NaN	NaN	NaN
5.4703	NaN	NaN	NaN	NaN
