X,Y
0.00000,16188.584
0.13342,16481.762
0.26684,16915.344
0.40027,16749.299
0.53369,16884.262
0.66711,15784.470
0.80053,15423.992
0.93395,15719.891
1.06737,15879.488
1.20080,15735.782
1.33422,15552.483
1.46764,14917.093
1.60106,14782.839
1.73448,14550.643
1.86791,14430.006
2.00133,15844.182
2.13475,19366.508
2.26817,23500.676
2.40159,28923.842
2.53502,25195.986
2.66844,20701.908
2.80186,18612.498
2.93528,16621.184
