x	Y_20180514_15338_c1_13_7g	Y_20180514_15338_c1_2_4g	Y_20180514_15338_c1_2_7g
0	10356.207	11174.506	12609.65
0.1334	11043.531	10226.13	12186.331
0.2668	11504.722	9705.506	11453.915
0.4003	11907.257	10115.463	11060.119
0.5337	13176.673	11559.579	12179.88
0.6671	15261.149	11947.635	14272.077
0.8005	18291.883	12970.746	14692.838
0.934	16506.689	14082.175	13544.773
1.0674	16237.698	13851.054	14062.062
1.2008	15984.746	13088.737	14288.218
1.3342	16654.434	13332.152	15158.356
1.4676	17382.039	12809.454	15600.309
1.6011	17131.654	12875.631	16710.262
1.7345	15262.281	13621.375	17070.041
1.8679	14518.063	13987.3	17147.324
2.0013	13243.078	14947.058	17568.994
2.1348	13651.89	15052.091	16720.754
2.2682	13950.442	15083.422	15021.507
2.4016	14592.317	14700.427	14250.021
2.535	14865.508	13453.128	13580.817
2.6684	14278.399	13337.483	13113.723
2.8019	14564.885	13208.387	12672.848
2.9353	14298.754	12964.796	12462.289
3.0687	13727.797	12880.906	11817.574
3.2021	13563.397	12080.342	11655.391
3.3356	12541.792	12276.157	12161.273
3.469	12277.172	NaN	11414.56
3.6024	11923.718	NaN	10965.32
3.7358	12438.072	NaN	11226.287
3.8692	12331.577	NaN	10929.282
4.0027	12138.225	NaN	NaN
4.1361	11692.204	NaN	NaN
4.2695	10902.699	NaN	NaN
4.4029	10503.401	NaN	NaN
4.5363	9822.896	NaN	NaN
4.6698	10109.829	NaN	NaN
4.8032	NaN	NaN	NaN
4.9366	NaN	NaN	NaN
5.07	NaN	NaN	NaN
5.2035	NaN	NaN	NaN
5.3369	NaN	NaN	NaN
5.4703	NaN	NaN	NaN
