x	Y_20180130_15100b_1_10g	Y_20180130_15100b_1_12g	Y_20180130_15100b_10_12g	Y_20180130_15100b_11_11g	Y_20180130_15100b_12_15g	Y_20180130_15100b_14_10g	Y_20180130_15100b_14_9g	Y_20180130_15100b_16_5g	Y_20180130_15100b_17_7g	Y_20180130_15100b_18_14g	Y_20180130_15100b_18_2g	Y_20180130_15100b_2_7g	Y_20180130_15100b_2_9g	Y_20180130_15100b_21_15g	Y_20180130_15100b_21_16g	Y_20180130_15100b_21_8g	Y_20180130_15100b_22_19g	Y_20180130_15100b_24_13g	Y_20180130_15100b_24_4g	Y_20180130_15100b_4_19g	Y_20180130_15100b_4_4g	Y_20180130_15100b_5_24g	Y_20180130_15100b_7_7g	Y_20180130_15100b_8_1g	Y_20180130_15100b_8_6g	Y_20180130_15100b_8_9g	Y_20180130_15100b_9_11g
0	11906.161	12367.412	15711.844	15203.645	14536.585	13184.922	13287.463	11926.554	12140.82	13568.132	13280.345	15312.062	15153.056	13010.461	15525.213	12684.952	13217.943	13860.354	14964.465	13422.7	11777.552	13952.012	11828.227	11527.277	13541.194	14927.896	13321.939
0.1334	11770.418	12070.854	16286.502	16893.182	14602.859	16192.496	13924.875	11562.577	12805.87	13739.713	13546.187	17411.07	15457.07	13864.066	17129.816	13667.146	14280.063	14334.768	15372.217	13272.475	13039.723	14131.204	13240.698	12147.016	13638.271	15227.928	14466.325
0.2668	12709.344	13672.021	19216.205	19305.262	16833.537	18007.061	14952.685	12511.386	15376.858	15754.902	14900.227	20632.527	16521.361	15673.211	19266.068	16742.75	16488.221	16608.246	16946.76	13582.615	16221.892	16258.215	15773.019	14001.369	15708.161	18156.285	17521.988
0.4003	13914.613	15082.214	19673.457	23618.896	18731.771	21161.602	17465.037	13086.271	18972.957	17704.168	17879.293	20738.328	18071.178	18231.035	17437.777	19018.51	18988.262	18552.266	19649.484	13876.751	18895.609	16611.975	17998.701	17144.176	18480.119	22008.951	21386.615
0.5337	15568.304	16635.49	18362.33	22088.191	22377.156	21333.088	20492.986	14915.481	22867.85	22673.82	20063.252	18420.162	16936.945	18698.707	16039.894	16304.473	19494.676	18976.848	22735.211	14431.075	19957.221	16314.082	17902.35	18478.863	22303.545	22748.299	21050.238
0.6671	15758.182	15457.646	18376.482	19323.656	23778.908	18848.02	18860.42	16308.37	24941.699	23139.719	20807.818	16426.449	15783.336	17168.994	14263.853	14584.338	17897.146	19273.125	21220.902	16507.777	17954.084	16167.544	19134.602	15807.832	24968.006	20117.648	18448.996
0.8005	15623.302	13506.238	18013.15	18439.473	19579.051	19414.461	18083.766	15808.871	22239.52	19598.684	17907.199	15269.088	15741.62	16011.834	13273.878	13285.617	16307.01	17899.088	18508.23	16856.252	17105.631	16615.727	16341.417	13525.142	23410.658	17644.035	16169.063
0.934	14840.433	13067.371	19965.857	17082.273	17664.428	18282.793	15852.637	14478.642	20256.604	16562.863	16514.355	15451.046	15352.945	15697.256	13331.537	12510.392	15308.144	18139.246	18240.941	16072.482	15848.448	16859.668	14907.472	13119.22	20489.533	16903.773	16054.739
1.0674	14084.25	12958.509	19706.697	16036.319	16793.496	17984.373	14450.186	14174.966	17739.152	15745.403	16980.568	17857.248	15792.104	15878.182	13227.666	12399.821	14324.554	17825.785	15893.717	16525.369	15810.05	16762.65	14740.381	13625.887	17837.316	18223.148	17431.002
1.2008	13538.353	12337.141	19583.434	15691.403	16834.57	16846.301	14240.975	13788.665	14992.653	15762.923	17871.35	21521.018	15770.089	16245.562	14249.792	12495.392	14706.566	16904.436	15750.447	14784.572	16154.543	15950.93	15106.295	14588.532	19018.561	19630.629	16189.419
1.3342	13796.258	12498.479	18338.115	17923.336	16231.869	15343.759	13331.536	14245.507	14670.126	16017.539	18015.799	20772.684	16437.164	15730.047	13725.386	12895.146	13142.809	15234.059	16990.639	15751.666	13941.255	15737.352	14399.227	14428.856	20392.799	20819.715	15793.194
1.4676	14523.671	12724.613	18293.422	19083.41	16113.337	14702.844	13591.091	14967.536	14031.683	16337.993	17048.738	17937.012	18664.58	16796.311	14286.705	13351.602	12758.33	14879.375	19567.697	15187.045	13563.736	15168.823	13184.102	12796.851	20461.578	19569.227	16469.082
1.6011	15945.152	13166.472	18010.92	17899.021	15545.476	14630.498	13363.735	14512.649	13819.357	15630.34	16538.531	16920.145	16856.055	20587.873	14924.104	13128.072	13299.885	13665.095	21278.119	13979.373	14373.861	14641.208	12244.122	12715.482	18709.807	19941.395	15219.107
1.7345	15790.817	15536.5	17517.801	16215.352	16413.242	15562.732	13652.943	14539.295	13741.139	14683.885	15999.703	15616.332	15441.825	25724.389	14712.1	12850.536	14313.499	13147.331	22297.576	14052.297	13592.466	15156.386	12638.044	12531.41	17007.062	19882.443	15547.314
1.8679	15889.231	15392.784	18069.912	15736.454	18014.004	17113.543	13303.772	13849.56	14370.502	14425.822	14295.607	13240.671	13923.132	27231.189	14121.521	13049.989	14267.882	13091.392	24239.289	13881.026	12768.687	16565.68	12229.601	14704.541	17708.934	20449.195	14776.285
2.0013	15420.688	14299.558	16121.426	14325.946	18038.959	16811.924	12883.241	13617.777	14709.715	14269.647	13785.065	13348.791	13346.619	24920.176	13626.989	12203.798	14149.134	12369.184	23634.203	13853.665	12214.221	17452.01	11340.584	14715.419	17708.762	19544.32	13540.143
2.1348	15315.379	12768.978	14511.884	13998.464	16429.52	16579.436	13111.949	13697.751	13907.451	13717.794	13657.136	13282.068	13646.48	20442.195	14017.257	11985.669	13576.812	12325.378	19793.463	14480.215	11970.945	17910.232	11202.527	13977.217	14387.21	16787.463	13352.376
2.2682	14692.743	12529.108	14417.016	13058.484	14769.959	15979.207	13198.136	13591.728	12613.363	12273.513	12295.048	12841.933	13131.604	16290.797	12667.829	12114.223	13157.776	12236.319	16427.691	15924.325	11911.766	17331.439	11722.25	12939.065	13267.278	15630.552	12963.252
2.4016	14193.538	12418.67	NaN	13030.197	13168.572	13908.233	12758.212	13951.479	12710.183	12260.869	11076.637	12899.208	13117.359	14076.993	NaN	12491.722	11905.603	11802.478	14422.009	16108.755	11783.522	16041.389	11892.688	12434.535	13007.794	14297.725	13097.647
2.535	13167.548	11829.913	NaN	NaN	13419.726	12752.661	12967.279	14700.25	12689.629	12488.944	10870.611	13311.192	NaN	13308.167	NaN	12766.854	12404.262	12034.369	13500.15	15544.112	11946.431	14593.916	12453.302	NaN	12985.101	14563.328	12962.717
2.6684	12622.581	11238.883	NaN	NaN	12596.208	11933.753	NaN	14536.455	12986.461	12876.486	NaN	NaN	NaN	12517.041	NaN	NaN	NaN	12061.55	NaN	16405.277	NaN	15203.763	11713.916	NaN	12323.346	13973.602	12319.336
2.8019	12492.719	NaN	NaN	NaN	12771.317	NaN	NaN	NaN	12552.316	13121.82	NaN	NaN	NaN	NaN	NaN	NaN	NaN	11730.195	NaN	NaN	NaN	15159.035	NaN	NaN	12784.329	NaN	NaN
2.9353	NaN	NaN	NaN	NaN	NaN	NaN	NaN	NaN	NaN	NaN	NaN	NaN	NaN	NaN	NaN	NaN	NaN	11302.519	NaN	NaN	NaN	14102.249	NaN	NaN	NaN	NaN	NaN
3.0687	NaN	NaN	NaN	NaN	NaN	NaN	NaN	NaN	NaN	NaN	NaN	NaN	NaN	NaN	NaN	NaN	NaN	NaN	NaN	NaN	NaN	14870.76	NaN	NaN	NaN	NaN	NaN
3.2021	NaN	NaN	NaN	NaN	NaN	NaN	NaN	NaN	NaN	NaN	NaN	NaN	NaN	NaN	NaN	NaN	NaN	NaN	NaN	NaN	NaN	NaN	NaN	NaN	NaN	NaN	NaN
3.3356	NaN	NaN	NaN	NaN	NaN	NaN	NaN	NaN	NaN	NaN	NaN	NaN	NaN	NaN	NaN	NaN	NaN	NaN	NaN	NaN	NaN	NaN	NaN	NaN	NaN	NaN	NaN
3.469	NaN	NaN	NaN	NaN	NaN	NaN	NaN	NaN	NaN	NaN	NaN	NaN	NaN	NaN	NaN	NaN	NaN	NaN	NaN	NaN	NaN	NaN	NaN	NaN	NaN	NaN	NaN
3.6024	NaN	NaN	NaN	NaN	NaN	NaN	NaN	NaN	NaN	NaN	NaN	NaN	NaN	NaN	NaN	NaN	NaN	NaN	NaN	NaN	NaN	NaN	NaN	NaN	NaN	NaN	NaN
3.7358	NaN	NaN	NaN	NaN	NaN	NaN	NaN	NaN	NaN	NaN	NaN	NaN	NaN	NaN	NaN	NaN	NaN	NaN	NaN	NaN	NaN	NaN	NaN	NaN	NaN	NaN	NaN
3.8692	NaN	NaN	NaN	NaN	NaN	NaN	NaN	NaN	NaN	NaN	NaN	NaN	NaN	NaN	NaN	NaN	NaN	NaN	NaN	NaN	NaN	NaN	NaN	NaN	NaN	NaN	NaN
4.0027	NaN	NaN	NaN	NaN	NaN	NaN	NaN	NaN	NaN	NaN	NaN	NaN	NaN	NaN	NaN	NaN	NaN	NaN	NaN	NaN	NaN	NaN	NaN	NaN	NaN	NaN	NaN
4.1361	NaN	NaN	NaN	NaN	NaN	NaN	NaN	NaN	NaN	NaN	NaN	NaN	NaN	NaN	NaN	NaN	NaN	NaN	NaN	NaN	NaN	NaN	NaN	NaN	NaN	NaN	NaN
4.2695	NaN	NaN	NaN	NaN	NaN	NaN	NaN	NaN	NaN	NaN	NaN	NaN	NaN	NaN	NaN	NaN	NaN	NaN	NaN	NaN	NaN	NaN	NaN	NaN	NaN	NaN	NaN
4.4029	NaN	NaN	NaN	NaN	NaN	NaN	NaN	NaN	NaN	NaN	NaN	NaN	NaN	NaN	NaN	NaN	NaN	NaN	NaN	NaN	NaN	NaN	NaN	NaN	NaN	NaN	NaN
4.5363	NaN	NaN	NaN	NaN	NaN	NaN	NaN	NaN	NaN	NaN	NaN	NaN	NaN	NaN	NaN	NaN	NaN	NaN	NaN	NaN	NaN	NaN	NaN	NaN	NaN	NaN	NaN
4.6698	NaN	NaN	NaN	NaN	NaN	NaN	NaN	NaN	NaN	NaN	NaN	NaN	NaN	NaN	NaN	NaN	NaN	NaN	NaN	NaN	NaN	NaN	NaN	NaN	NaN	NaN	NaN
4.8032	NaN	NaN	NaN	NaN	NaN	NaN	NaN	NaN	NaN	NaN	NaN	NaN	NaN	NaN	NaN	NaN	NaN	NaN	NaN	NaN	NaN	NaN	NaN	NaN	NaN	NaN	NaN
4.9366	NaN	NaN	NaN	NaN	NaN	NaN	NaN	NaN	NaN	NaN	NaN	NaN	NaN	NaN	NaN	NaN	NaN	NaN	NaN	NaN	NaN	NaN	NaN	NaN	NaN	NaN	NaN
5.07	NaN	NaN	NaN	NaN	NaN	NaN	NaN	NaN	NaN	NaN	NaN	NaN	NaN	NaN	NaN	NaN	NaN	NaN	NaN	NaN	NaN	NaN	NaN	NaN	NaN	NaN	NaN
5.2035	NaN	NaN	NaN	NaN	NaN	NaN	NaN	NaN	NaN	NaN	NaN	NaN	NaN	NaN	NaN	NaN	NaN	NaN	NaN	NaN	NaN	NaN	NaN	NaN	NaN	NaN	NaN
5.3369	NaN	NaN	NaN	NaN	NaN	NaN	NaN	NaN	NaN	NaN	NaN	NaN	NaN	NaN	NaN	NaN	NaN	NaN	NaN	NaN	NaN	NaN	NaN	NaN	NaN	NaN	NaN
