X,Y
0.00000,11890.444
0.13342,13040.701
0.26684,16040.662
0.40027,17119.316
0.53369,16773.189
0.66711,15376.793
0.80053,14039.554
0.93395,13045.459
1.06737,12248.307
1.20080,11997.326
1.33422,12069.270
1.46764,11716.704
1.60106,11748.037
1.73448,13137.685
1.86791,12384.900
2.00133,12304.072
2.13475,12003.820
2.26817,11701.591
2.40159,11777.955
2.53502,11668.986
2.66844,12309.633
