0.0000	13118.3330
0.1334	13560.2734
0.2668	15783.9160
0.4003	20240.2949
0.5337	22800.3223
0.6671	21508.4355
0.8005	19688.8184
0.9340	18353.3965
1.0674	17916.9785
1.2008	16999.2031
1.3342	16307.9346
1.4676	16546.8809
1.6011	16465.0332
1.7345	17062.3125
1.8679	17764.6621
2.0013	17110.9570
2.1347	16851.3398
2.2682	16547.1641
2.4016	16404.1484
2.5350	17058.7168
2.6684	16324.0791
2.8019	15517.2744
2.9353	15577.6562
