x	Y_20180130_15109_1_6g	Y_20180130_15109_10_10g	Y_20180130_15109_10_11g	Y_20180130_15109_10_12g	Y_20180130_15109_10_14g	Y_20180130_15109_10_3g	Y_20180130_15109_10_8g	Y_20180130_15109_10_9g	Y_20180130_15109_11_2g	Y_20180130_15109_11_3g	Y_20180130_15109_11_8g	Y_20180130_15109_2_12g	Y_20180130_15109_2_4g	Y_20180130_15109_2_5g	Y_20180130_15109_2_8g	Y_20180130_15109_2_9g	Y_20180130_15109_3_12g	Y_20180130_15109_3_1g	Y_20180130_15109_3_5g	Y_20180130_15109_4_10g	Y_20180130_15109_4_1g	Y_20180130_15109_4_3g	Y_20180130_15109_4_5g	Y_20180130_15109_4_8g	Y_20180130_15109_4_9g	Y_20180130_15109_5_10g	Y_20180130_15109_5_13g	Y_20180130_15109_5_17g	Y_20180130_15109_5_4g	Y_20180130_15109_5_5g	Y_20180130_15109_5_7g	Y_20180130_15109_6_10g	Y_20180130_15109_6_9g	Y_20180130_15109_7_2g	Y_20180130_15109_7_3g	Y_20180130_15109_9_1g	Y_20180130_15109_9_2g	Y_20180130_15109_9_5g	Y_20180130_15109_9_9g
0	39378.176	37799.035	34760.941	36135.273	36829.66	35764.176	34097.668	34507.309	30811.734	38389.738	34884.723	38125.18	32273.551	34332.844	37831.129	38466.531	32449.367	35261.41	36155.176	37495.699	38644.93	33031.957	37783.258	33901.43	33607.852	37219.762	33972.895	36187.242	31036.967	35474.414	30668.48	30926.465	31133.934	36121.52	37149.043	34677.793	35266.348	39601.602	36236.168
0.1334	40976.492	36349.676	34014.59	35615.836	36818.684	36161.199	33210.238	33769.633	31858.014	37495.762	38337.086	37815.32	33115.07	34482.48	38942.172	38767.227	32233.861	34700.703	37170.422	36792.977	38137.066	33504.965	37692.145	33732.273	33066.398	38521.934	33425.938	37077.059	31266.531	36572.348	31242.254	32672.443	33249.645	35749.699	37280.727	34821.664	35411.969	38384.984	35478.723
0.2668	40350.836	37097.082	34214.043	35035.848	37197.191	37635.922	35412.926	33300.387	29940.357	37221.512	37005.246	37401.742	32453.621	33815.086	37785.52	37051.793	31444.959	36318.199	36162.523	37106.438	37953.051	33347.754	38475.5	33982.543	35112.281	37633.562	34807.555	36063.863	33329.844	37842.598	32220.008	33084.145	32788.871	35410.016	37443.969	33585.059	34821.992	39371.477	35192.656
0.4003	40806.324	37215.711	34610.367	35360.508	37284.727	37826.539	37694.773	33371.453	31248.193	39007.875	35632.113	36556.449	31984.449	34718.789	36940.055	35758.668	32026.328	36236.477	36956.609	38865.234	38282.012	33150.086	37922.969	34050.855	32936.211	39371.043	34029.387	37032.062	33070.895	36965.828	32860.785	32392.93	32916.793	34296.801	38924.535	32736.365	36116.48	40996.84	34694.402
0.5337	40548.359	38920.266	34545.996	34301.75	37159.488	36212.582	35167.707	33915.25	31898.797	37379.484	35542.262	37729.469	31952.123	35676.277	38580.492	36960.672	32314.793	35892.137	36740.68	38364.551	38711.32	33630.023	39502.492	34357.25	32464.531	38923.91	33138.02	36408.301	33212.691	36231.488	31268.279	31052.676	33312.891	34184.711	38720.824	33668.383	35677.773	40157.406	34311.289
0.6671	38682.109	39461.617	34228.18	35626.059	36914.789	36563.488	36495.109	33288.164	30535.326	37609.742	37385.148	38079.551	31994.303	33958.25	39825.762	36830.34	32425.479	35073.762	35938.23	38529.301	38449.48	34010.5	38479.426	35488.227	31804.18	37706	34359.66	37454.672	31588.943	36328.758	31949.262	31676.6	31633.867	34727.816	38131.875	34097.977	36116.902	40975.957	34935.27
0.8005	38466.129	39621.789	34309.305	34933.82	37625.445	36700.258	34996.227	32821.992	31708.807	38416.734	35531.902	38469.523	31211.379	35879.383	38037.465	38936.25	32765.057	34155.918	36790.895	39333.516	37025.105	32628.008	38310.562	35343.492	32362.613	38215.223	33367.691	37018.203	32261.062	38480.598	30884.123	31600.686	30957.689	34786.688	37281.504	35393.387	35351.758	39007.449	34682.895
0.934	38935.02	39868.168	33611.777	35696.027	39056.148	36557.996	34838.527	31633.963	31108.334	38217.223	34976.301	38789.312	31536.254	36098.215	40022.789	39036.723	33087.32	34538.996	37123.039	39226.789	36028.562	33505.918	37603	34897.465	33402.938	39321.805	33558.457	36565.18	34175.332	38058.91	31490.732	31455.316	31286.529	34682.809	36280.57	36530.195	36203.758	39056.926	35295.348
1.0674	37360.07	37681.156	36053.332	34884.711	38607.977	35971.926	34952.426	32950.453	30676.23	38129.57	37126.816	38031.012	31846.373	34478.902	41239.738	37779.035	34010.406	34125.395	35722.25	40111.207	35824.668	32864.281	34698.793	34987.859	33272.723	37344.59	35046.77	36676.836	34021.039	37019.168	31723.105	30754.268	31469.742	36281.242	38324.961	36024.992	35846.914	40139.379	34865.008
1.2008	38820.855	38610.598	34912.648	34766.992	38829.867	37806.648	34229.051	35525.695	31024.301	39110.719	37598.328	39898.996	31363.043	35249.504	40714.48	35958.43	33713.395	34125.125	35220.805	39160.32	37676.207	33097.82	35129.762	36084.422	33418.328	36339.074	36120.203	35581.875	33723.281	37755.262	32920.711	30492.227	31880.598	35291.391	36747.898	34125.621	35879.469	40997.59	35548.625
1.3342	38652.023	38081.02	35808.672	35030.844	38704.031	36306.258	34215.004	36850.992	31997.246	38676.051	37865.883	40938.555	30381.57	34966.523	41693.742	36403.066	34442.883	35151.75	35112.992	40606.871	37896.398	35562.457	37550.434	37831.137	35204.223	37670.254	35334.895	36670.383	31816.65	39146.676	33103.023	31083.602	33647.672	36230.695	37091.551	33475.996	36410.676	40362.051	34560.238
1.4676	39231.852	37348.422	35380.309	36042.125	38084.137	37554.629	34992.93	36518.336	32692.875	39898.875	37770.637	45696.215	30180.57	36435.918	43046.785	37816.34	34361.406	36176.461	35061.426	40977.504	38081.078	36256.766	39147.32	38693.773	36805.637	36041.922	34760.184	37241.492	34425.586	38121.043	33687.609	30388.076	34531.02	36874.949	36419.426	34926.742	37532.668	40525.16	37269.566
1.6011	39758.516	37513.852	35611.086	40098.746	38547.68	38812.281	36722.238	40085.773	32081.889	39863.477	39754.258	44336.523	31224.191	33947.828	44511.234	35770.73	37299.797	36669.898	35592.484	44358.828	39487.418	41581.34	39461.871	42842.305	36397.992	36501.145	37517.059	37355.07	34829.504	37769.316	33491.465	31750.082	33666.023	35583.895	35578.684	34099.137	41270.34	41349.367	39004.348
1.7345	41692.668	38368.156	40826.172	47252.801	43797.602	44586.492	40760.121	45891.656	33473.922	39933.949	43043.133	44189.586	32708.75	34760.965	46265.641	36790.457	46317.086	37906.996	34386.164	48519.48	40721.129	45977.578	40903.027	52684.879	38414.066	38994.742	40995.633	38379.027	41863.137	36780.996	35448.266	31324.357	33630.391	36181.203	36920.848	34688.289	47195.055	40304.918	44030.324
1.8679	43624.043	36814.449	52605.516	66511.422	50198.074	50497.469	46075.562	64526.301	36935.309	43518.812	55893.574	51046.859	34008.406	35680.055	50949.188	36738.512	62703.789	42048.273	35412.113	64358.062	38317.387	65891.586	43464.367	77473.742	40349.238	38884.312	51292.977	38189.957	57049.996	35914.023	37465.168	31629.523	34671.457	38290.125	39905.391	34322.566	62919.305	40707.312	55941.168
2.0013	47856.02	37215.727	75459.742	91934.078	69669.133	71554.805	64788.559	97358.531	41747.473	51218.867	84872.406	64285.992	39174.363	37355.715	62797.336	39492.938	82439.742	45390.422	38212.242	103367.25	37975.023	105196.305	56440.305	127819.867	44326.637	40361.074	75962.367	41760.562	90517.797	36788.875	43643.535	32889.152	37444.691	38865.508	43138.16	36307.473	100199.984	42511.672	79395.836
2.1348	52880.379	40453.867	96514.383	94597.461	115417.227	123115.25	102551.773	115403.461	57481.645	66928.883	96313.555	105703.477	50868.172	43765.523	86565.633	48418.43	102827.102	54691	36725.652	147363.125	38720.402	142604.406	84692.289	158357.438	55036.539	42360.867	110571.914	50474.828	109957.695	39224.453	59552.703	33013.137	47817.289	41532.648	51916.645	39114.906	152581.203	44785.016	99282.602
2.2682	72622.445	47327.543	82388.031	69135.609	174577.766	164380.516	126274.258	95725.672	89206.773	109944.969	76993.328	169560.891	71863.547	60418.656	143333.703	68271.023	133727.656	74549.016	37861.293	137561.5	42870.688	124703.344	131935.281	119434.055	79410.805	47117.625	127936.945	69957.992	89128.094	42129.492	77008.891	40027.328	63107.816	47942.539	71545.297	45958.527	156465.156	49716.961	81473.164
2.4016	104167.641	62703.57	56674.633	49981.242	179229.875	135514.547	94614.969	63321.617	102813.281	147671.312	55339.559	173393.359	73370.312	78487.859	213402.656	85224.094	139429.922	95002.641	42348.484	101561.781	55056.059	78056.266	164491.375	69963.953	123836.945	61849.402	104697.531	90988.938	58433.434	51172.98	72289.141	55321.09	68076.836	71052.664	81247.75	66807.281	102563.133	63216.254	57117.605
2.535	124275.164	86359.75	43706.078	44856.297	122478.891	82105.43	61409.535	45380.828	80157	126759.984	44310.969	118543.938	52574.934	75474.922	234149.953	82325.68	99302.367	81361.766	54014.312	81676.023	76166.656	52047.727	126026.914	50795.551	132767.5	86782.852	69039.477	87493.5	42550.867	67596.68	53052.465	73165.188	57060.762	115820.68	71732.586	92924.828	63439.641	95008.406	44354.98
2.6684	97963.461	84890.836	NaN	NaN	69738.953	54986.977	46484.594	NaN	52239.453	81655.531	39041.926	72713.93	38520.445	56431.613	182933.969	58669.84	63803.578	57269.242	75338.852	63069.398	90598.891	NaN	74343.734	43352.91	92337.453	89504.695	49391.141	64188.16	36219.5	79663.922	43022.461	76249.805	42971.031	153793.281	58262.047	92854.172	47485.75	137667.344	NaN
2.8019	66190.328	65299.344	NaN	NaN	49370.922	45557.949	NaN	NaN	39446.551	59356.574	NaN	51969.516	33628.066	43839.953	108891.352	45368.336	47070.715	45086.27	93797.062	49128.148	72883.141	NaN	49962.473	39687.711	55512.031	70352.266	42134.844	49543.352	36097.117	70343.844	38287.77	60090.973	40719.203	129472.016	52610.66	67700.914	NaN	137396.062	NaN
2.9353	51845.465	49357.199	NaN	NaN	NaN	40897.473	NaN	NaN	NaN	48934.531	NaN	NaN	NaN	38344.707	69515.734	NaN	NaN	42019.879	84080.078	NaN	55408.434	NaN	44250.516	NaN	42397.273	54024.641	NaN	42262.203	NaN	NaN	NaN	43788.023	34670.18	84921.195	44974.871	50808.336	NaN	90913.891	NaN
3.0687	44257.609	44116.191	NaN	NaN	NaN	NaN	NaN	NaN	NaN	43647.422	NaN	NaN	NaN	37451.398	52388.996	NaN	NaN	NaN	60873.434	NaN	NaN	NaN	NaN	NaN	NaN	43432.781	NaN	NaN	NaN	NaN	NaN	36712.961	NaN	60294.367	NaN	41830.422	NaN	60548.398	NaN
3.2021	NaN	NaN	NaN	NaN	NaN	NaN	NaN	NaN	NaN	NaN	NaN	NaN	NaN	NaN	NaN	NaN	NaN	NaN	48753.047	NaN	NaN	NaN	NaN	NaN	NaN	NaN	NaN	NaN	NaN	NaN	NaN	NaN	NaN	48115.02	NaN	37978.426	NaN	50343.145	NaN
3.3356	NaN	NaN	NaN	NaN	NaN	NaN	NaN	NaN	NaN	NaN	NaN	NaN	NaN	NaN	NaN	NaN	NaN	NaN	44061.828	NaN	NaN	NaN	NaN	NaN	NaN	NaN	NaN	NaN	NaN	NaN	NaN	NaN	NaN	NaN	NaN	NaN	NaN	NaN	NaN
3.469	NaN	NaN	NaN	NaN	NaN	NaN	NaN	NaN	NaN	NaN	NaN	NaN	NaN	NaN	NaN	NaN	NaN	NaN	NaN	NaN	NaN	NaN	NaN	NaN	NaN	NaN	NaN	NaN	NaN	NaN	NaN	NaN	NaN	NaN	NaN	NaN	NaN	NaN	NaN
3.6024	NaN	NaN	NaN	NaN	NaN	NaN	NaN	NaN	NaN	NaN	NaN	NaN	NaN	NaN	NaN	NaN	NaN	NaN	NaN	NaN	NaN	NaN	NaN	NaN	NaN	NaN	NaN	NaN	NaN	NaN	NaN	NaN	NaN	NaN	NaN	NaN	NaN	NaN	NaN
3.7358	NaN	NaN	NaN	NaN	NaN	NaN	NaN	NaN	NaN	NaN	NaN	NaN	NaN	NaN	NaN	NaN	NaN	NaN	NaN	NaN	NaN	NaN	NaN	NaN	NaN	NaN	NaN	NaN	NaN	NaN	NaN	NaN	NaN	NaN	NaN	NaN	NaN	NaN	NaN
3.8692	NaN	NaN	NaN	NaN	NaN	NaN	NaN	NaN	NaN	NaN	NaN	NaN	NaN	NaN	NaN	NaN	NaN	NaN	NaN	NaN	NaN	NaN	NaN	NaN	NaN	NaN	NaN	NaN	NaN	NaN	NaN	NaN	NaN	NaN	NaN	NaN	NaN	NaN	NaN
4.0027	NaN	NaN	NaN	NaN	NaN	NaN	NaN	NaN	NaN	NaN	NaN	NaN	NaN	NaN	NaN	NaN	NaN	NaN	NaN	NaN	NaN	NaN	NaN	NaN	NaN	NaN	NaN	NaN	NaN	NaN	NaN	NaN	NaN	NaN	NaN	NaN	NaN	NaN	NaN
4.1361	NaN	NaN	NaN	NaN	NaN	NaN	NaN	NaN	NaN	NaN	NaN	NaN	NaN	NaN	NaN	NaN	NaN	NaN	NaN	NaN	NaN	NaN	NaN	NaN	NaN	NaN	NaN	NaN	NaN	NaN	NaN	NaN	NaN	NaN	NaN	NaN	NaN	NaN	NaN
4.2695	NaN	NaN	NaN	NaN	NaN	NaN	NaN	NaN	NaN	NaN	NaN	NaN	NaN	NaN	NaN	NaN	NaN	NaN	NaN	NaN	NaN	NaN	NaN	NaN	NaN	NaN	NaN	NaN	NaN	NaN	NaN	NaN	NaN	NaN	NaN	NaN	NaN	NaN	NaN
4.4029	NaN	NaN	NaN	NaN	NaN	NaN	NaN	NaN	NaN	NaN	NaN	NaN	NaN	NaN	NaN	NaN	NaN	NaN	NaN	NaN	NaN	NaN	NaN	NaN	NaN	NaN	NaN	NaN	NaN	NaN	NaN	NaN	NaN	NaN	NaN	NaN	NaN	NaN	NaN
4.5363	NaN	NaN	NaN	NaN	NaN	NaN	NaN	NaN	NaN	NaN	NaN	NaN	NaN	NaN	NaN	NaN	NaN	NaN	NaN	NaN	NaN	NaN	NaN	NaN	NaN	NaN	NaN	NaN	NaN	NaN	NaN	NaN	NaN	NaN	NaN	NaN	NaN	NaN	NaN
