0.0000	13500.5000
0.1334	13928.5459
0.2668	14245.1113
0.4003	15494.1777
0.5337	19133.5977
0.6671	27127.2363
0.8005	28776.5156
0.9340	24025.7051
1.0674	19583.5781
1.2008	17927.0977
1.3342	15625.7354
1.4676	15125.6738
1.6011	15069.6309
1.7345	14443.8262
1.8679	15539.6455
2.0013	14044.9453
2.1347	13877.4004
2.2682	13864.5430
2.4016	14005.7178
2.5350	13111.4463
2.6684	12982.0107
2.8019	12705.8076
2.9353	13313.2939
