X,Y
0.00000,29985.975
0.13342,29224.492
0.26684,29856.459
0.40027,30307.812
0.53369,29860.295
0.66711,29889.256
0.80053,30501.199
0.93395,28293.178
1.06737,29245.572
1.20080,28417.611
1.33422,29322.066
1.46764,28799.133
1.60106,28312.039
1.73448,29689.109
1.86791,29057.750
2.00133,30265.082
2.13475,30294.520
2.26817,31529.604
2.40159,34043.684
2.53502,38406.852
2.66844,51659.367
2.80186,69502.828
2.93528,63373.867
3.06870,44880.957
3.20212,36994.094
3.33555,31423.721
