0.00000,37017.438
0.13342,36212.633
0.26684,35626.504
0.40027,36636.621
0.53369,36657.031
0.66711,36859.801
0.80053,36963.453
0.93395,35839.246
1.06737,36715.660
1.20080,38627.266
1.33422,38815.891
1.46764,42282.453
1.60106,52757.727
1.73448,69983.367
1.86791,72371.906
2.00133,56565.230
2.13475,43475.098
2.26817,38073.184
