0.00000,36746.789
0.13342,37892.699
0.26684,38800.137
0.40027,38019.766
0.53369,37349.996
0.66711,37347.988
0.80053,38582.484
0.93395,39245.008
1.06737,39368.402
1.20080,41123.066
1.33422,42069.258
1.46764,41457.438
1.60106,41276.047
1.73448,42648.602
1.86791,47533.496
2.00133,57615.238
2.13475,84421.164
2.26817,128609.648
2.40159,126650.109
2.53502,88064.430
2.66844,60498.707
2.80186,49029.262
2.93528,42868.117
