0.0000	33195.3242
0.1334	31613.2090
0.2668	31572.9199
0.4003	31098.2539
0.5337	31689.1992
0.6671	32913.1562
0.8005	34783.0781
0.9340	39966.5820
1.0674	48056.4766
1.2008	60995.0625
1.3342	61723.7227
1.4676	48274.9883
1.6011	38605.0898
1.7345	36088.7617
1.8679	35123.4844
