0.00000,33512.480
0.13342,33415.051
0.26684,35062.961
0.40027,34172.551
0.53369,35625.375
0.66711,34567.664
0.80053,34794.000
0.93395,35916.184
1.06737,35459.574
1.20080,33803.465
1.33422,35481.031
1.46764,36639.203
1.60106,37443.551
1.73448,39248.289
1.86791,40748.816
2.00133,39722.355
2.13475,38618.758
2.26817,38192.535
2.40159,42354.652
2.53502,48308.219
2.66844,65736.016
2.80186,105952.070
2.93528,152961.219
3.06870,144382.938
3.20212,87065.094
3.33555,57063.289
3.46897,45433.031
3.60239,42222.195
