0.0000	13883.7295
0.1334	14731.1953
0.2668	16677.3008
0.4003	21821.9531
0.5337	23476.6621
0.6671	24158.9746
0.8005	22219.6230
0.9340	20289.9766
1.0674	18053.3750
1.2008	17527.6992
1.3342	16889.5859
1.4676	16900.1016
1.6011	16138.4639
1.7345	15329.6338
1.8679	13664.2480
2.0013	13972.0645
2.1347	13168.7803
2.2682	12778.4238
2.4016	13622.7598
2.5350	14500.8203
2.6684	16606.2891
2.8019	17660.4492
2.9353	16535.5195
3.0687	15678.6475
3.2021	15307.4727
3.3355	14000.5293
3.4690	14062.1992
3.6024	14361.4209
3.7358	14172.6260
3.8692	14711.6465
