0.0000	13981.4971
0.1334	14592.1191
0.2668	15251.3115
0.4003	15427.0752
0.5337	16382.3994
0.6671	18648.6250
0.8005	21943.5898
0.9340	20157.7578
1.0674	18893.7207
1.2008	17454.3008
1.3342	16997.5098
1.4676	17066.2969
1.6011	18163.8262
1.7345	20057.2832
1.8679	21362.5078
2.0013	22122.4883
2.1347	20940.9961
2.2682	19450.4316
2.4016	16945.2988
2.5350	16083.3721
2.6684	15796.1074
2.8019	14609.1621
