x	Y_20180514_15338_c2_1_14g	Y_20180514_15338_c2_10_9g	Y_20180514_15338_c2_12_11g	Y_20180514_15338_c2_18_4g	Y_20180514_15338_c2_19_14g	Y_20180514_15338_c2_19_6g	Y_20180514_15338_c2_20_4g	Y_20180514_15338_c2_22_7g	Y_20180514_15338_c2_23_20g	Y_20180514_15338_c2_29_5g	Y_20180514_15338_c2_29_6g	Y_20180514_15338_c2_29_7g	Y_20180514_15338_c2_30_7g	Y_20180514_15338_c2_7_3g	Y_20180514_15338_c2_8_2g	Y_20180514_15338_c2_8_7g	Y_20180514_15338_c2_9_1g	Y_20180514_15338_c2_9_2g	Y_20180514_15338_c1_1_2g	Y_20180514_15338_c1_12_4g	Y_20180514_15338_c1_17_9g	Y_20180514_15338_c1_18_7g	Y_20180514_15338_c1_19_15g	Y_20180514_15338_c1_20_1g	Y_20180514_15338_c1_20_3g	Y_20180514_15338_c1_3_3g	Y_20180514_15338_c1_4_3g	Y_20180514_15338_c1_8_2g	Y_20180514_15338_c1_8_3g	Y_20180514_15338_c1_8_4g	Y_20180514_15338_c1_9_13g
0	12146.8682	10137.6553	12523.2168	11987.4658	15396.3301	14317.0674	9567.9814	11324.2422	13720.9453	12329.3154	11569.8809	11524.0156	12829.376	14707.7871	12822.875	11978.8555	11297.2998	10603.6816	9885.5312	12526.7275	11627.8037	12758.5996	10505.9854	15454.9746	15472.7949	11929.8955	11957.7549	11839.0283	10356.7656	11173.3916	11926.9814
0.1334	14170.1895	10265.7715	12767.4141	12645.7979	16529.8281	17165.6738	10510.0586	13511.5205	15093.4492	12378.8447	11808.4141	11931.5371	15707.6572	15569.9053	15367.9736	13260.2393	13261.2734	11050.2598	10882.9463	12222.1748	13606.6387	14754.4453	11250.6572	15311.0088	18055.9277	12517.9902	12485.166	13727.5518	11310.1846	10472.5713	11325.4922
0.2668	17099.8027	10860.9395	14697.4922	14315.8223	21029.8477	24657.7168	11797.1582	15770.8369	16752.9082	12872.083	12085.7217	13186.0332	19885.6426	17689.8477	20720.1133	16443.8125	15483.8789	12723.0488	11085.3135	13011.0713	17922.5059	18325.2012	12294.6875	17028.207	21752.5938	13995.0273	14022.6309	14929.0283	13534.7842	10572.0586	11324.1797
0.4003	21001.4395	12042.46	19746.7031	18636.9336	28366.7969	31859.668	14902.0361	19860.8828	20330.9922	15522.2783	14028.0449	15095.501	25733.5938	22904.1172	28296.7305	19693.3672	17656.2344	14746.21	12176.4443	15786.125	25850.543	23718.6523	13323.1836	20795.3574	27270.0859	16593.3125	16596.6445	16110.0254	15866.3887	10283.7939	13077.2666
0.5337	22885.7344	14782.5732	23873.1855	23299.7988	35161.9883	29477.7871	20134.1426	23888.4746	23416.9746	20669.9492	16689.418	17276.2559	26555.1797	25581.3672	31540.5566	20589.291	17449.0469	18855.2598	13623.1504	20322.3945	30361.9668	26431.2617	15365.4131	28368.8984	30227.2422	20915.4434	20900.4062	18815.9551	20023.0547	11097.1523	14494.0713
0.6671	20231.8359	19904.9629	21308.5723	23943.1191	33571.1328	23395.2031	22099.9023	23857.7227	21252.9414	26176.875	20501.5488	16636.2422	23070.7676	25428.8887	27812.5566	19668.6523	16743.5137	26150.0449	15776.1797	23272.4961	28281.6035	19762.9492	19489.3203	33513.3008	26778.4668	27518.5586	27559.4512	21440.6113	22273.3438	13244.0352	17753.418
0.8005	19702.1797	22022.6035	19668.7598	22051.293	26872.8867	19632.8809	19541.9062	20902.2461	16739.7129	26512.6387	21760.877	14748.084	20565.1406	24140.1074	25520.7246	18794.7148	17089.8418	28667.0781	20211.832	24155.8652	25508.4902	18383.2734	23252.5938	29350.6855	23759.5723	25107.625	24940.043	19184.4238	21232.1387	16056.3184	22926.1348
0.934	17688.7559	19455.1914	17920.4082	20394.7012	23262.3027	18773.8711	17399.6211	18487.5566	13834.2207	22770.6406	21133.0605	13583.4131	18458.3945	25091.6602	27521.5566	18135.7832	16272.5898	24582.6094	24099.7031	23145.9414	22672.3887	16923.1914	22115.5312	23369.4492	20799.7285	20370.0098	20301.5703	17289.9629	19993.7891	22056.625	23539.7031
1.0674	15135.3896	16186.208	17349.4473	18099.8281	21395.709	18878.916	15440.9297	15705.1113	12848.127	19600.3125	19151.3418	13503.0449	18233.5762	27433.625	31236.6621	16548.1094	15421.7178	20935.5859	25797.5117	20209.0352	20051.4258	16498.4336	18941.4336	19348.3691	19704.9609	15786.7148	15684.4102	15132.6699	18267.0664	25150.0293	18767.2266
1.2008	15229.0684	16367.083	17833.5742	15429.6328	21057.5117	19109.0879	14806.541	14771.5967	12856.6875	17867.5059	18106.4297	13297.0703	19404.6641	30251.7031	37232.1172	16485.9551	14489.8369	19184.8262	24361.4004	18156.6855	19120.5078	17003.1777	18432.2012	18122.7422	19207.9004	14061.6318	13998.252	14390.5684	17005.2754	23129.4961	17757.916
1.3342	14804.7012	15870.8877	18276.5781	15177.9199	20691.8066	19647.5723	14114.3311	15193.9121	12117.6416	15408.0781	18371.8184	13566.2461	18418.6855	29665.1191	42735.3164	15331.8242	14452.7656	18573.416	22609.373	16332.7588	19997.752	18109.6211	17625.1367	16447.9922	18916.9883	13726.8916	13613.1016	14418.6143	16319.7842	20990.1133	17377.0859
1.4676	15806.6953	15785.5186	18263.3906	14890.1348	19811.4785	18825.4375	13290.5381	15484.1807	13110.751	15837.1533	17906.209	13271.9688	17154.9727	29639.2109	39221.2148	16686.9492	14478.5957	19186.3145	21199.3652	16181.46	19336.1387	17306.4531	17417.7129	14561.9209	18721.0547	14173.3467	14106.1592	14519.6592	16829.6406	19100.8613	18420.6855
1.6011	16723.4023	14560.4395	19314.9707	16386.0039	19562.4473	19391.7793	13521.4404	15284.3799	14119.9609	16192.5029	16307.8545	14554.5156	17105.1504	25523.9297	33738.6016	16115.2676	14258.8232	17868.4512	21168.7812	15975.7139	20003.3633	17690.3047	16807.2578	16143.6289	18776.1523	14249.7354	14176.8574	14346.708	16811.1797	18081.5273	18307.2617
1.7345	18814.3496	14032.8193	19087.6289	18443.9219	19039.0605	19487.4297	13736.0312	17267.3398	14638.4775	15750.7314	16523.0039	16711.9824	16026.0645	23586.8789	28532.5664	16003.1221	14963.1035	18557.6953	19408.6289	16507.1855	19717.5918	17298.3867	15720.2305	17711.0176	17970.3828	15221.7988	15154.0498	13892.6572	15540.6172	19213.3945	18546.8008
1.8679	20485.5938	12780.8779	20258.3223	21163.8594	20328.3906	19113.5703	13896.4521	17706.1367	15168.6123	16901.3516	16428.8105	17916.1914	15845.9014	20765.9219	26330.1758	15329.71	14742.9355	19350.4902	19252.2441	16478.2461	19523.8945	17444.4512	15048.7041	18757.668	17843.6367	15791.4756	15712.8086	13790.5059	17522.3594	19055.7441	19990.0273
2.0013	18632.1309	12835.1221	19436.4043	23900.7266	20470.8809	18595.5625	14398.4902	16005.8027	15157.5654	17118.4297	15475.9434	16737.0762	15028.3428	19026.0938	24688.5098	15205.7402	14120.4082	20086.9551	19441.1426	17613.2227	17901.9238	18785.7676	14687.5205	20420.1133	18643.1016	16691.2246	16596.0898	12217.4141	18220.3672	19203.6582	21054.5508
2.1347	15698.8545	11808.2988	20400.5059	22455.5273	20450.1328	19031.0332	15853.7598	16185.9834	14640.2754	18276.6719	15175.0664	14807.3965	15005.1943	18507.3457	23844.7539	15410.0859	14960.542	20591.6074	18671.332	18174.6328	16976.6406	18119.6172	15203.0664	22295.2559	19035.166	17216.9199	17010.8242	12231.4746	17555.0234	18504.7949	19676.6992
2.2682	14930.5986	11520.208	20208.252	20276.2168	19494.1094	20654.8535	15877.7734	17056.8672	15401.6338	19065.7793	15176.4844	14537.1572	16731.8535	16920.4453	22016.2285	15672.2295	15463.9404	20616.5918	18387.543	19113.8555	16461.334	16893.0156	15747.7109	21840.8516	19139.5723	16444.8457	16264.4053	12317.8496	17257.2051	18263.1055	18279.1641
2.4016	15531.1289	11578.3262	18900.3359	19657.502	17009.2109	19475.7734	17472.0215	16903.0586	15948.6045	21551.3066	14996.1367	16256.9453	17791.1641	16627.4336	22556.3418	16142.0713	16098.4346	20903.7969	17310.2461	19898.7578	15604.168	16245.9883	14956.1328	19924.5078	20283.0547	16128.2334	15762.8262	13198.124	16275.8398	17034.002	16090.543
2.535	16392.2266	11226.2666	18974.1914	18388.8867	16500.0977	18903.4453	18937.3457	17644.6992	16915.709	20907.3945	15827.5117	18018.1484	17657.4082	17162.1758	22911.9141	16252.3877	16455.3086	20809.5137	16160.8506	20681.8262	14634.3613	15517.5986	15261.2275	19117.8633	22346.7324	15044.9346	14834.0098	14173.8643	15525.1133	16732.7285	15795.6201
2.6684	17146.6035	11340.1055	17311.4492	17772.2402	17744.2441	16774.1797	19284.6074	18578.916	17267.8789	21944.6582	16566.2383	17673.7012	17315.3711	17105.5566	23970.666	15480.7285	16177.7188	20254.9824	14845.7451	21239.8574	15707.001	16312.1484	16045.9307	18686.1953	23259.9043	14702.833	14376.0439	13464.3721	15697.1104	16991.1543	16552.252
2.8019	18180.6211	11468.9736	16117.6367	17245.7246	18070.2051	15149.8359	18460.3555	18333.5312	15850.8418	24277.8105	15402.166	16762.0879	17325.2168	16337.4932	22529.0801	16028.1895	16081.4062	20514.7871	14136.8271	19555.0059	16414.9648	15997.0176	17405.7539	19203.4746	22420.8223	15541.9639	15522.2168	14786.4336	15784.6934	16799.459	16892.7305
2.9353	18980.2969	11933.0166	16417.4805	17467.7012	18823.5117	14162.5273	17507.2227	17642.2871	14812.3477	25764.6094	14418.8691	16283.4082	17946.5273	13534.4033	21950.8828	15334.4043	15051.2227	18997.25	13991.1113	17271.8398	16886.4629	16007.5576	16992.2559	19332.3906	24026.3281	15343.5312	15397.2871	15016.4141	14715.9775	15097.3008	18025.0977
3.0687	19003.9355	11947.7998	17985.7676	16758.2656	18613.3555	13667.7529	16125.0986	17966.1816	13348.0312	27198.3457	13158.2705	14667.3965	17151.2559	13009.4932	20230.1758	14394.1152	14538.127	19349.7324	16458.1035	15717.4697	16013.4502	15660.7773	16768.0801	19271.9785	24197.3535	15052.8408	15203.041	14352.7217	14674.998	14572.5068	18071.3652
3.2021	17233.4707	12089.8828	17915.6816	17243.3477	17610.6797	12504.208	16417.5078	16994.8789	13413.6318	23544.5762	13246.293	13935.6562	17611.123	13704.2861	18324.1973	14656.5371	14374.8037	17415.1094	18531.0645	13928.2412	15027.7812	14554.8984	17589.3184	16962.8887	25051.584	14814.3018	14757.0391	13498.3408	13920.0957	14069.3535	17294.5879
3.3355	16666.5078	12656.4717	17208.8203	16208.9141	15912.2666	12129.8789	16522.6328	15371.4541	13066.6338	19442.8125	14183.4824	13384.1289	15365.2803	13534.5879	17145.748	15732.9766	14081.2607	16001.2715	20814.6367	13984.4521	13898.2939	13810.9785	18206.1523	15890.8516	24373.1934	14380.4043	14318.9297	12659.1152	12937.7139	14018.2949	16349.1855
3.469	15775.0781	14297.5459	15499.8613	14253.9248	15513.6035	12039.3965	17142.7012	14525.6846	11973.2646	17806.6367	13889.7529	12900.3184	14939.3379	12901.168	16635.7715	14294.6865	13967.2109	15544.0234	20170.9727	13570.1475	13450.2812	13696.6416	17355.8281	15202.3311	22643.9766	13415.2959	13360.2842	12906.9775	13281.2617	14132.3691	14564.6416
3.6024	15140.9463	13077.5303	13963.2607	13688.8555	15816.4961	11781.6836	15481.7334	14420.4277	11820.1143	14845.4785	13743.5029	12590.5029	14871.6143	13393.1074	15067.2939	14748.6396	13637.5771	15561.4688	18418.6953	12064.8389	13492.0098	13369.6836	16682.8477	14420.4385	20173.5879	13494.8428	13480.2002	12268.8125	12385.3262	15236.7891	14175.1758
3.7358	14206.4385	13718.3018	12525.248	14484.7227	NaN	12428.0967	13960.2998	14066.5547	11263.5596	13522.6709	13035.5254	13137.3516	14065.541	13953.5303	15242.0498	14452.5391	13629.0537	15139.8857	17518.4648	11890.5742	NaN	13283.8271	15362.4023	14201.0117	18497.1504	12774.5391	12684.917	NaN	12065.8359	16157.1943	14053.2021
3.8692	13920.1416	13351.752	12307.377	13564.4258	NaN	12376.4443	13248.7227	13375.6299	11259.5869	12803.5703	12428.1318	NaN	13705.2148	14244.8652	15196.9316	14128.8076	NaN	14543.5508	17171.4551	12068.2754	NaN	13215.1377	14481.5576	NaN	17133.1836	12657.501	12465.7637	NaN	11769.4717	17272.3672	13345.1963
4.0027	14067.8213	13307.5459	12035.7871	NaN	NaN	12563.5469	13134.1465	NaN	10919.0938	11890.1455	13038.0166	NaN	13335.0078	NaN	14681.9355	14392.7559	NaN	13494.2705	15906.9014	13085.4082	NaN	NaN	14612.7725	NaN	NaN	12501.3369	12437.0098	NaN	12177.7178	16151.833	13396.4189
4.1361	NaN	12926.8691	12849.6387	NaN	NaN	NaN	12349.0869	NaN	NaN	12536.6934	12648.2236	NaN	13439.1064	NaN	NaN	14356.0664	NaN	NaN	14700.3359	13754.1865	NaN	NaN	13787.1963	NaN	NaN	NaN	11969.2812	NaN	12628.2588	15908.2471	13560.377
4.2695	NaN	12502.7676	12294.9912	NaN	NaN	NaN	12574.3418	NaN	NaN	12541.2988	12693.2285	NaN	14004.6064	NaN	NaN	14860.9854	NaN	NaN	15601.4893	14541.0146	NaN	NaN	13852.6582	NaN	NaN	NaN	11763.8096	NaN	12780.2217	NaN	13019.6992
4.4029	NaN	NaN	NaN	NaN	NaN	NaN	11747.123	NaN	NaN	12809.7891	NaN	NaN	NaN	NaN	NaN	NaN	NaN	NaN	14829.3438	NaN	NaN	NaN	NaN	NaN	NaN	NaN	NaN	NaN	NaN	NaN	NaN
4.5363	NaN	NaN	NaN	NaN	NaN	NaN	NaN	NaN	NaN	NaN	NaN	NaN	NaN	NaN	NaN	NaN	NaN	NaN	15433.8828	NaN	NaN	NaN	NaN	NaN	NaN	NaN	NaN	NaN	NaN	NaN	NaN
4.6698	NaN	NaN	NaN	NaN	NaN	NaN	NaN	NaN	NaN	NaN	NaN	NaN	NaN	NaN	NaN	NaN	NaN	NaN	NaN	NaN	NaN	NaN	NaN	NaN	NaN	NaN	NaN	NaN	NaN	NaN	NaN
4.8032	NaN	NaN	NaN	NaN	NaN	NaN	NaN	NaN	NaN	NaN	NaN	NaN	NaN	NaN	NaN	NaN	NaN	NaN	NaN	NaN	NaN	NaN	NaN	NaN	NaN	NaN	NaN	NaN	NaN	NaN	NaN
4.9366	NaN	NaN	NaN	NaN	NaN	NaN	NaN	NaN	NaN	NaN	NaN	NaN	NaN	NaN	NaN	NaN	NaN	NaN	NaN	NaN	NaN	NaN	NaN	NaN	NaN	NaN	NaN	NaN	NaN	NaN	NaN
5.07	NaN	NaN	NaN	NaN	NaN	NaN	NaN	NaN	NaN	NaN	NaN	NaN	NaN	NaN	NaN	NaN	NaN	NaN	NaN	NaN	NaN	NaN	NaN	NaN	NaN	NaN	NaN	NaN	NaN	NaN	NaN
5.2035	NaN	NaN	NaN	NaN	NaN	NaN	NaN	NaN	NaN	NaN	NaN	NaN	NaN	NaN	NaN	NaN	NaN	NaN	NaN	NaN	NaN	NaN	NaN	NaN	NaN	NaN	NaN	NaN	NaN	NaN	NaN
5.3369	NaN	NaN	NaN	NaN	NaN	NaN	NaN	NaN	NaN	NaN	NaN	NaN	NaN	NaN	NaN	NaN	NaN	NaN	NaN	NaN	NaN	NaN	NaN	NaN	NaN	NaN	NaN	NaN	NaN	NaN	NaN
5.4703	NaN	NaN	NaN	NaN	NaN	NaN	NaN	NaN	NaN	NaN	NaN	NaN	NaN	NaN	NaN	NaN	NaN	NaN	NaN	NaN	NaN	NaN	NaN	NaN	NaN	NaN	NaN	NaN	NaN	NaN	NaN
5.6037	NaN	NaN	NaN	NaN	NaN	NaN	NaN	NaN	NaN	NaN	NaN	NaN	NaN	NaN	NaN	NaN	NaN	NaN	NaN	NaN	NaN	NaN	NaN	NaN	NaN	NaN	NaN	NaN	NaN	NaN	NaN
5.7371	NaN	NaN	NaN	NaN	NaN	NaN	NaN	NaN	NaN	NaN	NaN	NaN	NaN	NaN	NaN	NaN	NaN	NaN	NaN	NaN	NaN	NaN	NaN	NaN	NaN	NaN	NaN	NaN	NaN	NaN	NaN
5.8706	NaN	NaN	NaN	NaN	NaN	NaN	NaN	NaN	NaN	NaN	NaN	NaN	NaN	NaN	NaN	NaN	NaN	NaN	NaN	NaN	NaN	NaN	NaN	NaN	NaN	NaN	NaN	NaN	NaN	NaN	NaN
