x	Y_20180514_15338_c1_1_4g	Y_20180514_15338_c1_10_2g	Y_20180514_15338_c1_15_2g	Y_20180514_15338_c1_17_3g	Y_20180514_15338_c1_2_10g	Y_20180514_15338_c1_22_1g	Y_20180514_15338_c1_28_6g	Y_20180514_15338_c1_3_11g	Y_20180514_15338_c1_4_3g	Y_20180514_15338_c1_5_3g	Y_20180514_15338_c1_6_10g	Y_20180514_15338_c1_8_10g	Y_20180514_15338_c1_8_6g
0	30995.021	29138.012	32113.41	32209.117	28763.77	30928.391	30291.582	31026.518	29496.451	30033.629	30827.531	28811.896	31772.201
0.1334	30429.225	29897.52	31491.152	31553.404	29538.057	30393.283	30146.01	31361.125	28602.396	30254.9	32171.619	28553.869	30248.061
0.2668	31892.734	30987.488	31784.611	32339.18	29277.057	30364.721	30324.611	31170.789	27905.703	31157.379	30383.354	30733.785	31483.322
0.4003	32051.934	31167.836	30611.084	33004.246	27333.475	31091.486	29474.646	32086.699	28712.555	30911.324	31200.051	29512.867	30626.037
0.5337	30943.596	30654.703	30977.754	32915.305	28150.775	31110.268	27883.879	29908.896	27922.561	31440.133	30854.018	30477.588	33594.84
0.6671	31529.693	30681.061	31963.088	32191.998	27624.846	31237.41	29125.465	30904.619	28313.291	31568.957	30107.213	29447.014	33281.129
0.8005	31327.453	30930.738	32249.975	33040.012	30859.791	31057.891	29339.113	31257.186	28012.105	32966.676	30170.57	29487.113	33189.273
0.934	30841.613	31191.031	32916.66	36144.016	31479.688	32807.449	30575.996	30158.045	27961.936	32355.936	30200.412	30377.354	34499.109
1.0674	31203.865	31609.582	33802.773	33115.098	30696.908	31629.422	31189.066	32431.52	27948.037	33284.957	30071.943	30863.877	33441.016
1.2008	31691.588	30623.08	34278.305	33438.461	31857.111	31977.168	30611.924	32140.076	28154.514	30638.859	30716.436	29992.367	32749.986
1.3342	31200.541	30946.822	34831.469	33761.961	29473.16	32862.812	32066.984	31978.932	29002.746	30932.283	30792.613	29878.08	33974.234
1.4676	32524.812	34289.723	37946.16	33792.504	30026.939	33475.289	31576.957	31939.771	28497.639	33033.516	32714.658	31464.896	33968.188
1.6011	33292.902	34536.062	45787.543	33485.352	30181.904	35699.582	30904.059	32936.633	29193.289	31519.002	30807.141	38503.648	34644.238
1.7345	33597.301	38923.703	57417.816	36469.336	29268.361	37305.008	30579.527	39000.363	29255.199	31067.418	31002.48	51234.359	33470.352
1.8679	33755.594	55560.09	61748.961	38864.316	30612.514	43238.766	31154.283	53103.93	28941.812	30937.807	33304.211	53541.758	32672.064
2.0013	34644.477	78572.211	47670.395	44073.254	31472.721	57229.16	30214.463	65844.391	29356.359	31709.035	32105.969	47853.406	32676.363
2.1348	34249.098	83493.008	38762.336	58845.395	32226.283	65729.891	31471.066	59832.52	29524.428	32709.289	32574.375	42069.449	34490.992
2.2682	36525.727	59756.066	36461.652	88222.133	37078.148	58374.906	31792.123	45732.941	27911.9	32763.951	37043.223	47790.973	33951.207
2.4016	40097.582	43820.59	34862.109	96866.344	45715.102	46168.168	32471.299	36237.887	30634.518	34181.398	40344.879	63217.336	33183.316
2.535	50721.016	37756.66	NaN	74332.219	62623.461	43177.98	31009.602	32958.117	35108.609	38284.023	46587.684	NaN	33472.051
2.6684	63347.281	35468.832	NaN	49915.707	68601.398	46949.617	32376.826	32173.66	36192.91	44138.09	45456.035	NaN	33946.293
2.8019	59392.352	34997.367	NaN	40758.383	58615.32	50605.445	35750.469	30461.104	33945.008	44052.598	37466.121	NaN	35624.113
2.9353	46678.559	NaN	NaN	37348.477	43460.141	48347.641	38386.906	31037.074	31200.854	38193.188	35421.426	NaN	35321.121
3.0687	37642.43	NaN	NaN	35849.324	36225.664	NaN	48662.684	31846.834	30332.775	31617.727	33601.805	NaN	37844.023
3.2021	36167.785	NaN	NaN	36280.273	31542.119	NaN	57050.27	NaN	29791.18	29774.475	31802.031	NaN	43871.719
3.3356	NaN	NaN	NaN	NaN	30143.438	NaN	49497.609	NaN	30586.811	30412.926	NaN	NaN	49075.137
3.469	NaN	NaN	NaN	NaN	31313.443	NaN	42019.711	NaN	31961.02	31444.469	NaN	NaN	47044.055
3.6024	NaN	NaN	NaN	NaN	NaN	NaN	39620.508	NaN	NaN	30195.217	NaN	NaN	42145.086
3.7358	NaN	NaN	NaN	NaN	NaN	NaN	NaN	NaN	NaN	NaN	NaN	NaN	40305.281
3.8692	NaN	NaN	NaN	NaN	NaN	NaN	NaN	NaN	NaN	NaN	NaN	NaN	43685.242
4.0027	NaN	NaN	NaN	NaN	NaN	NaN	NaN	NaN	NaN	NaN	NaN	NaN	NaN
4.1361	NaN	NaN	NaN	NaN	NaN	NaN	NaN	NaN	NaN	NaN	NaN	NaN	NaN
4.2695	NaN	NaN	NaN	NaN	NaN	NaN	NaN	NaN	NaN	NaN	NaN	NaN	NaN
4.4029	NaN	NaN	NaN	NaN	NaN	NaN	NaN	NaN	NaN	NaN	NaN	NaN	NaN
4.5363	NaN	NaN	NaN	NaN	NaN	NaN	NaN	NaN	NaN	NaN	NaN	NaN	NaN
4.6698	NaN	NaN	NaN	NaN	NaN	NaN	NaN	NaN	NaN	NaN	NaN	NaN	NaN
4.8032	NaN	NaN	NaN	NaN	NaN	NaN	NaN	NaN	NaN	NaN	NaN	NaN	NaN
4.9366	NaN	NaN	NaN	NaN	NaN	NaN	NaN	NaN	NaN	NaN	NaN	NaN	NaN
5.07	NaN	NaN	NaN	NaN	NaN	NaN	NaN	NaN	NaN	NaN	NaN	NaN	NaN
5.2035	NaN	NaN	NaN	NaN	NaN	NaN	NaN	NaN	NaN	NaN	NaN	NaN	NaN
5.3369	NaN	NaN	NaN	NaN	NaN	NaN	NaN	NaN	NaN	NaN	NaN	NaN	NaN
5.4703	NaN	NaN	NaN	NaN	NaN	NaN	NaN	NaN	NaN	NaN	NaN	NaN	NaN
