x	Y_20180514_15325_1_1g	Y_20180514_15325_1_3g	Y_20180514_15325_10_1g	Y_20180514_15325_11_11g	Y_20180514_15325_11_5g	Y_20180514_15325_14_4g	Y_20180514_15325_16_1g	Y_20180514_15325_17_11g	Y_20180514_15325_17_12g	Y_20180514_15325_17_7g	Y_20180514_15325_18_2g	Y_20180514_15325_19_2g	Y_20180514_15325_19_5g	Y_20180514_15325_2_1g	Y_20180514_15325_2_7g	Y_20180514_15325_2_8g	Y_20180514_15325_20_3g	Y_20180514_15325_20_4g	Y_20180514_15325_21_11g	Y_20180514_15325_21_4g	Y_20180514_15325_21_5g	Y_20180514_15325_21_7g	Y_20180514_15325_22_7g	Y_20180514_15325_25_2g	Y_20180514_15325_26_2g	Y_20180514_15325_27_9g	Y_20180514_15325_28_5g	Y_20180514_15325_29_7g	Y_20180514_15325_31_5g	Y_20180514_15325_32_2g	Y_20180514_15325_32_8g	Y_20180514_15325_33_2g	Y_20180514_15325_33_4g	Y_20180514_15325_4_2g	Y_20180514_15325_5_5g	Y_20180514_15325_6_4g	Y_20180514_15325_7_2g	Y_20180514_15325_7_5g	Y_20180514_15325_7_9g	Y_20180514_15325_8_2g	Y_20180514_15325_9_7g
0	32454.877	29148.8301	28113.9648	33591.7539	35411.1602	30251.5176	29528.6309	27781.5625	28180.209	29187.0508	25173.8262	35511.5039	31651.6211	28808.6152	34336.9922	34046.8398	32645.4297	35635.1172	31594.8496	32302.8105	31960.3145	33904.8047	34467.9102	10497.2051	35241.6289	35842	30549.9043	32997.918	32795.25	34129.1211	32902.0586	27116.8184	33253.8984	27360.1465	29440.5781	29948.1133	26211.1367	33214.125	34996.3477	38981.3633	29886.1582
0.1334	32899.0234	29756.2227	28806.5645	34049.8906	36365.9453	28679.7441	29888.6836	27241.1621	29232.9219	29368.1309	26285.1387	33530.7148	33245.2656	29333.0508	34755.6875	33018.2578	33071.4336	33623.5195	31160.1758	33119.5352	32782.0352	33317.0039	33611.3203	22264.291	34877.9141	35611.9023	31788.6484	33851.0938	33499	34858.0625	33117.0195	26857.2363	33417.6484	28361.1895	31710.8398	28230.207	26440.7188	33523.4844	33768.5781	35811.8711	31895.2129
0.2668	33701.918	30273.9785	29989.873	32140.4512	34966.875	29694.7695	29566.5684	27679.582	28656.6738	28331.2422	27254.7363	32745.7012	32900.7227	29277.0449	35732.7539	33029.0547	33790.5938	34405.5508	31523.9473	33109.5625	31727.6387	33650.7734	32245.6309	28296.5176	34543.9414	35785.9805	30437.0449	34455.8125	34068.6758	35764.9961	34459.8125	27880.498	32661.959	27235.0957	31118.0293	28450.1562	27768.2383	33686.4883	34242.0117	35768.7695	31595.377
0.4003	33562.9805	28101.3379	29731.2285	33273.7305	36005.5586	29111.8027	28814.9219	28034.3242	28780.7695	29651.7461	26978.4336	33228.3047	32144.7871	29586.7188	34489.7188	33068.4805	34697.8203	35729.5117	31623.9141	33011.1367	31626.4238	34733.5	31279.8867	28293.3262	35057.7031	35559.8438	30650.7949	34091.8047	33526.9141	35372.3008	34478.8125	27098.1504	33037.9727	27700.1484	30745.9941	29435.0059	27238.8281	32872.9062	33907.6914	34847.0312	31050.6895
0.5337	34962.1055	29613.7617	28715.2305	34222.5742	37167.3008	29837.3828	30260.834	27077.1504	28418.1191	31249	25859.7852	35090.6094	31823.5449	28910.9336	35451.8086	35567.4102	34808.8984	35172.3438	33291.543	33758.1953	32600.2402	34762.5234	30560.3008	27824.6133	34577.3438	33529.3359	30027.4766	34010.2266	34674.8867	35762.7266	33883.7617	27684.5391	33353.8828	28322.084	33401.3789	29142.9082	27796.2148	34372.2266	34270.125	35660.3398	30493.9473
0.6671	32440.4473	30197.3496	28721.8008	34689.3672	38144.5156	30266.5664	29022.7109	26486.9531	28785.9668	29564.7871	26495.3984	32875.3711	30967.9004	28773.1328	35416.4492	35138.0586	34653.418	36005.7734	33129.0273	34959.707	31814.1113	34884.082	30043.541	28771.1621	35536.0742	35145.9727	31879.0762	33851.1562	35074.4922	35676.832	32624.7305	27244.0703	34059.9922	28202.2188	32483.1504	29924.4688	28665.9355	34382.3281	35779.6289	35491.8672	29875.9238
0.8005	34275.8711	30423.7344	29440.3184	32898.668	38418.5781	30487.75	31596.7441	27421.4336	28812.791	28316.7402	27678.2598	33901.6055	31612.9375	29718.3926	36696.0195	34365.0508	35881.7617	35010.7617	32515.3711	36202.6836	31648.875	35124.3867	30368.2695	28905.5938	36725.6719	35609.0898	32104.9941	33392.9609	35433.2422	36495.625	32724.7695	28420.7148	33755.5273	27882.5703	33002.9727	30795.6777	28104.9492	34587.5703	36382.7031	35560.7383	31353.0957
0.934	34787.9844	29796.666	31455.627	33575	37282.3086	31048.248	32039.4238	27546.1445	27614.2129	29645.6836	27465.0098	33761.3398	33461.8398	28511.6992	35979.9219	33204.6445	36807.5312	35183.7773	30718.7305	35099.8438	33451.25	33615.5234	31229.9824	27625.1992	38235.5156	36292.2188	32642.2969	32706.8848	36545.4609	35234.1484	33395.5	29100.0391	35612.668	26404.3223	31583.0332	30923.2793	27784.6348	33408.3242	38097.0977	35353.8906	31951.5684
1.0674	36154.6875	31564.2227	30265.918	34028.2812	36308.9375	32395.0059	32030.8672	27590.5664	28820.2773	28718.6465	26380.0566	34185.1719	32526.8516	29524.8223	34522.4844	33479.1562	34837.3242	36310.6719	30821.7891	35340.1953	33719.9961	34559.7891	30908.9727	27995.5586	35462.2695	37847.2109	33180.9805	34344.7031	35765.0977	35379.0234	34073	28189.0137	34862.4844	27628.7734	32203.0039	30856.541	27548.082	33982.5312	36889.7773	36528.6367	31485.5352
1.2008	34847.5547	31533.4629	30688.791	33131.4375	36000.8359	33259.6133	31908.0449	27288.8691	28851.957	28600.1602	28110.877	34024.1953	31622.1309	30261.416	34459.8516	35199.4648	35340.9531	34499.4297	32159.7285	34020.0859	32045.9551	32456.252	31118.8418	29030.1602	35430.8047	37410.875	34618.6133	34784.8594	34878.4727	35193.1992	34581.5508	27935.7969	35317.0859	27074.7695	31146.1934	30129.2441	26775.2793	33397.9609	36828.7461	38278.0938	32136.3828
1.3342	35126.6367	32587.1152	30246.9102	31740.7812	37270.8242	34046.4375	31190.4785	27885.4004	29322.5371	27781.1875	28484.3105	34649.082	33022.8203	30254.5039	33254.1523	34507.1289	35220.1836	35696.7539	31207.9434	34224.8711	33120.4336	32413.6348	31074.5137	28153.4883	37828.4102	35908.9453	33438.2812	34544.6719	35519.5	33612.4062	34686.5586	28614.4277	34453.3125	27770.2949	31160.4316	29060.2168	27686.9688	34503.9531	37625.8203	36408.4297	30657.3867
1.4676	35419.2305	32128.25	29245.9531	31914.5234	37036.9961	34248.8242	29840.0918	26592.2402	28704.6641	30091.0977	26947.334	35211.1172	32407.5059	29498.6953	33560.6484	33707.5781	34206.4062	36516.8594	30643.377	33882.0898	33307.5	33493	32544.6309	28166.8184	36145.8398	34680.6406	33527.2539	34307.8281	34140.7344	33938.9102	33405.7031	30178.4316	34496.9531	28902.6992	31120.3164	29716.8789	27878.4082	35846.4023	37547.75	35738.6016	31092.5859
1.6011	35451.5234	31721.6758	28919.6816	33003.4922	36502.8438	32680.7305	29556.6445	25998.2227	29858.6367	29786.4746	26935.418	35858.5508	32555.0508	28664.0957	33569.5156	34239.5703	34743.8555	33525.7461	29772.5566	33927.1992	33306.9805	33421.9883	31665.7559	28180.4199	36100.3555	34534.9062	34045.457	33759.1328	33859.7852	34035.125	35323.3125	30064.6543	34823.4531	30419.5195	31366.1895	29105.5391	27232.9668	34752.5469	38319.6562	35216.1094	32383.4082
1.7345	36488.5547	31303.4824	29410.7051	32174.3711	35546.9375	33018.2344	30110.1914	27134.0508	29859.2461	29811.4766	28105.7012	35823.0273	32936.3086	29054.6602	33379.418	35076.9609	34821.582	33685.5625	29269.1191	32638.8164	33082.6289	33519.0938	33057.9883	28265	37285	35424.9844	34659.7148	34501.8281	34525.1602	33210.5703	33576.875	28575.041	34614.2305	29727.125	31118.8184	29708.6289	27589.3867	35533.4805	39476.6484	35926.9141	30508.1855
1.8679	35661.5273	31560.8711	29448.8184	32755.3906	35561.3594	33123.0312	29551.3477	27738.8633	31837.2188	29859.0859	27068.502	35259.1914	33823.6328	29578.8477	34304.2852	33605.7305	35167.0117	35000.4688	28480.0215	32017.2578	32471.8965	34635.8828	34063.5117	27839.5664	37533.2891	33334.25	34347.0586	34927.043	36706.2969	32590.0645	32699.0078	28664.5508	33113.7148	29614.9805	31331.6152	28805.2578	28001.3066	34542.168	39608.1719	36164.4258	31490.1016
2.0013	34532.4609	32071.2285	30841.6875	34146.8711	34129.832	34313.8125	28557.1973	26319.082	31488.998	28904.8027	27615.3789	33734.3047	34639.4141	29385.9512	33034	34300.9609	35248.7422	34944.1016	29946.041	32718.459	32632.752	33623.6641	34765.4648	28692.6289	40045.6992	32775.4531	34260.9922	33366.6914	36182.957	32979.4336	31918.2578	29605.5566	33723.4688	29764.373	31484.1836	29238.459	28041.334	34287.1211	40163.4805	35875.3984	31817.5762
2.1347	33870.0156	30160.5195	29901.5371	31711.0684	34357.0898	35495.5312	28338.0508	26668.5273	30105.3613	28423.4355	28219.0195	33587.125	32579.0664	28356.0703	32246.0918	34595.2852	35513.6875	35151.4336	30221.9766	32177.377	32783.3281	33658.8086	40513.9805	29184.9941	37206.7891	32815.8359	33112.8594	34287.207	35011.4883	33860.5078	34308.9805	29006.252	34185.3203	28306.0371	30287.2148	29751.6641	27371.0293	35384.2891	39778.0195	36045.3359	30602.6523
2.2682	35238.9453	30954.1016	29460.1504	31050.7285	33628.2617	35037.1211	29699.752	25810.2227	29651.7031	28240.5938	27851.0195	33467.7344	32518.3594	27378.1973	32766.4961	34702.9844	36417.918	34685.9805	29952.668	32828.4922	33407.2891	34535.0625	42978.2109	28816.5645	37439.0156	32304.0371	34823.2773	34012.8242	35724.6211	34025.0273	32939.6719	27837.6914	34362.9062	29870.9219	30874.8223	30139.7383	27338.4941	34183.0234	39217.707	33987.0742	31379.6152
2.4016	32310.2402	31446.9023	29991.6387	31036.207	34987.5273	33933.0352	31056.6328	27036.3301	30464.7422	28696.6211	28410.4395	34527.4805	32616.8594	27309.8809	34014.3359	33943.707	35738.2969	34566.2812	29651.3574	32080.8086	33851.2461	35443.0977	43503.1016	29345.6602	36730.1016	32695.6152	34026.7852	33194.2656	37567.2773	35117.1016	33196.5391	29006.668	34584.7734	28831.5332	30986.6543	30448.7109	28411.4473	34256.8008	38400	33600.3125	31210.4453
2.535	32242.6738	31221.1953	30593.9258	30890.5957	35006.2031	32669.6309	29379.9004	27510.6777	31722.5586	29606.2539	30266.8438	33472.9102	32244.7676	28740.334	34934.832	35790.2617	34550.2266	33869.8047	28536.9902	33223.0195	32413.668	36041.6719	37937.7266	29298.9004	37113.7734	33521.4609	33656.7969	31933.7969	35303.625	34066.8516	33005.6602	28961.9512	34886.9336	29111.75	31404.3789	29810.8184	27468.8066	34321.2539	37872.5664	33668.168	30335.2285
2.6684	33232.875	31407.8848	31138.3965	31614.0801	33912.1484	31013.7715	30436.5527	28741.4375	31030.3379	30016.834	33276.8359	33683.4844	32248.2207	31124.832	36313.0078	35566.8945	34798.0156	34176.6016	31105.2617	33415.8945	32769.1719	36897.1094	36319.6602	30322.2305	38241.6875	34190.3281	33150.6367	32229.3262	35840.6133	35562.5273	33115.9453	30060.1035	34739.5938	29372.6504	29997.7734	29544.4141	28610.3652	34706.4883	38030.9219	34705.3633	31672.584
2.8019	32108.125	31320.1582	30556.4844	30783.9375	33615.4453	32069.8613	30884.0215	28417.2949	30615.8125	29689.1211	35867.8828	34083.9336	31977.6367	31449.5469	36395.3867	35319.3438	35848.9648	33837.6992	31293.4062	32852.8008	32700.3711	35920.2422	35531.5234	30648.7383	37132.75	32635.4785	33820.6016	32987.4805	35677.8164	37413.3867	32876.0703	30949.2852	35006.0625	29818.8652	31032.4941	29355.9434	27876.25	34559.6289	36447.832	36530.9688	31567.9688
2.9353	34421.957	33313.7852	31912.0176	31904.6895	34986.082	32989.6953	34550.5039	28531.6699	30902.6113	31163.0391	32422.627	34457.4531	32419.8379	34934.8633	39519.3945	34724.3828	35732.2305	34198.3672	31914.2715	33879.6523	35463.2539	36181.7695	35142.3398	30950	39719.6016	35323.5586	34428.6641	34496.2578	36328.3594	39468.5547	33637.2617	31888.8457	35137.1953	30489.6699	30025.6973	30056.9531	28899.9355	35257.2578	37372.3047	37321.2227	33127.6016
3.0687	34525.2266	36466.457	33424.2695	32372.0117	34984.5703	31975.0723	41464.2305	29996.0723	31642.4844	31517.7852	29052.4062	35443.8984	33766.5391	39406.082	46335.4492	34274.0703	36451.7734	36578.2891	31228.9766	34851.2578	38601.1758	38434.3359	37356.2383	33367.6055	45593.6094	36582.9883	32946.7383	34963.207	37832.7109	40581.707	37693.6016	35139.207	37187.8086	33289.9297	31852.6934	30193.2695	29965.9492	37176.7578	36005.6523	41048.3359	37419.4883
3.2021	35523.4258	41385.2266	36928.707	33420.2773	36732.668	32847.0938	62501.1367	33182.1953	30953.4375	32192.8828	28795.6484	37660.5742	34551.8008	61468.5312	57166.0312	37421.8047	36314.3867	40232.9609	33710.2969	36482.7852	46722.8906	42413.8828	39629.9219	37571.8125	59720.4141	38383.8672	34310.6484	39113.3438	42216.6172	46208.8555	40663.168	45778.0078	40491.5469	36339.4336	32543.6387	35952.8555	32075.4121	42131.3242	36788.8633	43622.0195	46797.1172
3.3355	41035.7695	49097.375	46210.1484	35246.8203	40040.1914	35592.3594	95830.9922	40713.3633	30488.1426	38070.4258	29882.8008	39484.1953	33574.7695	85196.1562	73764.4062	40432.3633	40545.3555	49505.9609	38787.1211	39787.3398	68338.5938	54262.7812	44378.0742	45756.8477	98181.8438	48549.1641	39972.082	49095.7266	56309.5078	57532.3789	57298.6914	69124.8125	50985.5664	43029.7773	33810.6836	40309.6484	40467.125	60290.9258	37102.6562	58604.8555	70723.3438
3.469	61457.4531	58857.9766	70702.6094	41180.7852	46739.3047	42803.5938	110005.1641	57486.8398	33522.5547	50202.0312	33979.707	48898.1055	35754.8125	87589.3594	80350.1562	54731.8711	51733.1406	73051.6641	56089.3828	51775.9141	111768.1719	89162.0469	62214.5859	70104.8984	129047.4219	74006.4375	51036.8164	71537.0547	74905.1953	83476.9375	100809.3125	103035.6641	59838.4141	61285.5312	35725.1055	59543.6523	61263.4492	88583.3281	39004.3594	96943.3438	102400.4375
3.6024	97037.5625	50166.875	127581.7422	54494.793	71880.5234	57102.8008	86267.5547	85086.7344	40059.5273	71547.9609	42469.7148	71171.6562	41116.8828	61882.3984	70827.8438	76499.1016	67484.8984	115813.9688	93047.0547	78453.25	151526	146868.8438	81228.5625	128496.1641	111189.1484	112787.4688	73004.5703	103676.9844	87495.5625	98266.6094	180979.0781	104235.75	55652.875	97750.6797	42557.7266	87972.0312	79294.6406	99048.7812	43609.9297	144926.2188	105657.7109
3.7358	117448.4531	41278.5703	157420.9375	67753.3672	120744.1953	79638.7344	56749.875	86572	58035.4492	75999.7188	61177.4805	109675.6641	50137.6992	43928.0703	52720.8633	79451.2891	77723.8125	143186.5312	120749.2109	108266.3281	139830.6719	176794.7031	79775.1094	167615.4219	72985.0469	116691.4297	116007.9219	98866.4531	70293.5547	77644.6406	196266.0312	68068.0625	49401.4375	114307.1875	58506.082	89720.6797	75511.0312	80347.4844	57760.6211	143959.8125	80913.9375
3.8692	88583.25	35147.332	123274.8594	66177.4141	158946.1406	83342.8047	NaN	61570.9531	86558.2266	55604.8281	81771.6562	124682.1406	80555.6641	36551.8047	40949.7734	59128.3633	65734.5781	113970.8047	99739.0312	95721.8906	108249.2656	140947.8594	58632.082	132652.75	51191.4102	84502.9531	124900.2656	66933.3125	48799.7539	54652.8594	141185.7344	46192.6211	NaN	87147.1562	82028.6094	61728.3984	50777.9219	55639.332	80357.9062	94167.2812	61014.9453
4.0027	58710.5938	34194.9453	77817.6406	51264.5391	128874.0391	58105.7109	NaN	41950.2305	95435.1016	41547.875	79265.6797	90345.6875	129599.3594	31996.834	37364.1172	45406.418	48095.0039	69797.6484	64619.9375	65131.0703	79274.6016	92754.1016	44916.4141	81377.3906	43340.4766	58334.3398	85666.4062	46632.4844	42278.8711	44986.418	79237.5234	36698.9844	NaN	53773.9727	90104.1172	42411.5898	35449.5781	43451.75	81602.3516	62494.9023	45644.9688
4.1361	45863.9062	NaN	63233.3828	41253.5195	75437.7266	41397.1367	NaN	34823.4258	72143.4453	34446.1641	56160.7617	57246.0586	140688.0625	31000.5137	36333.4141	NaN	40406.125	47488.6797	44709.2539	NaN	56835.3125	59948.0234	37952.9922	52512.0898	40769.3711	44814.3281	52560.2617	36785.1641	44097.7578	44295.8086	50983.625	33472.7578	NaN	39652.0352	72831.1484	35205.4922	NaN	39022.1133	63098.5625	49226.5117	37692.9922
4.2695	43386.7383	NaN	NaN	36657.7109	50467.1445	35176.0508	NaN	34030.4375	48958.4805	NaN	37316.9688	42656.5391	101152	32597.4941	NaN	NaN	39152.3555	NaN	37586.7578	NaN	41746.3672	48997.582	35882.6523	40903.9688	39279.5547	39666.1914	41316.1211	36014.7578	NaN	40051.8867	40743.3281	NaN	NaN	35853.9844	52960.3477	31347.3359	NaN	35928.3711	47970.8906	43890.6055	NaN
4.4029	44916.0547	NaN	NaN	35474.9727	43753.3906	32821.418	NaN	33851.9023	39362.4258	NaN	32364.2012	36629.5938	66597.8203	NaN	NaN	NaN	45522.6289	NaN	33676.5977	NaN	37406.5469	44306.2344	NaN	35429.9023	37334.9219	37373.293	37620.5391	33157.3008	NaN	40473.4883	37129.1172	NaN	NaN	33919.2812	42235.5977	31313.4883	NaN	33947.8633	42169.7344	41246.125	NaN
4.5363	NaN	NaN	NaN	NaN	39016.8594	31242.6367	NaN	33411.7539	36525.6836	NaN	28757.8594	NaN	50760.1211	NaN	NaN	NaN	NaN	NaN	NaN	NaN	35537.043	41796.0625	NaN	NaN	NaN	37000.9766	36431.6172	NaN	NaN	NaN	37033.0625	NaN	NaN	35229.6289	36046.5938	NaN	NaN	NaN	38491	NaN	NaN
4.6698	NaN	NaN	NaN	NaN	37190.7266	NaN	NaN	30436.6504	34274.2852	NaN	NaN	NaN	43473.6289	NaN	NaN	NaN	NaN	NaN	NaN	NaN	NaN	NaN	NaN	NaN	NaN	NaN	34631.375	NaN	NaN	NaN	35445.4062	NaN	NaN	NaN	33687.5977	NaN	NaN	NaN	37465.5039	NaN	NaN
4.8032	NaN	NaN	NaN	NaN	35480.0625	NaN	NaN	28349.5879	NaN	NaN	NaN	NaN	38899.168	NaN	NaN	NaN	NaN	NaN	NaN	NaN	NaN	NaN	NaN	NaN	NaN	NaN	34259.6758	NaN	NaN	NaN	NaN	NaN	NaN	NaN	NaN	NaN	NaN	NaN	NaN	NaN	NaN
4.9366	NaN	NaN	NaN	NaN	35520.6953	NaN	NaN	NaN	NaN	NaN	NaN	NaN	37348.3086	NaN	NaN	NaN	NaN	NaN	NaN	NaN	NaN	NaN	NaN	NaN	NaN	NaN	NaN	NaN	NaN	NaN	NaN	NaN	NaN	NaN	NaN	NaN	NaN	NaN	NaN	NaN	NaN
5.07	NaN	NaN	NaN	NaN	NaN	NaN	NaN	NaN	NaN	NaN	NaN	NaN	35506.4219	NaN	NaN	NaN	NaN	NaN	NaN	NaN	NaN	NaN	NaN	NaN	NaN	NaN	NaN	NaN	NaN	NaN	NaN	NaN	NaN	NaN	NaN	NaN	NaN	NaN	NaN	NaN	NaN
5.2035	NaN	NaN	NaN	NaN	NaN	NaN	NaN	NaN	NaN	NaN	NaN	NaN	NaN	NaN	NaN	NaN	NaN	NaN	NaN	NaN	NaN	NaN	NaN	NaN	NaN	NaN	NaN	NaN	NaN	NaN	NaN	NaN	NaN	NaN	NaN	NaN	NaN	NaN	NaN	NaN	NaN
5.3369	NaN	NaN	NaN	NaN	NaN	NaN	NaN	NaN	NaN	NaN	NaN	NaN	NaN	NaN	NaN	NaN	NaN	NaN	NaN	NaN	NaN	NaN	NaN	NaN	NaN	NaN	NaN	NaN	NaN	NaN	NaN	NaN	NaN	NaN	NaN	NaN	NaN	NaN	NaN	NaN	NaN
5.4703	NaN	NaN	NaN	NaN	NaN	NaN	NaN	NaN	NaN	NaN	NaN	NaN	NaN	NaN	NaN	NaN	NaN	NaN	NaN	NaN	NaN	NaN	NaN	NaN	NaN	NaN	NaN	NaN	NaN	NaN	NaN	NaN	NaN	NaN	NaN	NaN	NaN	NaN	NaN	NaN	NaN
5.6037	NaN	NaN	NaN	NaN	NaN	NaN	NaN	NaN	NaN	NaN	NaN	NaN	NaN	NaN	NaN	NaN	NaN	NaN	NaN	NaN	NaN	NaN	NaN	NaN	NaN	NaN	NaN	NaN	NaN	NaN	NaN	NaN	NaN	NaN	NaN	NaN	NaN	NaN	NaN	NaN	NaN
5.7371	NaN	NaN	NaN	NaN	NaN	NaN	NaN	NaN	NaN	NaN	NaN	NaN	NaN	NaN	NaN	NaN	NaN	NaN	NaN	NaN	NaN	NaN	NaN	NaN	NaN	NaN	NaN	NaN	NaN	NaN	NaN	NaN	NaN	NaN	NaN	NaN	NaN	NaN	NaN	NaN	NaN
5.8706	NaN	NaN	NaN	NaN	NaN	NaN	NaN	NaN	NaN	NaN	NaN	NaN	NaN	NaN	NaN	NaN	NaN	NaN	NaN	NaN	NaN	NaN	NaN	NaN	NaN	NaN	NaN	NaN	NaN	NaN	NaN	NaN	NaN	NaN	NaN	NaN	NaN	NaN	NaN	NaN	NaN
