X,Y
0.00000,39964.797
0.13342,38339.242
0.26684,39505.145
0.40027,38503.102
0.53369,38496.738
0.66711,40559.152
0.80053,39601.922
0.93395,40095.711
1.06737,40851.934
1.20080,40652.430
1.33422,39338.051
1.46764,40377.902
1.60106,39851.879
1.73448,38530.465
1.86791,37333.102
2.00133,39771.066
2.13475,39787.996
2.26817,40997.203
2.40159,43397.250
2.53502,45500.355
2.66844,58469.512
2.80186,87339.703
2.93528,104273.047
3.06870,84916.211
3.20212,61702.777
3.33555,52020.922
