0.0000	33407.0000
0.1334	33328.1250
0.2668	34610.0156
0.4003	31706.9355
0.5337	32034.9238
0.6671	32577.9004
0.8005	34458.8750
0.9340	35481.2422
1.0674	34338.3242
1.2008	33974.7383
1.3342	36770.3594
1.4676	38319.7500
1.6011	48729.4297
1.7345	75482.3828
1.8679	122010.9453
2.0013	119636.3984
2.1347	75017.0234
2.2682	51249.8750
2.4016	42775.4102
2.5350	38399.9102
2.6684	35177.3125
