0.0000	30368.5391
0.1334	29911.5098
0.2668	30977.1777
0.4003	28679.8164
0.5337	30414.9785
0.6671	32300.9473
0.8005	34906.6719
0.9340	37297.9727
1.0674	53970.7734
1.2008	77503.4766
1.3342	81098.4219
1.4676	59568.6758
1.6011	43120.4258
1.7345	37611.7148
1.8679	37282.6172
