0.0000	13947.7334
0.1334	15303.5283
0.2668	18827.9961
0.4003	23589.5391
0.5337	27454.4062
0.6671	23503.5957
0.8005	19245.2285
0.9340	17233.5586
1.0674	16327.7207
1.2008	15315.8594
1.3342	15104.5391
1.4676	15985.1240
1.6011	15956.7500
1.7345	14713.5605
1.8679	14410.2393
2.0013	14727.3037
2.1347	14578.3916
2.2682	15660.2598
2.4016	15619.5977
2.5350	16436.0859
2.6684	15012.8584
2.8019	14744.3438
2.9353	14333.0303
3.0687	14418.0859
3.2021	13986.1670
3.3355	12743.7549
3.4690	13029.1953
3.6024	12164.1670
3.7358	12259.0498
3.8692	12494.0947
4.0027	12400.1270
4.1361	12333.6357
