0.00000,12980.383
0.13342,12495.360
0.26684,13254.366
0.40027,15100.660
0.53369,14880.868
0.66711,14577.465
0.80053,13597.726
0.93395,13685.167
1.06737,13552.943
1.20080,11800.139
1.33422,12860.911
1.46764,12346.902
1.60106,13164.988
1.73448,14011.238
1.86791,14362.366
2.00133,12462.708
2.13475,12250.314
2.26817,11606.964
2.40159,11769.094
