0.00000,37452.465
0.13342,38070.133
0.26684,37933.508
0.40027,38221.484
0.53369,36997.863
0.66711,37391.105
0.80053,37851.375
0.93395,38057.680
1.06737,38014.652
1.20080,38721.793
1.33422,36693.555
1.46764,39594.730
1.60106,41975.203
1.73448,48152.402
1.86791,59848.949
2.00133,83748.391
2.13475,96777.500
2.26817,78235.922
2.40159,58948.289
2.53502,47126.973
2.66844,44391.551
