0.00000,12850.348
0.13342,12925.788
0.26684,13603.647
0.40027,15836.396
0.53369,21069.502
0.66711,26852.477
0.80053,28656.963
0.93395,22675.170
1.06737,19326.854
1.20080,18051.496
1.33422,16613.236
1.46764,15839.016
1.60106,15572.436
1.73448,14971.885
1.86791,14976.708
2.00133,15218.898
2.13475,13772.184
2.26817,12751.987
2.40159,12761.146
2.53502,12595.701
2.66844,12491.151
2.80186,12750.790
