x	Y_20180514_15338_c1_1_13g	Y_20180514_15338_c1_10_11g	Y_20180514_15338_c1_13_4g	Y_20180514_15338_c1_15_1g	Y_20180514_15338_c1_16_2g	Y_20180514_15338_c1_16_5g	Y_20180514_15338_c1_17_2g	Y_20180514_15338_c1_18_4g	Y_20180514_15338_c1_19_4g	Y_20180514_15338_c1_3_1g	Y_20180514_15338_c1_4_1g	Y_20180514_15338_c1_6_1g	Y_20180514_15338_c1_7_12g	Y_20180514_15338_c1_7_6g	Y_20180514_15338_c1_7_7g	Y_20180514_15338_c1_8_10g
0	13536.6064	14301.0928	13489.6797	14585.2002	10721.5801	14785.3916	12722.2246	12611.1064	15641.0859	15612.3779	15778.5312	9867.5381	10875.6006	12632.4297	12401.2656	13553.6104
0.1334	13978.543	13873.123	14222.9561	14519.4697	11419.4336	15413.5996	13487.0645	13253.251	16144.4961	16032.626	15691.2207	9907.9814	11620.1426	13210.1875	13250.4414	14349.9961
0.2668	15367.8848	14316.0723	14746.915	14866.1797	11730.415	15528.7861	13383.9678	14029.8564	15645.3438	16622.4531	16113.4209	10255.0088	11652.04	13050.0449	14814.8535	16359.0947
0.4003	16760.127	14225.0537	14413.8643	16856.416	13766.7695	16705.7773	13438.8438	15291.7852	15650.2773	17514.3984	16566.9688	9961.1162	12831.0498	13102.835	17635.1836	17896.8848
0.5337	16773.5352	15224.8076	14889.9072	20310.8105	14851.5918	17141.9883	14079.4551	17990.0879	15704.1387	17718.8887	17532.6758	9842.8994	13744.083	14127.5117	17389.2754	17049.4668
0.6671	16576.8398	15336.6709	17419.1953	25859.4785	15699.5859	20161.8242	13549.9355	22735.6035	15891.0156	21739.1719	17966.2422	10988.7012	14914.3223	17480.2324	17246.6797	15407.1289
0.8005	16083.5859	16087.7422	20357.9414	24895.9453	20375.2012	20723.3711	15060.251	25327.75	17451.6602	28395.9727	22132.6602	12372.875	17098.0723	20979.1973	15512.6201	13194.9033
0.934	15484.0928	20167.8633	20758.0879	21613.6992	29468.041	20601.0176	17040.3652	23478.2812	22579.5996	32518.0156	30107.1719	13309.8047	21340.7656	22205.4277	15454.8789	12494.417
1.0674	14398.7471	24153.8633	17023.1562	19606.2266	34126.0664	18053.6699	17517.3418	21970.8105	28863.5742	29432.875	32996.9609	14359.5098	23780.4609	21063.3945	15382.0684	12207.457
1.2008	13852.2676	26083.0742	14620.7041	20576.8613	30112.8613	17108.7285	17758.625	20733.8906	28731.877	23331.7012	30010.0742	15634.6387	23974.041	18376.6855	16721.4355	11770.6162
1.3342	14131.5879	21681.8906	13161.6328	21958.0781	23809.0996	15038.7979	17983.1641	18572.6211	26457.5371	22181.8711	23614.7656	15195.6084	21011.3535	18269.9668	17169.3262	12260.7578
1.4676	12855.8164	17780.0137	12613.5664	21660.4766	21227.4863	15563.2773	19733.3164	18134.6875	24541.4141	22335.6777	22852.125	15032.6699	19349.9609	18024.6875	16861.2031	12700.9697
1.6011	12734.2871	15932.9502	13149.4248	20322.7969	19242.6719	15150.2256	19288.6484	20868.5078	22787.6465	22340.2148	23121.3164	13582.208	18022.2734	19522.4082	16448.957	13855.8633
1.7345	12006.4307	16150.0596	13521.9414	19050.3555	19544.1738	14701.9385	18430.4434	21539.2832	19321.3457	20484.2012	22720.5625	12545.0635	15989.1582	19662.0352	15049.6602	14783.7246
1.8679	11988.9111	16176.1562	14600.9062	17951.0488	18433.8906	15629.2832	18241.6914	23723.8301	16558.8027	19325.6738	20762.7832	11936.2256	16200.0664	19300.6016	14304.4033	14008.2314
2.0013	12875.6602	17308.9199	15566.9893	16605.791	18190.0391	17488.4375	16256.0605	22598.0801	14411.1816	19044.5918	19551.1699	11898.4824	18519.3242	17389.3125	13207.4717	13843.3525
2.1347	13115.8125	18580.1309	16620.5625	16131.8828	17576.9141	18895.1406	14849.1855	21279.1367	14052.5488	18901.1855	19271.6289	12329.7783	16884.3457	15829.4834	12687.6406	13461.8857
2.2682	13671.3271	19846.5527	17586.9824	14956.9492	19437.8262	18299.6289	12711.418	20063.9414	NaN	21190.0176	19384.7129	12577.5332	16094.2012	15793.8174	11848.3105	13206.666
2.4016	15122.9346	21127.082	16523.6016	14590.0068	19601.5469	17325.4453	12743.5684	18937.0547	NaN	21267.4316	22068.8359	11993.2773	16760.3809	14851.9375	12780.1025	13707.9189
2.535	14729.5615	20369.4492	16325.0811	14368.1572	18924.7578	16660.4316	NaN	16555.5293	NaN	18880.1426	21476.793	11963.8965	18151.6484	13565.6211	12586.6826	13105.3574
2.6684	15181.5938	18108.3223	14921.1719	13030.4609	17356.3809	15942.7402	NaN	14145.0166	NaN	17668.2559	18770.1914	12624.4648	19775.6719	13655.8652	13126.4297	13208.2783
2.8019	14661.4258	18525.0449	15364.833	13059.8164	16143.9014	14967.7627	NaN	13691.6396	NaN	16033.6963	17688.043	12775.4727	18069.1152	12175.0752	12259.7295	13015.0625
2.9353	NaN	18414.1035	14832.3682	12909.4463	15354.2695	14056.7432	NaN	12601.583	NaN	14048.6494	16164.4951	12736.7041	18425.5625	11662.3408	12219.7334	12854.2988
3.0687	NaN	18665.6953	13610.1357	12943.0273	14018.6221	14760.5381	NaN	12829.9111	NaN	14528.748	14245.3672	11813.7588	16459.8867	11078.1709	NaN	12891.333
3.2021	NaN	20258.8398	14103.4668	NaN	13139.2178	NaN	NaN	13263.4746	NaN	14919.1299	14865.0059	11679.5488	14900.3037	11161.1807	NaN	NaN
3.3355	NaN	18553.1523	14360.8174	NaN	12549.9609	NaN	NaN	NaN	NaN	NaN	15086.8281	11155.0918	14346.3203	11128.2539	NaN	NaN
3.469	NaN	17886.8125	NaN	NaN	13460.4561	NaN	NaN	NaN	NaN	NaN	NaN	10935.8154	13474.8242	11251.877	NaN	NaN
3.6024	NaN	16949.2441	NaN	NaN	NaN	NaN	NaN	NaN	NaN	NaN	NaN	11079.9189	13997.166	NaN	NaN	NaN
3.7358	NaN	NaN	NaN	NaN	NaN	NaN	NaN	NaN	NaN	NaN	NaN	NaN	14424.7715	NaN	NaN	NaN
3.8692	NaN	NaN	NaN	NaN	NaN	NaN	NaN	NaN	NaN	NaN	NaN	NaN	NaN	NaN	NaN	NaN
4.0027	NaN	NaN	NaN	NaN	NaN	NaN	NaN	NaN	NaN	NaN	NaN	NaN	NaN	NaN	NaN	NaN
4.1361	NaN	NaN	NaN	NaN	NaN	NaN	NaN	NaN	NaN	NaN	NaN	NaN	NaN	NaN	NaN	NaN
4.2695	NaN	NaN	NaN	NaN	NaN	NaN	NaN	NaN	NaN	NaN	NaN	NaN	NaN	NaN	NaN	NaN
4.4029	NaN	NaN	NaN	NaN	NaN	NaN	NaN	NaN	NaN	NaN	NaN	NaN	NaN	NaN	NaN	NaN
4.5363	NaN	NaN	NaN	NaN	NaN	NaN	NaN	NaN	NaN	NaN	NaN	NaN	NaN	NaN	NaN	NaN
4.6698	NaN	NaN	NaN	NaN	NaN	NaN	NaN	NaN	NaN	NaN	NaN	NaN	NaN	NaN	NaN	NaN
4.8032	NaN	NaN	NaN	NaN	NaN	NaN	NaN	NaN	NaN	NaN	NaN	NaN	NaN	NaN	NaN	NaN
4.9366	NaN	NaN	NaN	NaN	NaN	NaN	NaN	NaN	NaN	NaN	NaN	NaN	NaN	NaN	NaN	NaN
5.07	NaN	NaN	NaN	NaN	NaN	NaN	NaN	NaN	NaN	NaN	NaN	NaN	NaN	NaN	NaN	NaN
5.2035	NaN	NaN	NaN	NaN	NaN	NaN	NaN	NaN	NaN	NaN	NaN	NaN	NaN	NaN	NaN	NaN
5.3369	NaN	NaN	NaN	NaN	NaN	NaN	NaN	NaN	NaN	NaN	NaN	NaN	NaN	NaN	NaN	NaN
5.4703	NaN	NaN	NaN	NaN	NaN	NaN	NaN	NaN	NaN	NaN	NaN	NaN	NaN	NaN	NaN	NaN
5.6037	NaN	NaN	NaN	NaN	NaN	NaN	NaN	NaN	NaN	NaN	NaN	NaN	NaN	NaN	NaN	NaN
5.7371	NaN	NaN	NaN	NaN	NaN	NaN	NaN	NaN	NaN	NaN	NaN	NaN	NaN	NaN	NaN	NaN
5.8706	NaN	NaN	NaN	NaN	NaN	NaN	NaN	NaN	NaN	NaN	NaN	NaN	NaN	NaN	NaN	NaN
