0.0000	14066.3574
0.1334	14145.9336
0.2668	15228.0742
0.4003	19265.6816
0.5337	22162.1367
0.6671	21373.3223
0.8005	18867.8125
0.9340	16731.9316
1.0674	15200.9053
1.2008	15693.2051
1.3342	18075.5000
1.4676	20591.7109
1.6011	19745.1602
1.7345	18596.8457
1.8679	18030.0605
2.0013	16121.5117
2.1347	14860.5068
2.2682	14648.7783
2.4016	14844.6924
2.5350	14025.4570
2.6684	14677.2637
