0.00000,12286.979
0.13342,12545.316
0.26684,13596.484
0.40027,13753.505
0.53369,15765.089
0.66711,19195.828
0.80053,19957.936
0.93395,19013.623
1.06737,20009.574
1.20080,19138.590
1.33422,18119.258
1.46764,16998.867
1.60106,15841.065
1.73448,15612.715
1.86791,14149.362
2.00133,13438.654
2.13475,13738.562
2.26817,13335.747
2.40159,13823.714
2.53502,13394.396
2.66844,13114.621
2.80186,12226.710
