0.00000,34705.316
0.13342,34835.137
0.26684,34496.891
0.40027,35951.812
0.53369,35704.484
0.66711,33897.070
0.80053,33815.441
0.93395,34070.363
1.06737,35559.566
1.20080,34952.277
1.33422,34620.992
1.46764,36101.285
1.60106,38409.500
1.73448,41964.516
1.86791,49539.801
2.00133,66447.062
2.13475,94947.719
2.26817,113170.680
2.40159,89443.766
2.53502,61970.293
