0.00000,36728.762
0.13342,37025.766
0.26684,36978.543
0.40027,38067.477
0.53369,38044.195
0.66711,37502.512
0.80053,37971.590
0.93395,36567.188
1.06737,37431.699
1.20080,36785.305
1.33422,36754.926
1.46764,37472.156
1.60106,37462.586
1.73448,35043.832
1.86791,33887.168
2.00133,34955.254
2.13475,36107.043
2.26817,38472.887
2.40159,41574.949
2.53502,51513.496
2.66844,72209.992
2.80186,86592.812
2.93528,77932.875
3.06870,60840.395
3.20212,51955.352
3.33555,46741.457
3.46897,42515.863
