0.00000,14132.433
0.13342,15253.182
0.26684,17416.084
0.40027,19811.564
0.53369,20919.787
0.66711,23422.729
0.80053,22678.119
0.93395,21733.619
1.06737,20318.201
1.20080,19892.023
1.33422,18152.479
1.46764,16966.906
1.60106,15865.004
1.73448,15767.723
1.86791,14324.714
2.00133,13224.831
2.13475,12557.942
2.26817,13282.226
2.40159,12809.535
