0.00000,37078.012
0.13342,36790.562
0.26684,37164.273
0.40027,36314.746
0.53369,37149.711
0.66711,37765.441
0.80053,38898.254
0.93395,37624.645
1.06737,37529.625
1.20080,39781.043
1.33422,47201.000
1.46764,63620.863
1.60106,96520.312
1.73448,124267.148
1.86791,109769.109
2.00133,70012.297
2.13475,50407.754
2.26817,42408.633
2.40159,39223.676
