x	Y_20180514_15325_1_5g	Y_20180514_15325_10_5g	Y_20180514_15325_10_6g	Y_20180514_15325_11_1g	Y_20180514_15325_12_1g	Y_20180514_15325_12_2g	Y_20180514_15325_12_5g	Y_20180514_15325_12_6g	Y_20180514_15325_12_7g	Y_20180514_15325_14_1g	Y_20180514_15325_15_3g	Y_20180514_15325_16_3g	Y_20180514_15325_16_5g	Y_20180514_15325_16_6g	Y_20180514_15325_17_10g	Y_20180514_15325_17_1g	Y_20180514_15325_17_8g	Y_20180514_15325_18_1g	Y_20180514_15325_18_4g	Y_20180514_15325_19_9g	Y_20180514_15325_2_5g	Y_20180514_15325_20_2g	Y_20180514_15325_21_2g	Y_20180514_15325_22_5g	Y_20180514_15325_24_1g	Y_20180514_15325_24_2g	Y_20180514_15325_25_5g	Y_20180514_15325_25_6g	Y_20180514_15325_27_2g	Y_20180514_15325_27_7g	Y_20180514_15325_28_1g	Y_20180514_15325_28_3g	Y_20180514_15325_28_7g	Y_20180514_15325_29_3g	Y_20180514_15325_3_7g	Y_20180514_15325_31_3g	Y_20180514_15325_31_4g	Y_20180514_15325_4_3g	Y_20180514_15325_5_1g	Y_20180514_15325_5_2g	Y_20180514_15325_7_7g	Y_20180514_15325_8_3g	Y_20180514_15325_8_4g	Y_20180514_15325_9_8g
0	33277.6328	34620.0703	33470.6367	29416.6543	33422.5742	34374.5703	33154.5273	32227.0996	29607.5312	33593.1523	36647.8984	34029.2266	34830.9414	29386.2949	29733.4023	29910.3223	34279.9336	28988.2441	34918.1367	33273.7578	32924.0742	37519.9883	31650.5879	35890.7305	32209.1621	35753.0977	35891.3398	35142.8086	35376.1094	30808.793	31093.7168	28605.1387	32305.1992	33598.1641	34992.5977	35071.7227	32326	32482.0449	31800.2969	33458.3867	31759.293	32615.6875	34943.1367	34241.9062
0.1334	33484.7266	33457.168	33278.9141	29614.2578	33625.7734	34791.9727	34090.6172	32728.9102	29340.541	33451.1445	36352.5078	33938.1367	35083.0195	30198.5391	30059.4824	29064.8066	35842.4297	28493.8848	35011.2617	32281.8457	32613.5371	35591.2305	31469.752	34660.1953	33608.6328	37233.6758	35378.4453	35896.5273	33745.6211	32175.582	31804.4199	28558.0039	32243.168	34003.1211	34643.375	34078.9492	31842.248	33015.9375	32566.6016	32232.1465	32449.3398	31513.375	34267.4688	31424.2656
0.2668	33062.3047	32556.7012	32631.752	30353.9922	33073.8828	35156.1211	32989.543	32751.4707	31877.0645	33139.1445	36388.0547	34772.9141	32514.1035	29529.4941	31247.7324	29206.2715	35738.5781	27495.8965	35327.5586	31977.2266	33884.3008	35423.9727	31761.2227	34656.75	33421.0977	38337.3203	35237.8125	34650.6211	34834.8359	30808.5723	32693.7051	29181.8965	33272.0703	34565.4414	34301.5	34332.3867	31844.25	33291.7812	32664.6465	34472.9727	31847.5	32091.5977	34933.5391	31927.3535
0.4003	31682.8008	34191.3867	33609.8828	29701.5879	33785.1641	33637.332	33507.3047	33203.6094	31260.0156	33573.1445	35115.3125	32148.4883	34358.5391	29495.7305	32130.4824	29386.9844	35803.3164	26944.7832	35332.9688	33639.1328	33699.9688	34105.957	31265.0957	33925.0117	33365.1719	36779.6719	35405.2422	37286.4453	34454.5938	30911.8438	30683.123	28490.5762	32034.1562	35080.8438	33957.457	36186.6523	31986.4902	32619.6484	32811.6562	32580.7148	31904.6934	31998.6289	33049.3359	31402.1934
0.5337	31716.8086	33836.375	34273.5234	32600.248	35994.1445	34071.125	33406.2305	32711.6621	31735.584	32837.9375	36089.7383	33720.8359	34872.8242	29153.0879	31062.2188	30074.1074	35290.8438	26814.373	34416.3008	32042.7305	33008.582	34306.3906	34218.125	34180.3828	33320.4297	35756.0781	36261.8438	36156.0234	34583.2305	31807.2578	32475.4297	30805.0176	32201.3418	33853.2188	33823.1211	36217.5664	32702.7441	33140.5391	31778.7598	33375.6719	32257.9141	32437.7891	33458.9922	31967.3926
0.6671	32343.6406	33837.3477	35042.293	30153.6309	35233.8789	33841.957	33603	32924.957	31066.3945	34014.1992	35022.7812	32595.4727	35705.7969	30861.6152	31011.3438	30538.1797	34708.1133	26181.2441	33200.6562	31754.918	33062.3516	33746.6406	32860	34625.9766	34657.0664	36323.9297	36758.3672	36993.1133	35390.6797	31014.2363	30551.2344	30985.3008	32703.5195	34794.7539	32994.5	36883.6172	32703.5938	32721.3145	33307.9766	32642.5039	32762.5938	32840.4883	34610.9023	31323.4316
0.8005	32941.9336	33668.2031	33740.1992	29937.6445	36181.3711	33954.0664	32793.2109	33515.7812	31097.1348	33094.9453	35541.2734	31599.4023	35969.418	31532.7188	30862.8223	30080.9688	36199.6875	27224.0371	32771.793	32923.4688	33950.6406	34098.0273	33524.0273	34278.1445	32589.5039	36767.5273	36794.5781	36477.3711	34819.0938	32657.6035	30040.666	30129.9355	33935.0781	34159.1016	33242.418	36088.4023	32263.2422	32582.8828	32590.6172	32482.8867	33404.5312	34381.0508	34004.418	31512.7754
0.934	32592.6465	34870.8828	32565.1406	29543.8906	34531.4258	34459.0742	30973.9297	33405.8125	32404.4766	32934.5	34870.7422	31595.5176	34989.043	31590.9844	31307.6816	30176.2422	35333.0625	27321.3164	33229.5156	32201.791	31987.8184	34641.8633	33239.9922	34625.1992	32551.8047	37804.0898	34142.2812	35350.7266	36659.4844	32038.2715	30785.2539	31078.1582	32104.0098	32633.5371	34330.7383	36224.1641	31991.0156	32565.2129	31632.2168	32509.9277	34193.8281	34030.082	33865.9102	32208.0898
1.0674	33441.1875	33600.4258	31965.4355	30500.8965	36045.918	34147.7891	31688.123	35002.5273	31299.6582	32764.6738	33860.2227	32399.0605	35608.4922	29623.8594	32619.4512	31001.0918	36433.2344	27920.3496	33619.2188	32730.1172	32618.1074	34138.6875	34382.6797	33933.9648	30979.6133	39306.875	37026.957	35384.5391	36539.8477	31010.9629	30168.3789	31028.0215	33766.7969	33301.2812	32629.6523	35706.582	32765.5918	34235.6641	30790.0449	33033.3594	32091.377	32891.1484	36629.75	33037.3203
1.2008	33020.8203	33664.957	32837.8633	28639.4258	36096.7109	34711.8711	32678.0664	32694.0645	31046.3594	32063.1016	34769.5352	32623.4238	35478.3945	30775.7656	32655.8203	30932.957	33623.1953	27049.6934	32296.0762	33624.4922	32035.7031	35865.457	34749.9219	35431.4648	32062.7676	40396.7227	35433.9531	33554.7266	35675.418	31509.7656	30696.9648	32397.4844	33493.3438	32895.207	32281.9434	34671.6758	33904.2109	32597.4883	30190.6582	31920.6719	33460.7852	33940.4688	36467.3555	31252.9883
1.3342	32150.5605	34503.2148	33244.832	31116.5879	35235.8242	33741.6289	34591.6172	33459.2227	30287.293	31598.1992	33696.4844	30976.3574	36876.4297	30966.4805	32706.8496	29344.2441	35885.7969	26336.1758	33742.2695	34338.707	32835.0391	34037.5859	34513.5	35145.0078	33166.4375	38357.0469	36965.0938	33449.7148	36393.8008	32527.8945	29755.1133	28642.3105	34814.7461	34653.3672	33550.3711	35994.6992	33300.7695	33504.4102	30038.1816	32400.1348	33591.7305	32255.1797	35621.7617	31310.0859
1.4676	31746.7617	32330.0859	32865.1953	30453.75	34504.832	35227.4609	33381.3359	33176.9062	29899.623	32232.5137	32753.3672	31390.041	37315.0859	29334.6035	31952.4297	29273.1797	34267.6797	27315.0195	32862.9023	34325.1406	33608.6953	34779.5977	34290.4844	35645.8867	33541.168	38314.3398	35300.207	33870.7852	35448.3945	33263.1523	30238.4258	29639.7422	33980.9766	34151.0703	32936.6133	35127.4922	34495.6289	32123.3477	28682.959	33139.1641	33482.8164	34581.0508	34890.9727	29873.9062
1.6011	33373.7656	31961.2246	33338.8359	29756.4551	34043.3555	34833.1836	31595.2891	31659.6543	31113.4922	32810.3828	34474.375	32976.9844	36608.0586	30491.9941	32592.3418	30312.4824	34483.8906	27017.1953	33287.9688	33578.7734	33204.9141	34243.3828	34176.8633	34329.3047	33780.3906	38001.8906	36793.6016	33327.4883	36339.9297	32106.4609	30243.416	30764.8105	36313.8008	33622.9062	31807.6172	34234.3594	34798.5273	31637.5156	29016.9121	32694.0332	34537.3906	33970.4023	35685.9219	32786.1289
1.7345	34198.543	34168.0898	33154.0508	30313.2266	34900.8203	34864.6094	31756.834	35131.1367	31479.4785	32824.0977	33321.3125	33362.9883	37823.9023	30274.9785	32292.959	29197.7227	35331.2383	27708.9531	32362.8535	36163.875	33618.0586	34425.0195	36456.6484	34825.5586	34642.2852	38993.875	37140.6445	34429.0117	35572.1445	32580.1211	29724.334	31395.0996	35197.9375	33977.418	32689.5391	35206.707	33785.7266	32312.0547	30677.9785	32319.0547	34320.168	35708.4648	38190.3633	29345.541
1.8679	33701.0977	34882.8711	31860.7852	31091.3203	33464.9297	34625.6055	31099.2324	34305.457	31073.0098	34398.8711	34576.4414	33484.8516	40427.2773	29305.0762	31138.4395	31822.166	34564.3438	27383.584	32880.3555	40765.4766	37590.4961	33480.1914	40034.0703	34443	35489.0742	39155.5195	35814.1836	35566.832	36055.5859	32588.7129	31041.5137	31448.7793	34660.8945	33643.5625	34254.2422	33514.9258	35176.1055	33463.8242	32790.207	31330.8262	34557.2422	37792.8828	37160.4492	31531.4883
2.0013	34702.2891	34889.6562	33233.2812	34567.0977	34394.1875	34532.6758	31994.0137	35745.1953	32507.6035	34391.5195	36186.7383	34209.8594	39805.8008	29132.5938	33044.7383	30612.1367	33923.3672	27524.3906	34867.9453	50391.9219	44348.9531	34364.3125	40319.7734	34723.0703	39901.4062	40007.918	36188.2773	35653.0898	38033.8203	32411.1719	32884.3672	31113.9492	33942.8086	34224.7734	34772.8438	35344.9258	38599.2969	35594.2148	34960.6406	32017.2148	35071.043	42783.3438	38937.4141	32913.8125
2.1347	36868.3555	36343.1602	36885.4453	41409.6211	34535.0352	34580.4727	32554.8086	38293.4844	32755.3867	42019.5547	36621.5117	34944.4648	43345.5898	29687.9375	33255.3828	29916.2383	33607.0938	28857.8535	35503.5625	74118.9062	65520.2031	33981.8281	47444.2773	37080.4961	45684.8789	40104.6133	37614.9805	36126.8477	40679.5352	33084.7227	34016.7695	34148.6328	34887.3672	34991.8398	37309.2812	36402.2461	41974.6836	34607.9805	42019.2305	32219.3008	35033.5625	55821.9492	41071.8125	38500.6641
2.2682	37356.6562	39211.3008	43107.1172	58192.5703	33896.6367	35290.1094	32455.0312	47066.543	35765.4336	59253.875	40663.5	36833.8711	51881.1055	30246.8281	38827.8906	31209.7422	36304.2188	31564.8965	39713.5703	119462.5391	98688.5	34606.0547	64837.1289	39474.8789	64144.0859	42266.4727	39403.5898	36543.1875	44936.4453	34502.1836	38075.1797	38415.7031	35639.75	37803.2539	44658.9883	36845.3984	51095.125	34771.9336	59210.2266	35427.3867	37998.1797	76845.5	50959.3242	51543.3398
2.4016	40534.5312	46715.2031	54871.9727	77695.2734	35850.3359	37320.1914	35477.7383	66499.5859	41254.6484	95974.7031	54118.6172	41768.5273	58926.8594	30003.4883	54292.9844	36262.293	38928.832	38356.3633	49836.5156	155498.75	116871.5	39264.5391	107065.9922	42941.2109	99359.6719	46756.8164	42180.0352	38958.7227	58161.625	36262.7188	52652.0273	47315.0469	35006.2891	45236.1602	67162.4531	40876.4648	76230.9141	37834.2852	88963.9844	37840.4258	43016.0977	81787.3281	75029.4375	75967.125
2.535	47366.2891	62382.3008	81814.5469	72057.7734	43324.5039	44606.7383	38630.2852	100404.7812	60044.0352	116463.3828	84364.1172	59552.5312	65220.9531	32161.4336	84139.6406	47879.6953	48171.5	55845.5977	68870.4375	131863.1719	88087.8984	46935.625	135150.4844	59374.707	114376.375	57540.668	48494.1172	42808.3789	82353.4375	43587.6172	79475.125	66337.6094	39256.8125	51859.7695	108914.8125	53824.6836	96896.4531	41927.7422	107401.1016	48772.9766	56915.0469	61723.2891	126807.1719	91143.6562
2.6684	46420.2383	87581.6016	99859.3828	52263.7578	55669.5195	59926.0781	45957.6172	103407.5078	83033.8359	92326.7578	108768.3125	80967.0703	67909.1406	38386.9883	105448.3359	76152.3672	52958.1719	78839.7188	78661.9688	77885.6016	58567.2188	65229.1875	100436.4297	81204.75	87123.8984	86912.6875	65874.625	54523.1992	86767.1797	62990.3945	90740.9297	71113.9375	44247.1992	51797.6836	145880.375	85341.1016	81879.7109	60569.1211	78246.1562	67506.7344	88610.3359	45125.4258	171432	66696.2969
2.8019	39185.6797	83477.2656	79711.3828	40080.5195	78805.5625	96978.4766	57801.6367	73794.1953	86172.6094	57516.7266	99807.3906	81666.3047	58504.2266	53531.3516	92671.3203	105128.0625	46894.6914	74053.4531	61876.8945	47805.4102	46206.7969	84484.625	65233.6445	85545.2188	63385.6836	142760.1719	98428.5234	73557.8984	65871.2734	85596.8125	75690.6562	54360.8516	62417.1562	44435.9062	124681.7656	135942.8125	54672.1211	78714.3594	51879.1211	88715.6406	103171.6094	38104.7383	159498.1562	44762.3867
2.9353	33527.9453	60135.4805	54722.7461	NaN	75566.3984	141662.8906	63069.2891	51732.625	62883.1602	43712.7031	77186.9844	60722.5703	47852.3398	68687.4219	58735.3672	86712.8125	39758.6836	51133.5391	46381.7539	38066.0977	38309.5273	79634	49631.0195	62095.8555	52877.7227	194316.4844	105038.2109	85346.25	46514.2227	77678.3047	50130.9766	41999.5586	100403.75	40036.4531	80280.8828	141974.8594	41886.9883	72075.3672	40064.3828	79082.2188	79097.6406	NaN	102306.6562	37903.3242
3.0687	NaN	46104.7734	41898.9258	NaN	56079.3555	126429.2422	53743.0938	43182.7852	NaN	36958.9805	NaN	42573.5156	42293.4609	63620.6367	45238.2617	57805.2305	36091.4805	34762.2383	39762.9961	35746.3125	36689.4297	56414.2812	42005.9961	44999.4258	41892.8242	167793.6406	76930.3828	68357.7188	40389.0625	55748.043	39222.1836	38528.832	128275.2734	NaN	53877.6875	93894.7109	36647.1719	53297.957	36909.0234	53153.0938	51356.3477	NaN	NaN	34854.7422
3.2021	NaN	38563.8984	38772.3555	NaN	41975.832	81521.3516	41013.0234	38920.5234	NaN	34174.5703	NaN	37118.9961	40503.9336	48298.3281	NaN	45213.0625	35247.1992	NaN	35759.9688	NaN	34290.6719	42942.5312	42299.832	NaN	35541.1484	100045.2344	51005.4961	49393.7422	37270.1836	43973.7695	37374.5664	NaN	107086.7031	NaN	42764.1406	60594.2383	36399.8203	39380.3633	NaN	38681.1562	38443.5781	NaN	NaN	NaN
3.3355	NaN	37563.8164	NaN	NaN	40723.4141	52390.6953	35901.1914	NaN	NaN	NaN	NaN	37018.9531	NaN	40079.7344	NaN	NaN	NaN	NaN	35421.9883	NaN	33887.2305	36658.2852	38573.332	NaN	33690.9023	56584.8008	NaN	41555.9961	NaN	36983.5625	35010.7109	NaN	66867.4844	NaN	NaN	45052.3906	37860.9648	37534.3984	NaN	26287.4688	NaN	NaN	NaN	NaN
3.469	NaN	37103.457	NaN	NaN	40255.0586	42259.1133	34552.9258	NaN	NaN	NaN	NaN	NaN	NaN	34042.7969	NaN	NaN	NaN	NaN	35060.6797	NaN	34025.8789	35744.875	NaN	NaN	34012.5625	44656.2109	NaN	37953.168	NaN	35959.4727	34017.0273	NaN	47023.7969	NaN	NaN	39098.5977	NaN	36225.3867	NaN	NaN	NaN	NaN	NaN	NaN
3.6024	NaN	36706.9492	NaN	NaN	NaN	38305.2344	35383.7539	NaN	NaN	NaN	NaN	NaN	NaN	31807.332	NaN	NaN	NaN	NaN	NaN	NaN	NaN	34170.8164	NaN	NaN	32782.918	NaN	NaN	NaN	NaN	NaN	NaN	NaN	41534.0195	NaN	NaN	37813.5391	NaN	36520.1016	NaN	NaN	NaN	NaN	NaN	NaN
3.7358	NaN	NaN	NaN	NaN	NaN	36132.8047	35470.5273	NaN	NaN	NaN	NaN	NaN	NaN	NaN	NaN	NaN	NaN	NaN	NaN	NaN	NaN	33051.1797	NaN	NaN	32903.6172	NaN	NaN	NaN	NaN	NaN	NaN	NaN	41258.1719	NaN	NaN	NaN	NaN	NaN	NaN	NaN	NaN	NaN	NaN	NaN
3.8692	NaN	NaN	NaN	NaN	NaN	NaN	36435.9023	NaN	NaN	NaN	NaN	NaN	NaN	NaN	NaN	NaN	NaN	NaN	NaN	NaN	NaN	NaN	NaN	NaN	32736.0547	NaN	NaN	NaN	NaN	NaN	NaN	NaN	41493.7227	NaN	NaN	NaN	NaN	NaN	NaN	NaN	NaN	NaN	NaN	NaN
4.0027	NaN	NaN	NaN	NaN	NaN	NaN	NaN	NaN	NaN	NaN	NaN	NaN	NaN	NaN	NaN	NaN	NaN	NaN	NaN	NaN	NaN	NaN	NaN	NaN	NaN	NaN	NaN	NaN	NaN	NaN	NaN	NaN	38888.207	NaN	NaN	NaN	NaN	NaN	NaN	NaN	NaN	NaN	NaN	NaN
4.1361	NaN	NaN	NaN	NaN	NaN	NaN	NaN	NaN	NaN	NaN	NaN	NaN	NaN	NaN	NaN	NaN	NaN	NaN	NaN	NaN	NaN	NaN	NaN	NaN	NaN	NaN	NaN	NaN	NaN	NaN	NaN	NaN	NaN	NaN	NaN	NaN	NaN	NaN	NaN	NaN	NaN	NaN	NaN	NaN
4.2695	NaN	NaN	NaN	NaN	NaN	NaN	NaN	NaN	NaN	NaN	NaN	NaN	NaN	NaN	NaN	NaN	NaN	NaN	NaN	NaN	NaN	NaN	NaN	NaN	NaN	NaN	NaN	NaN	NaN	NaN	NaN	NaN	NaN	NaN	NaN	NaN	NaN	NaN	NaN	NaN	NaN	NaN	NaN	NaN
4.4029	NaN	NaN	NaN	NaN	NaN	NaN	NaN	NaN	NaN	NaN	NaN	NaN	NaN	NaN	NaN	NaN	NaN	NaN	NaN	NaN	NaN	NaN	NaN	NaN	NaN	NaN	NaN	NaN	NaN	NaN	NaN	NaN	NaN	NaN	NaN	NaN	NaN	NaN	NaN	NaN	NaN	NaN	NaN	NaN
4.5363	NaN	NaN	NaN	NaN	NaN	NaN	NaN	NaN	NaN	NaN	NaN	NaN	NaN	NaN	NaN	NaN	NaN	NaN	NaN	NaN	NaN	NaN	NaN	NaN	NaN	NaN	NaN	NaN	NaN	NaN	NaN	NaN	NaN	NaN	NaN	NaN	NaN	NaN	NaN	NaN	NaN	NaN	NaN	NaN
4.6698	NaN	NaN	NaN	NaN	NaN	NaN	NaN	NaN	NaN	NaN	NaN	NaN	NaN	NaN	NaN	NaN	NaN	NaN	NaN	NaN	NaN	NaN	NaN	NaN	NaN	NaN	NaN	NaN	NaN	NaN	NaN	NaN	NaN	NaN	NaN	NaN	NaN	NaN	NaN	NaN	NaN	NaN	NaN	NaN
4.8032	NaN	NaN	NaN	NaN	NaN	NaN	NaN	NaN	NaN	NaN	NaN	NaN	NaN	NaN	NaN	NaN	NaN	NaN	NaN	NaN	NaN	NaN	NaN	NaN	NaN	NaN	NaN	NaN	NaN	NaN	NaN	NaN	NaN	NaN	NaN	NaN	NaN	NaN	NaN	NaN	NaN	NaN	NaN	NaN
4.9366	NaN	NaN	NaN	NaN	NaN	NaN	NaN	NaN	NaN	NaN	NaN	NaN	NaN	NaN	NaN	NaN	NaN	NaN	NaN	NaN	NaN	NaN	NaN	NaN	NaN	NaN	NaN	NaN	NaN	NaN	NaN	NaN	NaN	NaN	NaN	NaN	NaN	NaN	NaN	NaN	NaN	NaN	NaN	NaN
5.07	NaN	NaN	NaN	NaN	NaN	NaN	NaN	NaN	NaN	NaN	NaN	NaN	NaN	NaN	NaN	NaN	NaN	NaN	NaN	NaN	NaN	NaN	NaN	NaN	NaN	NaN	NaN	NaN	NaN	NaN	NaN	NaN	NaN	NaN	NaN	NaN	NaN	NaN	NaN	NaN	NaN	NaN	NaN	NaN
5.2035	NaN	NaN	NaN	NaN	NaN	NaN	NaN	NaN	NaN	NaN	NaN	NaN	NaN	NaN	NaN	NaN	NaN	NaN	NaN	NaN	NaN	NaN	NaN	NaN	NaN	NaN	NaN	NaN	NaN	NaN	NaN	NaN	NaN	NaN	NaN	NaN	NaN	NaN	NaN	NaN	NaN	NaN	NaN	NaN
5.3369	NaN	NaN	NaN	NaN	NaN	NaN	NaN	NaN	NaN	NaN	NaN	NaN	NaN	NaN	NaN	NaN	NaN	NaN	NaN	NaN	NaN	NaN	NaN	NaN	NaN	NaN	NaN	NaN	NaN	NaN	NaN	NaN	NaN	NaN	NaN	NaN	NaN	NaN	NaN	NaN	NaN	NaN	NaN	NaN
5.4703	NaN	NaN	NaN	NaN	NaN	NaN	NaN	NaN	NaN	NaN	NaN	NaN	NaN	NaN	NaN	NaN	NaN	NaN	NaN	NaN	NaN	NaN	NaN	NaN	NaN	NaN	NaN	NaN	NaN	NaN	NaN	NaN	NaN	NaN	NaN	NaN	NaN	NaN	NaN	NaN	NaN	NaN	NaN	NaN
5.6037	NaN	NaN	NaN	NaN	NaN	NaN	NaN	NaN	NaN	NaN	NaN	NaN	NaN	NaN	NaN	NaN	NaN	NaN	NaN	NaN	NaN	NaN	NaN	NaN	NaN	NaN	NaN	NaN	NaN	NaN	NaN	NaN	NaN	NaN	NaN	NaN	NaN	NaN	NaN	NaN	NaN	NaN	NaN	NaN
5.7371	NaN	NaN	NaN	NaN	NaN	NaN	NaN	NaN	NaN	NaN	NaN	NaN	NaN	NaN	NaN	NaN	NaN	NaN	NaN	NaN	NaN	NaN	NaN	NaN	NaN	NaN	NaN	NaN	NaN	NaN	NaN	NaN	NaN	NaN	NaN	NaN	NaN	NaN	NaN	NaN	NaN	NaN	NaN	NaN
5.8706	NaN	NaN	NaN	NaN	NaN	NaN	NaN	NaN	NaN	NaN	NaN	NaN	NaN	NaN	NaN	NaN	NaN	NaN	NaN	NaN	NaN	NaN	NaN	NaN	NaN	NaN	NaN	NaN	NaN	NaN	NaN	NaN	NaN	NaN	NaN	NaN	NaN	NaN	NaN	NaN	NaN	NaN	NaN	NaN
