0.00000,13644.715
0.13342,14057.099
0.26684,14628.791
0.40027,17345.717
0.53369,18950.580
0.66711,20285.068
0.80053,19065.057
0.93395,17853.254
1.06737,18702.553
1.20080,18585.139
1.33422,18914.232
1.46764,17586.861
1.60106,16868.883
1.73448,15896.506
1.86791,14179.800
2.00133,13258.918
2.13475,12435.240
2.26817,12960.733
2.40159,12612.697
