0.00000,34607.242
0.13342,34370.094
0.26684,33758.781
0.40027,33176.516
0.53369,34472.410
0.66711,35685.125
0.80053,34290.746
0.93395,34179.438
1.06737,34160.418
1.20080,35239.570
1.33422,35715.004
1.46764,39853.336
1.60106,46805.074
1.73448,64025.219
1.86791,78302.141
2.00133,67612.172
2.13475,49572.754
