0.0000	17130.3066
0.1334	18622.1133
0.2668	21271.0215
0.4003	23115.1992
0.5337	25304.3613
0.6671	24246.6230
0.8005	19793.5801
0.9340	16846.8320
1.0674	15140.4746
1.2008	14857.2920
1.3342	15358.0527
1.4676	16572.7168
1.6011	20137.6895
1.7345	21322.2715
1.8679	19824.9043
2.0013	16841.4961
2.1347	15865.1094
2.2682	15331.2031
2.4016	14763.8184
2.5350	15029.3838
