x	Y_20180130_15109_1_7g	Y_20180130_15109_10_7g	Y_20180130_15109_11_2g	Y_20180130_15109_11_4g	Y_20180130_15109_11_6g	Y_20180130_15109_12_15g	Y_20180130_15109_13_4g	Y_20180130_15109_13_7g	Y_20180130_15109_14_11g	Y_20180130_15109_14_1g	Y_20180130_15109_14_3g	Y_20180130_15109_14_4g	Y_20180130_15109_15_10g	Y_20180130_15109_15_12g	Y_20180130_15109_15_3g	Y_20180130_15109_16_5g	Y_20180130_15109_16_6g	Y_20180130_15109_17_10g	Y_20180130_15109_17_2g	Y_20180130_15109_17_8g	Y_20180130_15109_18_1g	Y_20180130_15109_18_7g	Y_20180130_15109_19_11g	Y_20180130_15109_19_12g	Y_20180130_15109_19_13g	Y_20180130_15109_19_3g	Y_20180130_15109_19_8g	Y_20180130_15109_2_1g	Y_20180130_15109_2_2g	Y_20180130_15109_21_2g	Y_20180130_15109_21_9g	Y_20180130_15109_22_11g	Y_20180130_15109_22_15g	Y_20180130_15109_22_1g	Y_20180130_15109_22_7g	Y_20180130_15109_23_2g	Y_20180130_15109_23_4g	Y_20180130_15109_23_5g	Y_20180130_15109_23_6g	Y_20180130_15109_24_4g	Y_20180130_15109_25_12g	Y_20180130_15109_25_3g	Y_20180130_15109_25_4g	Y_20180130_15109_25_6g	Y_20180130_15109_26_10g	Y_20180130_15109_26_7g	Y_20180130_15109_26_9g	Y_20180130_15109_27_1g	Y_20180130_15109_27_2g	Y_20180130_15109_27_3g	Y_20180130_15109_28_4g	Y_20180130_15109_28_7g	Y_20180130_15109_3_4g	Y_20180130_15109_30_3g	Y_20180130_15109_31_3g	Y_20180130_15109_31_4g	Y_20180130_15109_31_5g	Y_20180130_15109_31_6g	Y_20180130_15109_32_1g	Y_20180130_15109_32_5g	Y_20180130_15109_33_1g	Y_20180130_15109_33_2g	Y_20180130_15109_33_4g	Y_20180130_15109_33_5g	Y_20180130_15109_34_6g	Y_20180130_15109_34_7g	Y_20180130_15109_35_6g	Y_20180130_15109_35_9g	Y_20180130_15109_36_5g	Y_20180130_15109_36_6g	Y_20180130_15109_37_5g	Y_20180130_15109_37_7g	Y_20180130_15109_37_9g	Y_20180130_15109_38_3g	Y_20180130_15109_38_4g	Y_20180130_15109_38_6g	Y_20180130_15109_39_4g	Y_20180130_15109_4_4g	Y_20180130_15109_40_7g	Y_20180130_15109_41_4g	Y_20180130_15109_41_6g	Y_20180130_15109_5_2g	Y_20180130_15109_5_4g	Y_20180130_15109_6_3g	Y_20180130_15109_6_4g	Y_20180130_15109_7_10g	Y_20180130_15109_7_11g	Y_20180130_15109_7_3g	Y_20180130_15109_7_4g	Y_20180130_15109_7_9g	Y_20180130_15109_8_1g	Y_20180130_15109_8_4g	Y_20180130_15109_8_8g	Y_20180130_15109_8_9g	Y_20180130_15109_9_4g	Y_20180130_15109_9_7g
0	36186.047	35617.902	33206.793	34264.434	32614.615	37861.777	40479.191	36670.355	38338.832	36081.254	34169.973	37172.605	31735	34125.926	30724.576	36607.621	36392.441	33921.664	33364.363	37669.203	29014.65	37837.961	37931.57	36816.676	33576.852	36381.562	38605.309	36233.508	36085.395	31134.396	40475.645	39249.598	31224.676	36721.621	32053.986	37595.508	34063.898	33412.035	33759.727	36744.254	31738.672	40735.465	39605.898	34443.922	32921.512	40053.379	37223.773	31777.527	31239.967	36945.312	32606.592	37706.441	35033.938	35466.027	36760.664	37768.613	36275.391	38581.797	39751.512	37424.754	35177.66	32952.301	35642.543	38437.223	34519.52	38113.648	31254.029	34719.395	35185.051	37745.41	36746.789	37678.125	33807.734	35218.07	36165.07	39973.602	35116.5	32987.281	36637.586	35402.273	36698.129	37369.027	37505.133	39897.309	30786.459	36669.23	34355.801	34705.316	33455.922	36904.969	33921.094	36376.742	38824.355	36634.488	37983.801	35402.156
0.1334	35606.246	36442.043	34313.578	33117.602	32542.252	40099.043	40212.555	37152.176	36387.34	35088.887	34810.434	37155.277	32365.152	33680.406	31787.439	35948.836	38365.379	34899.238	32905.535	38932.402	28661.924	38939.953	38229.113	37553.895	34518.402	37126.152	39368.109	35851.035	34951.59	30249.391	39014.289	39201.137	30687.895	36409.648	32758.533	38925.707	35066.348	35103.879	34126.82	37189.551	31707.488	40216.25	38961.555	35499.512	33656.77	39946.766	37045.953	32984.332	30409.406	35925.023	31199.156	38298.578	36060.395	35588.59	37643.832	37274.156	36329.195	38213.289	39230.961	39319.211	35193.617	32520.643	36619.352	37514.184	35971.633	37920.109	30218.617	34067.891	34064.512	36567.125	37892.699	38136.816	32835.91	35629.73	35808.309	38061.109	35995.594	34332.98	37355.77	37556.984	37260.879	37080.039	37187.336	37948.605	30192.611	34709.855	34160.676	34835.137	32116.174	37325.371	33380.387	34833.602	37078.543	38174.43	40513.879	36123.312
0.2668	36304.91	35900.375	34221.676	34930.254	34762.215	37650.27	40804.668	36989.395	37264.336	35676.766	35606.125	35245.367	32669.207	32415.049	31627.426	36511.172	38700.152	34710.059	35305.508	38545.891	28721.445	38039.02	40238.715	36213.152	35599.547	35053.789	39280.355	35954.664	35727.402	30383.65	37507.586	38981.172	32676.102	37531.559	31142.596	36780.566	34361.273	35131.324	34869.371	35632.121	31038.553	42057.551	41453.035	34906.734	32485.594	37995.789	36792.02	32057.596	29552.865	36196.812	31578.73	39531.918	34533.207	34864.273	38502.648	36874.617	35801.887	39553.809	40962.422	37871.434	33805.895	33027.805	38144.914	38083.91	36400.27	36710.203	31956.049	34488.082	33786.598	35879.152	38800.137	36859.941	33257.535	33617.531	34925.027	40165.078	34766.777	34222.801	35512.074	35977.117	37554.883	36607.766	38772.602	39815.605	30381.246	33905.102	34295.82	34496.891	33690.082	36476.688	33926.547	35364.078	38731.844	36998.258	38621.309	35501.945
0.4003	35119.859	36452.051	34082.277	34713.32	33167.258	37170.074	39130.223	36820.074	39195.352	34584.402	34691.945	38190.734	33096.531	33569.402	32453.805	36304.734	38114.406	34750.008	34683.266	37681.742	27864.98	37458.219	38045.516	35942.535	35152.832	35420.934	39458.676	37127.57	35824.672	30117.23	38531.586	38657.48	31377.096	37609.492	30462.537	36184.59	35536.699	34357.867	36480.48	37903.535	32143.584	38067.09	40527.371	34511.57	34488.801	38381.344	36158.844	32226.547	29804.992	36197	32353.734	40841.895	35261.242	37035.672	37438.203	35720.578	35890.43	40066.02	39058.977	37666.707	32829.422	31272.814	36562.547	36730.492	35951.672	36829.863	32330.926	35130.375	33864.297	35661.555	38019.766	37740.934	33333.016	34186.367	36537.535	39452.797	35443.219	33778.789	37134.027	35889.246	38196.062	37768.188	38201.84	39903.434	31026.549	33595.98	33692.25	35951.812	33350.586	34787.281	35216.039	34545.395	38703.488	37054.406	41668.258	36922.004
0.5337	36584.688	35056.586	34272.195	34487.148	33871.746	39131.699	38728.316	36265	37808.215	34149.797	33674.859	38646.273	33731.469	33435.762	31888.373	37270.715	37052.098	36162.156	33854.008	37721.777	27452.842	37117.73	39471.781	35459.742	35201.684	36934.895	41050.473	35284.734	35310.406	30530.361	37863.668	37500.918	31599.018	35242.75	30829.625	38514.078	35399.551	35104.176	34978.691	37124.918	30987.34	40448.234	40303.969	36575.805	34430.977	37726.277	36081.172	33311.008	32029.043	35117.281	33356.703	38522.852	35540.531	34599.02	37068.883	35891.113	38379.113	39255.867	39289.121	37560.875	34743.594	31927.299	37532.168	36836.738	35644.078	36585.336	32285.148	35220.887	34538.934	35372.109	37349.996	36244.609	32721.98	35002.055	37031.086	39814.004	35510.707	34411.457	36526.09	34413.207	39951.133	36921.84	40240.914	39454.668	30637.838	33622.602	35355.094	35704.484	33793.316	34553.355	34230.527	34634.496	38263.305	37827.312	40226.27	35003.758
0.6671	36964.973	35504.641	33898.418	34888.617	33008.828	41152.281	41012.441	36358.953	39220.664	36053.484	36305.535	35453.785	33794.852	34326.102	32081.727	36291.977	38890.777	35377.992	35465.984	37888.691	29703.123	36968.836	39446.508	36086.25	35942.109	36123.465	39739.664	35820.254	34440.68	29886.791	36832.855	37918.762	32800.949	35439.691	31549.416	36349.984	34063.727	35472.836	36608.938	36872.617	32107.064	39028.957	39310.223	35620.641	33524.445	37913.105	36742.043	35915.965	32788.469	35327.562	32013.344	39307.07	34800.676	33683.328	36121.629	36290.508	36509.203	39037.445	39875.992	37625.984	32982.586	32269.836	36823.164	36403.609	36160.016	36470.598	33153.496	35387.688	35149.641	36688.668	37347.988	36864.824	32833.051	33853.527	36194	38378.445	33980.172	34474.371	36264.07	36276.98	36806.91	37561.23	40658.008	37707.23	30323.805	34643.176	34318.797	33897.07	35034.512	34912.465	33456.664	33550.52	39276.191	38291.801	38328.168	35416.477
0.8005	37007.094	35298.566	33423.676	35290.859	33488.289	38303.961	41325.203	36025.891	38547.324	35227.047	35670.668	36352.73	33473.773	35097.652	32721.881	35198.715	37556.027	36660.586	34495.727	35868.492	29538.242	37183.41	38278.801	36346.09	35624.77	36220.027	41439.508	35923.004	36007.809	29913.686	37148.355	36967.375	32786.074	35383.547	31750.209	37841.879	35021.031	35981.117	34874	36365.125	32831.258	37989.84	40407.656	37975.949	32918.973	37721.68	37627.723	35798.742	33036.617	34169.539	31412.393	39974.363	36288.523	33969.941	38413.477	36899.684	36812.453	39563.477	40277.426	37188.762	33417.332	33379.195	35301.258	35886.668	35079.305	37591.016	30897.512	35096.422	34168.199	36529.418	38582.484	37052.77	34139.023	35734.332	39040.512	38558.508	35571.301	34909.816	36588.988	37067.746	37231.301	37483.199	38745.516	37891.102	29569.324	32635.67	34188.949	33815.441	33227.812	33957.457	34209.344	33597.215	38682.414	37428.59	39937.832	35838.047
0.934	37791.449	35874.629	34798.887	34870.285	34102.84	38480.215	39102.828	36760.961	37841.062	36929.152	35315.773	36880.875	35153.941	34218.664	31856.154	35606.297	37287.223	36082.332	33618.727	37744.012	28349.082	38130.934	37162.082	36263.184	35896.484	35889.57	37787.477	37191.723	36260.211	30114.314	36911.754	36158.906	32536.758	34571.871	32202.574	36727.012	33524.398	35498.137	35006.836	36493.676	33358.066	38435.625	38361.492	39903.469	31787.523	36260.652	35812.945	36318.781	33328.742	35398.32	31927.225	38279.469	36784.121	34071.203	36709.363	35249.824	37570.008	39095.688	40417.324	38070.062	35195.402	34162.23	37155.211	37292.547	35990.121	37760.969	32068.451	34728.312	34138.699	37188.219	39245.008	37595.672	34484.602	35614.977	37369.32	38588.422	34769.043	35734.629	38225.473	36319.066	37522.379	36485.523	37550.145	37768.031	30004.457	34312.758	35023.82	34070.363	34419.566	34806.109	33412.68	34348.379	38255.578	36522.113	39414.48	35044.266
1.0674	37311.695	34977.859	35171.664	33138.027	33170.164	39111.574	38358.359	37534.625	37439.582	35967.945	35936.191	36745.449	34416.176	34367.141	32178.727	36259.566	38437.676	34857.066	32299.475	38258.703	30780.5	37977.32	39195.617	38185.848	33829.609	36431.379	37007.414	36508.227	35970.824	30285.598	37463.242	37136.523	32152.143	34709.68	31259.197	38083.449	31446.834	35613.973	35923.094	36351.609	33921.543	37705.895	40191.172	39188.758	32393.059	36181.496	37834.965	36327.852	31164.105	35689.973	32788.641	37795.824	36394.922	35697.586	36436.031	36697.961	37545.852	38684.824	40219.75	37684.293	33734.156	32895.125	36640.652	37166.98	34770.992	37628.637	32459.611	34607.211	34932.211	37537.234	39368.402	39086.594	34426.191	34111.512	39489.07	37485.641	34518.215	37755.156	40007.504	35851.285	39670.988	38879.781	38982.43	37400.887	30016.475	35287.918	34015.039	35559.566	34607.945	35609.98	35424.051	35317.391	37052.316	37758.801	39248.25	34832.441
1.2008	36621.395	34866.25	36609.266	33041.754	30616.574	39852.801	40775.949	36105.223	39364.906	34108.055	35867.891	36708.965	33661.781	35026.164	32774.855	36518.961	38429.406	35810.254	31764.387	37643.172	30620.225	38415.781	38604.977	38091.746	34016.43	36439	38141.484	35935.105	36060.977	30822.02	37886.879	37604.656	32903.637	35890.285	31157.535	38201.117	32783.781	34328.797	36034.773	37592.148	34330.449	38077.441	37633.812	37897.66	33620.387	37699.242	37214.758	36275.766	33044.586	34533.852	34384.887	38508.223	35899.703	34766.789	37863.848	35591.855	36155.059	36746.445	37821.555	39896.738	33607.512	31990.109	36082.691	35887.859	35209.781	37996.773	32990.973	35670.668	34370.805	36884.391	41123.066	39708.363	34280.398	34553.41	38558.984	38669.602	33386.012	37564.598	38840.66	35394.34	40867.875	38516.023	39142.512	38842.512	30375.199	34722.34	33897.645	34952.277	33605.949	35679.223	33888.5	36993.547	37663.293	37656.941	39638.793	34606.742
1.3342	36551.918	35143.77	35343.926	32771.039	33095.059	39606.543	38600.742	36215.75	40183.848	36462.137	34611.523	38725.742	33506.906	33619.789	34674.801	36565.379	39221.211	34160.613	32930.285	38416.492	28800.445	37988.504	35920.23	39527.707	33634.086	36169.594	38710.992	35511.992	35109.316	31266.496	37827.281	36636.004	33000.535	37579.766	32548.859	39786.891	33242.918	34947.113	35256.43	37840.043	34763.277	40151.188	39439.23	39180.805	35541.023	37117.176	36684.688	35922.992	33649.32	34897.949	33068.59	37982.715	35289.121	34305.785	36248.293	35821.215	36629.516	37412.961	38371.719	38051.031	33461.457	33021.426	36031.852	37949.129	36576.449	36654.504	31450.588	37483.145	33889.16	37532.227	42069.258	41402.617	34268.594	33258.402	37140.398	37495.801	35493.352	35848.789	38774.125	35551.668	39448.129	37375.441	36648.047	37775.262	30579.455	34960.059	33928.562	34620.992	34117.211	35983.766	35217.035	36666.988	36626.953	37759.027	38853.68	34812.141
1.4676	35540.223	36461.926	37185.906	32190.426	34206.258	38655.406	38531.754	35287.473	40093.824	37235.621	33948.828	40098.508	33196.016	32455.33	35869.949	38858.043	41270.023	34046.012	33597.984	40311.695	28845.033	38700.477	36385.445	40231.641	32609.137	38179.914	38075.031	35346.781	36073.855	31249.307	39712.141	35822.324	32611.16	38384.918	31315.84	39988.812	33475.723	34933.301	35219.852	37716.227	37301.242	40371.207	41909.359	41185.348	33257.512	38372.965	35636.645	37649.641	36090.785	35361.355	31675.908	36877.422	35644.18	34631.078	34949.621	35068.754	36402.113	35989.934	38965.402	39195.539	33474.484	31362.713	34411.562	37009.398	38840.668	35786.246	32493.395	35156.473	34020.516	37049.855	41457.438	43292.309	36944.527	32905.047	40507.16	37787.773	36484.344	36202.094	38807.66	37147.957	38105.32	39903.918	35071.145	36762.191	30901.15	34635.52	35583.039	36101.285	32721.961	35970.879	34735.195	37198.426	34774.59	40734.141	39419.891	35195.238
1.6011	37635.355	38258.871	40601.848	32537.854	34700.383	41473.074	39686.184	37353.449	40242.59	37109.129	34061.699	44216.273	32511.639	33064.012	38255.004	42354.355	45909.977	34741.355	34154.043	39525.262	30052.631	39897.281	37531.613	44322.758	32534.859	38696.066	37223.516	35496.324	36344.551	31981.869	39769.582	37821.621	32713.518	43747.367	31791.24	39129.883	34638.652	35588.129	40129.844	39683.34	43794.418	41814.309	40675.152	51157.918	34564.941	40124.551	35082.832	44256.656	41558.949	34828.453	30810.002	38787.945	37494.668	35338.262	36287.559	36543.043	36298.371	37744.801	39682.855	39862.195	32999.699	33418.676	36157.18	39341.676	37536.359	36109.035	31279.318	34593.43	33284.227	36077.199	41276.047	47446.289	37962.629	33152.836	41442.898	39167.945	38958.523	34653.895	39349.43	39954.027	38545.504	39048.035	36632.578	39416.039	31544.797	35082.879	33968.484	38409.5	34800.508	35669.918	34617.914	38958.543	38551.5	40142.504	41252.426	37350.66
1.7345	37438.898	38688.473	50054.809	31597.137	39104.457	47626.008	43224.273	36493.906	43435.902	36067.949	34062.07	44503.699	31759.232	33250.051	43689.297	46300.098	55609.289	34538.352	33788.289	43804.066	29609.457	41421.379	39483.059	51275.293	34744.152	39349.176	38522.691	37387.336	37496.406	35443.883	44708.613	39163.07	32426.613	59048.383	32821.379	41418.367	34777.875	35991.891	49011.531	43416.336	55359.984	42855.391	41048.879	72549.227	41670.418	40767.5	35916.059	63778.621	59786.055	36121.422	32465.125	39792.531	39142.316	36790.742	35367.938	38928.957	36740.68	39065.578	38883.602	40575.582	34865.625	35068.527	38479.242	40265.355	38148.844	36794.074	33184.594	34447.316	33985.434	37413.898	42648.602	58333.688	38280.434	35251.512	43211.504	39240.871	43873.207	35289.742	39549.379	39392.707	38067.293	42205.516	37338.336	42060.398	32876.871	33365.926	34174.391	41964.516	33363.609	36333.758	33582.543	41837.871	40430.258	42099.355	43297.969	38580.66
1.8679	37788.219	41341.703	67109.109	32393.684	50125.148	58497.586	53659.16	37354.383	54451.492	34936.027	35228.289	48857.938	32434.014	34156.711	56049.797	57886.512	83673.078	35467.137	34000.75	48911.957	30427.33	46844.719	40193.262	68732.281	32837.074	40273.629	40491.77	35797.445	39520.805	41327.406	57487.48	39273.664	32902.016	92361.242	35779.719	45926.695	35317.352	34997.941	60052.543	55741.508	80618.047	48268.457	41081.652	116373.758	52434.105	47266.578	38682.637	94066.336	87271.086	37653.32	34126.68	41193.621	44893.727	37428.621	34716.504	45514.016	37318.047	39263.621	43877.719	41342.039	36188.492	38837.91	38228.996	41063.934	42671.32	37591.352	32475.943	34423.461	34487.953	37231.043	47533.496	83705.594	41074.48	35930.699	51854.273	39702.055	48155.852	36206.059	40213.766	42760.293	38649.699	43809.941	37457.398	43121.438	33885.723	32937.66	33446.18	49539.801	32766.377	38841.863	34158.301	49074.504	41129.293	45631.66	49862.551	43982.812
2.0013	40502.031	45067.836	94425.016	31768.674	72938.695	81777.297	75282.094	37466.691	80813.375	35671.629	37579.09	57659.344	32858.809	37914.457	82098.172	86696.141	128642.188	37371.906	33523.785	60077.289	31826.217	62973.812	44447.035	122302.211	34126.242	48268.035	41280.027	35883.133	43669.516	52666.52	88276.258	40529.672	34261.016	118580.305	47888.133	55111.621	38511.141	39866.992	75295.641	78964.156	122650.453	57534.387	44276.621	121452.375	77715.086	60839.52	40468.598	110611.406	97631.766	41710.461	34647.215	49040.711	60171.344	38758.891	38096.305	57444.273	38918.789	38620.117	48930.949	42937.449	38121.949	50465.109	42928.602	42969.812	52972.816	40750.363	34012.516	37028.738	37914.215	37716.043	57615.238	138385.453	45237.125	40897.312	76617.875	41244.164	64248.121	37009.945	45753.621	52591.883	37828.945	41805.613	37718.613	54437.914	41216.539	35532.543	33830.375	66447.062	33359.262	41225.543	33910.207	67872.93	47938.77	51760.711	61829.414	60883.777
2.1348	48924.547	56116.402	114268.148	33653.988	82504.82	125770.812	111722.367	39289.113	127636.102	38121.398	47092.633	62034.551	32676.375	42923.867	121986.141	101088.273	139911.406	39175.301	35471.387	88256.242	33548.621	96456.008	54170.965	156210.312	33951.129	63572.301	46146.137	38117.688	56842.082	73284.82	134048.984	44441.043	36999.555	97785.664	69920.695	76999.273	43802.676	52871.938	76965.789	115686.773	147573.719	65742.523	47130.398	86624.664	96814.82	98683.258	51170.18	86832.406	77371.664	55358.168	39231.891	59462.367	93888.68	45909.609	45258.41	80533.203	42871.359	42499.516	70171.867	49190.102	43532.441	72907.727	55081.684	53793.777	81922.875	48843.539	39613.75	39487.582	42082.121	41385.402	84421.164	179656.125	62223.398	54294.742	144660.281	47368.336	98504.266	37901.137	55366.434	68303.984	37955.367	43350.66	39821.695	79762.695	50498.43	35127.219	37519.754	94947.719	32411.422	46821.324	36314.02	105875.312	60606.129	67530.414	95013.633	88570.531
2.2682	66138.719	88712.484	90832.781	35376.355	60236.211	133436.766	120249.07	46981.434	136637.562	47458.043	70339.219	51510.66	31453.535	52301.777	149750.703	79645.734	105428.117	43363.656	37804.512	127061.586	40565.473	134544.094	73481.43	122544.805	34082.133	97642.992	57351.773	41981.398	83731.844	75320.258	146184.984	53818.992	43988.18	65379.402	99697.969	120904.109	63314.688	73419.633	62117.547	110800.211	112571.141	66934.555	54574.57	54474.527	84176.484	133468.203	73426.305	57029.113	51327.305	80649.359	49025.727	86692.922	110473	58407.938	62871.887	97402.656	54295.926	51602.434	110949.664	62791.855	62500.066	116211.906	76518.32	73268.836	113038.992	69015.406	51626.656	43877.988	51236.199	46387.961	128609.648	154858.781	88625.078	76803.047	190854.891	49191.273	125344.703	43856.02	78533.258	75510.172	38254.812	47208.645	42796.992	111768.438	67842.086	36110.328	42480.668	113170.68	33231.316	61710.223	39463.68	131382.359	91348.531	104687.523	127964.641	106038.516
2.4016	98245.828	139864.312	59685.359	40950.133	43737.008	96898.758	88752.523	57320.156	97843.133	69032.055	103436.945	43910.305	32809.922	73452.141	134670.141	55741.629	69175.812	56034.473	43415.262	138779.016	58704.129	129871.57	82345.469	73053.008	39366.695	110882.211	83742.711	47933.395	114671.531	53748.82	108053.828	72463.992	62129.742	49535.824	93890.141	162820.828	71738.656	88616.383	47524.195	75779.547	67240.75	57533.035	78718.984	41750.414	62121.098	116489.672	98834.172	45292.23	39595.16	84604.07	68206.828	128083.914	87866.453	71108.008	86758.195	76987.219	78775.383	73058.422	134327.688	94321.914	100308.555	129714.602	96571.664	101071.32	107387.312	113556.773	72169.719	57409.488	73052.18	64589.523	126650.109	104827.609	96184.836	83820.172	165781.516	65476.586	102400.945	53858.934	122961.023	72465.172	43304.258	53387.77	53859.25	103489.727	98942.352	38691.41	52631.535	89443.766	40450.719	76975.57	52592.148	110479.281	116766.031	138168.031	121449.445	76753.961
2.535	112641.711	153961.844	43911.098	53599.199	36445.074	62215.621	59021.836	63133.34	65872.922	94674.586	111302.977	NaN	33878.852	100483.539	84907.195	43861.09	49672.379	77746.359	59803.176	107699.438	91041.07	88108.242	66997.016	50264.203	47993.559	92633.672	117029.578	63626.262	100358.055	40028.723	70022.516	99734.023	103856.328	43363.102	66707.867	144359.219	61575.184	72512.617	41522.969	57744.574	47635.699	46584.441	127406.641	38347.176	47374.488	76111.914	95018.273	39830.258	36106.395	66778.875	81642.234	135687.641	59329.762	72292.023	91436.039	54380.113	108203.672	105261.133	107394.906	114362.719	124737.805	88074.125	79180.016	101240.203	74249.297	134702.109	77255.078	81166.523	107169.188	98711.117	88064.43	66665.922	77333.867	67391.547	97832.164	103291.852	65056.844	74150.773	143094.516	82175.414	50547.105	73587.117	71966.336	68863.102	129535.281	44017.27	76270.945	61970.293	54334.34	74607.68	78458.141	72857.086	93511.758	120223.078	85689.828	54136.664
2.6684	81002.758	109687.875	NaN	75403.469	35599.422	46801.309	47328.172	54752.172	50030.164	91422.758	82596.047	NaN	34149.18	99836.68	54090.867	NaN	NaN	84389.984	79331.516	69170.977	108393.227	60743.691	NaN	44826.398	62839.082	63265.621	103210.977	93581.156	66641.789	34824.969	52647.516	103195.633	124462.539	NaN	46700.57	92601.859	42632.918	52979.27	38342.781	46680.836	40097.258	43076.078	132577.625	36722.703	41571.371	55004.82	67710.789	39652.812	NaN	49129.844	65488.234	91107.352	45593.762	55461.891	66747.891	42893.293	101544.32	116506.32	71728.945	93676.875	102865.891	52048.625	57507.129	73427.812	50797.02	102804.242	63111.004	101383.422	112812.406	114804.477	60498.707	51761.664	60449.996	51934.828	61521.922	155713.203	53237.281	80784.656	100162.703	85259.086	75924.641	102453.422	88159.336	51892.668	116647.312	54901.242	105184.531	NaN	85995.406	54100.441	117640.516	47656.605	63138.457	78357.547	56696.699	43146.082
2.8019	55575.289	68102.555	NaN	79319.102	NaN	41278.91	43186.711	44886.961	NaN	66825.922	55438.375	NaN	40764.281	71904.172	NaN	NaN	NaN	64582.898	72338.578	50794.082	84155.555	NaN	NaN	NaN	81434.406	48881.004	70565	101863.281	58999.844	NaN	45250.523	72908.375	96556.375	NaN	39528.277	60503.309	39003.363	42487.008	NaN	41583.34	NaN	40845.395	87937.969	NaN	35613.516	46752.832	50019.168	NaN	NaN	41275.496	48171.898	58199.598	40117.727	42815.258	49110.969	40297.426	73052.203	86273.477	52479.957	65217.871	64430.09	NaN	46275.277	51068.57	42349.762	68479.023	47635.859	88584.75	81446.445	89307.031	49029.262	46304.047	57066.273	NaN	47298.926	148243.328	NaN	64010.859	61888.094	67188.812	117472.898	97962.508	81210.766	43902.906	75269.539	73200.656	98287.305	NaN	129518.305	42375.234	120945.867	40832.617	50403.227	54981.391	47146.711	39999.195
2.9353	44155.008	47720.145	NaN	61122.359	NaN	41512.316	NaN	NaN	NaN	47367.941	42785.254	NaN	49988.984	51690.875	NaN	NaN	NaN	51648.688	54374.715	44218.969	54176.262	NaN	NaN	NaN	84354.328	44048.16	50405.594	73596.602	52620.699	NaN	NaN	54052.02	61194.562	NaN	35675.812	49932.344	NaN	NaN	NaN	40614.676	NaN	NaN	61938.656	NaN	35670.918	42581.883	40690.105	NaN	NaN	37347.5	38608.27	46017.75	NaN	38913.824	40986.125	39483.684	52331.984	56401.672	45995.441	50550.703	47088.793	NaN	43361.707	NaN	40151.711	50817.055	42374.82	61350.48	53952.578	62340.734	42868.117	NaN	51008.559	NaN	42298.004	98755.031	NaN	48199.238	46199.172	50298.074	142894.016	69575.078	59732.121	NaN	49128.395	76113.523	67174.398	NaN	135865.219	NaN	86782.992	NaN	42780.246	45483.695	NaN	NaN
3.0687	40656.332	NaN	NaN	45387.477	NaN	NaN	NaN	NaN	NaN	NaN	38570.887	NaN	69533.945	42458.93	NaN	NaN	NaN	44769.105	43248.754	NaN	40579.801	NaN	NaN	NaN	61886.527	40204.84	43587.105	53943.578	46627.684	NaN	NaN	43320.82	42994.297	NaN	NaN	43875.949	NaN	NaN	NaN	NaN	NaN	NaN	52487.445	NaN	NaN	NaN	38385.348	NaN	NaN	35401.516	NaN	NaN	NaN	NaN	37911.891	NaN	44574.797	45209.203	NaN	46094.926	39281.707	NaN	NaN	NaN	NaN	42764.785	NaN	45822.781	NaN	48734.125	NaN	NaN	47515.359	NaN	40127.965	61253.805	NaN	39615.41	40945.305	43251.305	113498.359	55359.574	48332.242	NaN	39013.602	57636.137	44898.875	NaN	97111.773	NaN	64205.047	NaN	40945.879	NaN	NaN	NaN
3.2021	NaN	NaN	NaN	38292.469	NaN	NaN	NaN	NaN	NaN	NaN	NaN	NaN	79289.516	39249.43	NaN	NaN	NaN	NaN	NaN	NaN	35592.992	NaN	NaN	NaN	44868.695	NaN	NaN	44729.664	38607.633	NaN	NaN	42268.855	36222.07	NaN	NaN	NaN	NaN	NaN	NaN	NaN	NaN	NaN	46879.109	NaN	NaN	NaN	NaN	NaN	NaN	NaN	NaN	NaN	NaN	NaN	NaN	NaN	NaN	41786.047	NaN	43848.027	39293.727	NaN	NaN	NaN	NaN	40262.668	NaN	NaN	NaN	43206.93	NaN	NaN	NaN	NaN	NaN	48967.309	NaN	36739.598	NaN	NaN	74112.516	54891.062	NaN	NaN	NaN	45437.484	39266.238	NaN	62356.914	NaN	NaN	NaN	NaN	NaN	NaN	NaN
3.3356	NaN	NaN	NaN	36179.98	NaN	NaN	NaN	NaN	NaN	NaN	NaN	NaN	63623.055	NaN	NaN	NaN	NaN	NaN	NaN	NaN	33191.109	NaN	NaN	NaN	39619.148	NaN	NaN	40125.789	NaN	NaN	NaN	NaN	NaN	NaN	NaN	NaN	NaN	NaN	NaN	NaN	NaN	NaN	NaN	NaN	NaN	NaN	NaN	NaN	NaN	NaN	NaN	NaN	NaN	NaN	NaN	NaN	NaN	NaN	NaN	NaN	NaN	NaN	NaN	NaN	NaN	39295.969	NaN	NaN	NaN	NaN	NaN	NaN	NaN	NaN	NaN	43284.012	NaN	36888.859	NaN	NaN	53308.734	NaN	NaN	NaN	NaN	41238.492	35613.625	NaN	46907.105	NaN	NaN	NaN	NaN	NaN	NaN	NaN
3.469	NaN	NaN	NaN	NaN	NaN	NaN	NaN	NaN	NaN	NaN	NaN	NaN	46749.234	NaN	NaN	NaN	NaN	NaN	NaN	NaN	NaN	NaN	NaN	NaN	NaN	NaN	NaN	NaN	NaN	NaN	NaN	NaN	NaN	NaN	NaN	NaN	NaN	NaN	NaN	NaN	NaN	NaN	NaN	NaN	NaN	NaN	NaN	NaN	NaN	NaN	NaN	NaN	NaN	NaN	NaN	NaN	NaN	NaN	NaN	NaN	NaN	NaN	NaN	NaN	NaN	NaN	NaN	NaN	NaN	NaN	NaN	NaN	NaN	NaN	NaN	NaN	NaN	NaN	NaN	NaN	46315.672	NaN	NaN	NaN	NaN	37843.859	34141.75	NaN	41200.668	NaN	NaN	NaN	NaN	NaN	NaN	NaN
3.6024	NaN	NaN	NaN	NaN	NaN	NaN	NaN	NaN	NaN	NaN	NaN	NaN	38471.203	NaN	NaN	NaN	NaN	NaN	NaN	NaN	NaN	NaN	NaN	NaN	NaN	NaN	NaN	NaN	NaN	NaN	NaN	NaN	NaN	NaN	NaN	NaN	NaN	NaN	NaN	NaN	NaN	NaN	NaN	NaN	NaN	NaN	NaN	NaN	NaN	NaN	NaN	NaN	NaN	NaN	NaN	NaN	NaN	NaN	NaN	NaN	NaN	NaN	NaN	NaN	NaN	NaN	NaN	NaN	NaN	NaN	NaN	NaN	NaN	NaN	NaN	NaN	NaN	NaN	NaN	NaN	42286.074	NaN	NaN	NaN	NaN	36296.773	NaN	NaN	NaN	NaN	NaN	NaN	NaN	NaN	NaN	NaN
3.7358	NaN	NaN	NaN	NaN	NaN	NaN	NaN	NaN	NaN	NaN	NaN	NaN	35788.277	NaN	NaN	NaN	NaN	NaN	NaN	NaN	NaN	NaN	NaN	NaN	NaN	NaN	NaN	NaN	NaN	NaN	NaN	NaN	NaN	NaN	NaN	NaN	NaN	NaN	NaN	NaN	NaN	NaN	NaN	NaN	NaN	NaN	NaN	NaN	NaN	NaN	NaN	NaN	NaN	NaN	NaN	NaN	NaN	NaN	NaN	NaN	NaN	NaN	NaN	NaN	NaN	NaN	NaN	NaN	NaN	NaN	NaN	NaN	NaN	NaN	NaN	NaN	NaN	NaN	NaN	NaN	42295.141	NaN	NaN	NaN	NaN	NaN	NaN	NaN	NaN	NaN	NaN	NaN	NaN	NaN	NaN	NaN
3.8692	NaN	NaN	NaN	NaN	NaN	NaN	NaN	NaN	NaN	NaN	NaN	NaN	36202.707	NaN	NaN	NaN	NaN	NaN	NaN	NaN	NaN	NaN	NaN	NaN	NaN	NaN	NaN	NaN	NaN	NaN	NaN	NaN	NaN	NaN	NaN	NaN	NaN	NaN	NaN	NaN	NaN	NaN	NaN	NaN	NaN	NaN	NaN	NaN	NaN	NaN	NaN	NaN	NaN	NaN	NaN	NaN	NaN	NaN	NaN	NaN	NaN	NaN	NaN	NaN	NaN	NaN	NaN	NaN	NaN	NaN	NaN	NaN	NaN	NaN	NaN	NaN	NaN	NaN	NaN	NaN	NaN	NaN	NaN	NaN	NaN	NaN	NaN	NaN	NaN	NaN	NaN	NaN	NaN	NaN	NaN	NaN
4.0027	NaN	NaN	NaN	NaN	NaN	NaN	NaN	NaN	NaN	NaN	NaN	NaN	NaN	NaN	NaN	NaN	NaN	NaN	NaN	NaN	NaN	NaN	NaN	NaN	NaN	NaN	NaN	NaN	NaN	NaN	NaN	NaN	NaN	NaN	NaN	NaN	NaN	NaN	NaN	NaN	NaN	NaN	NaN	NaN	NaN	NaN	NaN	NaN	NaN	NaN	NaN	NaN	NaN	NaN	NaN	NaN	NaN	NaN	NaN	NaN	NaN	NaN	NaN	NaN	NaN	NaN	NaN	NaN	NaN	NaN	NaN	NaN	NaN	NaN	NaN	NaN	NaN	NaN	NaN	NaN	NaN	NaN	NaN	NaN	NaN	NaN	NaN	NaN	NaN	NaN	NaN	NaN	NaN	NaN	NaN	NaN
4.1361	NaN	NaN	NaN	NaN	NaN	NaN	NaN	NaN	NaN	NaN	NaN	NaN	NaN	NaN	NaN	NaN	NaN	NaN	NaN	NaN	NaN	NaN	NaN	NaN	NaN	NaN	NaN	NaN	NaN	NaN	NaN	NaN	NaN	NaN	NaN	NaN	NaN	NaN	NaN	NaN	NaN	NaN	NaN	NaN	NaN	NaN	NaN	NaN	NaN	NaN	NaN	NaN	NaN	NaN	NaN	NaN	NaN	NaN	NaN	NaN	NaN	NaN	NaN	NaN	NaN	NaN	NaN	NaN	NaN	NaN	NaN	NaN	NaN	NaN	NaN	NaN	NaN	NaN	NaN	NaN	NaN	NaN	NaN	NaN	NaN	NaN	NaN	NaN	NaN	NaN	NaN	NaN	NaN	NaN	NaN	NaN
4.2695	NaN	NaN	NaN	NaN	NaN	NaN	NaN	NaN	NaN	NaN	NaN	NaN	NaN	NaN	NaN	NaN	NaN	NaN	NaN	NaN	NaN	NaN	NaN	NaN	NaN	NaN	NaN	NaN	NaN	NaN	NaN	NaN	NaN	NaN	NaN	NaN	NaN	NaN	NaN	NaN	NaN	NaN	NaN	NaN	NaN	NaN	NaN	NaN	NaN	NaN	NaN	NaN	NaN	NaN	NaN	NaN	NaN	NaN	NaN	NaN	NaN	NaN	NaN	NaN	NaN	NaN	NaN	NaN	NaN	NaN	NaN	NaN	NaN	NaN	NaN	NaN	NaN	NaN	NaN	NaN	NaN	NaN	NaN	NaN	NaN	NaN	NaN	NaN	NaN	NaN	NaN	NaN	NaN	NaN	NaN	NaN
4.4029	NaN	NaN	NaN	NaN	NaN	NaN	NaN	NaN	NaN	NaN	NaN	NaN	NaN	NaN	NaN	NaN	NaN	NaN	NaN	NaN	NaN	NaN	NaN	NaN	NaN	NaN	NaN	NaN	NaN	NaN	NaN	NaN	NaN	NaN	NaN	NaN	NaN	NaN	NaN	NaN	NaN	NaN	NaN	NaN	NaN	NaN	NaN	NaN	NaN	NaN	NaN	NaN	NaN	NaN	NaN	NaN	NaN	NaN	NaN	NaN	NaN	NaN	NaN	NaN	NaN	NaN	NaN	NaN	NaN	NaN	NaN	NaN	NaN	NaN	NaN	NaN	NaN	NaN	NaN	NaN	NaN	NaN	NaN	NaN	NaN	NaN	NaN	NaN	NaN	NaN	NaN	NaN	NaN	NaN	NaN	NaN
4.5363	NaN	NaN	NaN	NaN	NaN	NaN	NaN	NaN	NaN	NaN	NaN	NaN	NaN	NaN	NaN	NaN	NaN	NaN	NaN	NaN	NaN	NaN	NaN	NaN	NaN	NaN	NaN	NaN	NaN	NaN	NaN	NaN	NaN	NaN	NaN	NaN	NaN	NaN	NaN	NaN	NaN	NaN	NaN	NaN	NaN	NaN	NaN	NaN	NaN	NaN	NaN	NaN	NaN	NaN	NaN	NaN	NaN	NaN	NaN	NaN	NaN	NaN	NaN	NaN	NaN	NaN	NaN	NaN	NaN	NaN	NaN	NaN	NaN	NaN	NaN	NaN	NaN	NaN	NaN	NaN	NaN	NaN	NaN	NaN	NaN	NaN	NaN	NaN	NaN	NaN	NaN	NaN	NaN	NaN	NaN	NaN
4.6698	NaN	NaN	NaN	NaN	NaN	NaN	NaN	NaN	NaN	NaN	NaN	NaN	NaN	NaN	NaN	NaN	NaN	NaN	NaN	NaN	NaN	NaN	NaN	NaN	NaN	NaN	NaN	NaN	NaN	NaN	NaN	NaN	NaN	NaN	NaN	NaN	NaN	NaN	NaN	NaN	NaN	NaN	NaN	NaN	NaN	NaN	NaN	NaN	NaN	NaN	NaN	NaN	NaN	NaN	NaN	NaN	NaN	NaN	NaN	NaN	NaN	NaN	NaN	NaN	NaN	NaN	NaN	NaN	NaN	NaN	NaN	NaN	NaN	NaN	NaN	NaN	NaN	NaN	NaN	NaN	NaN	NaN	NaN	NaN	NaN	NaN	NaN	NaN	NaN	NaN	NaN	NaN	NaN	NaN	NaN	NaN
4.8032	NaN	NaN	NaN	NaN	NaN	NaN	NaN	NaN	NaN	NaN	NaN	NaN	NaN	NaN	NaN	NaN	NaN	NaN	NaN	NaN	NaN	NaN	NaN	NaN	NaN	NaN	NaN	NaN	NaN	NaN	NaN	NaN	NaN	NaN	NaN	NaN	NaN	NaN	NaN	NaN	NaN	NaN	NaN	NaN	NaN	NaN	NaN	NaN	NaN	NaN	NaN	NaN	NaN	NaN	NaN	NaN	NaN	NaN	NaN	NaN	NaN	NaN	NaN	NaN	NaN	NaN	NaN	NaN	NaN	NaN	NaN	NaN	NaN	NaN	NaN	NaN	NaN	NaN	NaN	NaN	NaN	NaN	NaN	NaN	NaN	NaN	NaN	NaN	NaN	NaN	NaN	NaN	NaN	NaN	NaN	NaN
4.9366	NaN	NaN	NaN	NaN	NaN	NaN	NaN	NaN	NaN	NaN	NaN	NaN	NaN	NaN	NaN	NaN	NaN	NaN	NaN	NaN	NaN	NaN	NaN	NaN	NaN	NaN	NaN	NaN	NaN	NaN	NaN	NaN	NaN	NaN	NaN	NaN	NaN	NaN	NaN	NaN	NaN	NaN	NaN	NaN	NaN	NaN	NaN	NaN	NaN	NaN	NaN	NaN	NaN	NaN	NaN	NaN	NaN	NaN	NaN	NaN	NaN	NaN	NaN	NaN	NaN	NaN	NaN	NaN	NaN	NaN	NaN	NaN	NaN	NaN	NaN	NaN	NaN	NaN	NaN	NaN	NaN	NaN	NaN	NaN	NaN	NaN	NaN	NaN	NaN	NaN	NaN	NaN	NaN	NaN	NaN	NaN
5.07	NaN	NaN	NaN	NaN	NaN	NaN	NaN	NaN	NaN	NaN	NaN	NaN	NaN	NaN	NaN	NaN	NaN	NaN	NaN	NaN	NaN	NaN	NaN	NaN	NaN	NaN	NaN	NaN	NaN	NaN	NaN	NaN	NaN	NaN	NaN	NaN	NaN	NaN	NaN	NaN	NaN	NaN	NaN	NaN	NaN	NaN	NaN	NaN	NaN	NaN	NaN	NaN	NaN	NaN	NaN	NaN	NaN	NaN	NaN	NaN	NaN	NaN	NaN	NaN	NaN	NaN	NaN	NaN	NaN	NaN	NaN	NaN	NaN	NaN	NaN	NaN	NaN	NaN	NaN	NaN	NaN	NaN	NaN	NaN	NaN	NaN	NaN	NaN	NaN	NaN	NaN	NaN	NaN	NaN	NaN	NaN
5.2035	NaN	NaN	NaN	NaN	NaN	NaN	NaN	NaN	NaN	NaN	NaN	NaN	NaN	NaN	NaN	NaN	NaN	NaN	NaN	NaN	NaN	NaN	NaN	NaN	NaN	NaN	NaN	NaN	NaN	NaN	NaN	NaN	NaN	NaN	NaN	NaN	NaN	NaN	NaN	NaN	NaN	NaN	NaN	NaN	NaN	NaN	NaN	NaN	NaN	NaN	NaN	NaN	NaN	NaN	NaN	NaN	NaN	NaN	NaN	NaN	NaN	NaN	NaN	NaN	NaN	NaN	NaN	NaN	NaN	NaN	NaN	NaN	NaN	NaN	NaN	NaN	NaN	NaN	NaN	NaN	NaN	NaN	NaN	NaN	NaN	NaN	NaN	NaN	NaN	NaN	NaN	NaN	NaN	NaN	NaN	NaN
5.3369	NaN	NaN	NaN	NaN	NaN	NaN	NaN	NaN	NaN	NaN	NaN	NaN	NaN	NaN	NaN	NaN	NaN	NaN	NaN	NaN	NaN	NaN	NaN	NaN	NaN	NaN	NaN	NaN	NaN	NaN	NaN	NaN	NaN	NaN	NaN	NaN	NaN	NaN	NaN	NaN	NaN	NaN	NaN	NaN	NaN	NaN	NaN	NaN	NaN	NaN	NaN	NaN	NaN	NaN	NaN	NaN	NaN	NaN	NaN	NaN	NaN	NaN	NaN	NaN	NaN	NaN	NaN	NaN	NaN	NaN	NaN	NaN	NaN	NaN	NaN	NaN	NaN	NaN	NaN	NaN	NaN	NaN	NaN	NaN	NaN	NaN	NaN	NaN	NaN	NaN	NaN	NaN	NaN	NaN	NaN	NaN
5.4703	NaN	NaN	NaN	NaN	NaN	NaN	NaN	NaN	NaN	NaN	NaN	NaN	NaN	NaN	NaN	NaN	NaN	NaN	NaN	NaN	NaN	NaN	NaN	NaN	NaN	NaN	NaN	NaN	NaN	NaN	NaN	NaN	NaN	NaN	NaN	NaN	NaN	NaN	NaN	NaN	NaN	NaN	NaN	NaN	NaN	NaN	NaN	NaN	NaN	NaN	NaN	NaN	NaN	NaN	NaN	NaN	NaN	NaN	NaN	NaN	NaN	NaN	NaN	NaN	NaN	NaN	NaN	NaN	NaN	NaN	NaN	NaN	NaN	NaN	NaN	NaN	NaN	NaN	NaN	NaN	NaN	NaN	NaN	NaN	NaN	NaN	NaN	NaN	NaN	NaN	NaN	NaN	NaN	NaN	NaN	NaN
5.6037	NaN	NaN	NaN	NaN	NaN	NaN	NaN	NaN	NaN	NaN	NaN	NaN	NaN	NaN	NaN	NaN	NaN	NaN	NaN	NaN	NaN	NaN	NaN	NaN	NaN	NaN	NaN	NaN	NaN	NaN	NaN	NaN	NaN	NaN	NaN	NaN	NaN	NaN	NaN	NaN	NaN	NaN	NaN	NaN	NaN	NaN	NaN	NaN	NaN	NaN	NaN	NaN	NaN	NaN	NaN	NaN	NaN	NaN	NaN	NaN	NaN	NaN	NaN	NaN	NaN	NaN	NaN	NaN	NaN	NaN	NaN	NaN	NaN	NaN	NaN	NaN	NaN	NaN	NaN	NaN	NaN	NaN	NaN	NaN	NaN	NaN	NaN	NaN	NaN	NaN	NaN	NaN	NaN	NaN	NaN	NaN
5.7371	NaN	NaN	NaN	NaN	NaN	NaN	NaN	NaN	NaN	NaN	NaN	NaN	NaN	NaN	NaN	NaN	NaN	NaN	NaN	NaN	NaN	NaN	NaN	NaN	NaN	NaN	NaN	NaN	NaN	NaN	NaN	NaN	NaN	NaN	NaN	NaN	NaN	NaN	NaN	NaN	NaN	NaN	NaN	NaN	NaN	NaN	NaN	NaN	NaN	NaN	NaN	NaN	NaN	NaN	NaN	NaN	NaN	NaN	NaN	NaN	NaN	NaN	NaN	NaN	NaN	NaN	NaN	NaN	NaN	NaN	NaN	NaN	NaN	NaN	NaN	NaN	NaN	NaN	NaN	NaN	NaN	NaN	NaN	NaN	NaN	NaN	NaN	NaN	NaN	NaN	NaN	NaN	NaN	NaN	NaN	NaN
