0.00000,34916.480
0.13342,35712.711
0.26684,35779.684
0.40027,35367.656
0.53369,37068.602
0.66711,36438.383
0.80053,34650.949
0.93395,35912.223
1.06737,37260.625
1.20080,41952.422
1.33422,52467.277
1.46764,75078.625
1.60106,102896.711
1.73448,96577.680
1.86791,69330.414
2.00133,53500.301
