x	Y_20180130_15100b_1_1g	Y_20180130_15100b_1_3g	Y_20180130_15100b_10_10g	Y_20180130_15100b_10_15g	Y_20180130_15100b_10_2g	Y_20180130_15100b_10_3g	Y_20180130_15100b_10_4g	Y_20180130_15100b_10_8g	Y_20180130_15100b_10_9g	Y_20180130_15100b_11_3g	Y_20180130_15100b_11_5g	Y_20180130_15100b_11_9g	Y_20180130_15100b_12_14g	Y_20180130_15100b_12_3g	Y_20180130_15100b_12_4g	Y_20180130_15100b_12_6g	Y_20180130_15100b_12_7g	Y_20180130_15100b_12_9g	Y_20180130_15100b_13_7g	Y_20180130_15100b_13_9g	Y_20180130_15100b_14_11g	Y_20180130_15100b_14_12g	Y_20180130_15100b_14_2g	Y_20180130_15100b_15_13g	Y_20180130_15100b_15_9g	Y_20180130_15100b_16_3g	Y_20180130_15100b_16_4g	Y_20180130_15100b_16_7g	Y_20180130_15100b_17_11g	Y_20180130_15100b_17_2g	Y_20180130_15100b_17_5g	Y_20180130_15100b_17_8g	Y_20180130_15100b_18_17g	Y_20180130_15100b_18_22g	Y_20180130_15100b_18_23g	Y_20180130_15100b_18_4g	Y_20180130_15100b_19_11g	Y_20180130_15100b_19_6g	Y_20180130_15100b_19_7g	Y_20180130_15100b_2_6g	Y_20180130_15100b_20_11_1g	Y_20180130_15100b_20_11_2g	Y_20180130_15100b_20_15g	Y_20180130_15100b_20_1g	Y_20180130_15100b_20_8g	Y_20180130_15100b_21_7g	Y_20180130_15100b_22_2g	Y_20180130_15100b_22_3g	Y_20180130_15100b_22_8g	Y_20180130_15100b_23_10g	Y_20180130_15100b_24_10g	Y_20180130_15100b_24_14_1g	Y_20180130_15100b_24_1g	Y_20180130_15100b_24_3g	Y_20180130_15100b_24_5g	Y_20180130_15100b_24_6g	Y_20180130_15100b_3_13g	Y_20180130_15100b_3_14g	Y_20180130_15100b_3_15g	Y_20180130_15100b_3_8g	Y_20180130_15100b_4_10g	Y_20180130_15100b_4_13g	Y_20180130_15100b_4_15g	Y_20180130_15100b_4_1g	Y_20180130_15100b_4_21g	Y_20180130_15100b_5_11g	Y_20180130_15100b_5_12g	Y_20180130_15100b_5_16g	Y_20180130_15100b_5_18g	Y_20180130_15100b_5_19g	Y_20180130_15100b_5_4g	Y_20180130_15100b_5_5g	Y_20180130_15100b_5_7g	Y_20180130_15100b_5_9g	Y_20180130_15100b_6_10g	Y_20180130_15100b_6_6g	Y_20180130_15100b_6_7g	Y_20180130_15100b_7_12g	Y_20180130_15100b_7_3g	Y_20180130_15100b_7_4g	Y_20180130_15100b_8_8g	Y_20180130_15100b_9_13g	Y_20180130_15100b_9_14g	Y_20180130_15100b_9_1g	Y_20180130_15100b_9_3g	Y_20180130_15100b_9_5g	Y_20180130_15100b_9_9g
0	35956.551	35834.609	36551.766	29659.027	39345.25	33997.09	36157.004	36793.52	36932.695	41197.211	42698.617	38261.637	34673.633	33498.695	32271.4	36161.332	33079.938	34509.828	35880.238	34596.766	34810.598	34671.562	32684.139	32458.771	36898.098	35690.539	33493.297	32710.762	41723.543	35271.816	32784.273	36479.422	30989.887	39361.121	38998.598	36539.898	31727.521	32755.062	32263.092	36591.344	36252.129	34493.688	36217.809	32269.031	35873.125	38285.484	37396.211	38115.383	36250.984	37765.676	35870.301	41553.586	31896.322	38166.082	37517.477	35539.652	34285.273	38359.785	35663.801	36710.957	35803.141	37193.102	37849.617	36859.973	33773.941	32516.566	36364.547	37489.551	39074.133	34700.562	34407.09	34872.488	39427.309	38951.32	38337.332	34562.875	40297.664	33851.07	37770.242	39961.273	34938.809	37999.559	36663.102	36906.676	34070.5	35231.172	38293.699
0.1334	36340.684	35119.598	35771.816	30703.926	39084.668	32998.805	37004.211	35671.883	36994.164	39719.762	40270.23	38860.484	34743.457	34044.465	32759.051	36207.859	35083.898	35713.441	34412.707	33547.004	34823.344	34444.375	32261.691	33183.621	36451.461	34654.559	32031.748	32913.02	41854.766	35585.285	33217.668	35243.57	32449.102	38479.523	38907.57	37006.789	32502.24	34407.801	31069.717	38390.473	35470.461	34576.879	37618.906	34844.266	35371.996	38454.613	36307.68	38163.836	36431.266	38657.27	35443.656	41226.973	31700.564	39053.414	36854.785	35794.715	34370.922	37272.758	34563.117	35259.406	34745.082	38874.629	35666.754	35588.746	32550.363	32164.094	37041.098	38533.375	39795.059	34227.141	33862.875	35755.062	37042.395	37459.707	37031.617	34808.832	38991.504	34210.016	37550.324	37810.422	36119.352	37802.27	37187.168	36801.082	33448.91	33223.645	38630.367
0.2668	36833.32	34418.285	34263.648	29962.506	40699.141	32303.762	35389.82	36160.18	37029.789	39670.562	41110.707	38972.871	33112.836	34484.691	31884.699	38072.633	34875.254	35420.672	34300	34827.984	35376.914	36232.84	32800.469	32217.986	37149.602	36223.758	31670.877	34119.828	40380.344	34674.102	32025.023	37144.164	31399.738	38435.785	38285.184	34572.051	33277.363	34303.84	30974.604	37230.348	34753.906	35235.848	36934.191	34172.098	36580.414	38746.605	38727.453	38285.539	37078.852	40410.57	33606.695	39560.801	31713.711	39045.203	37391.719	35548.754	33285.863	37903.23	34371.836	36753.844	36880.266	35694.211	35202.988	37423.203	32521.688	32189.691	36810.645	39486.551	38499.684	33912.648	35671.547	37633.215	37856.801	36906.215	36282.812	35477.383	39072.098	33257.141	38509.027	37722.117	36319.57	36910.223	37515.316	35975.895	33551.273	33469.414	39147.191
0.4003	37173.965	36275.07	34077.621	30578.41	39480.055	31362.688	36692.457	36148.676	37600.008	38986.332	40918.145	37861.109	33971.484	33967.691	34995.859	37711	33759.98	34601.676	34597.754	34695	36168.879	35820.629	32071.613	31788.814	37671.852	34457.09	33292.395	33949.477	39751.969	35054.809	32772.855	37144.324	31529.385	38457.871	39977.242	34669.852	31541.773	33424.758	30777.936	35901.926	35127.059	34033.227	37391.5	33344.922	36940.211	38195.852	37691.352	37534.008	36865.148	41160.227	33247.566	39257.168	31714.244	38164.078	37068.297	34781.199	32938.082	37878.938	36456.48	35078.043	37281.496	38845.336	36470.18	37496.371	32811.859	31979.018	35692.852	39027.191	40233.227	35620.188	33790.105	38667.02	40214.5	36838.312	38277.266	37622.918	37996.605	34195.457	37752.816	38094.055	35669.914	37855.871	38080.941	35467.066	34447.562	33197.027	38390.984
0.5337	36507.785	35084.094	36463.602	29636.064	40188.516	31388.111	36548.094	37639.406	38168.633	38346.547	40764.758	36917.586	35397.828	35035.199	32560.406	37479.797	33049.523	35220.988	35175.316	34417.324	36200.102	38342.457	33091.43	33517.59	35754.527	34534.934	33388.93	35758.93	40168.945	35302.598	33753.945	37659.012	32049.684	40368.762	38910.699	35046.18	31581.137	33378.289	31264.139	34852.316	34492.691	34546.773	36278.621	34114.684	36631.512	37675.414	38497.715	39614.23	35952.168	40738.723	35009.289	37782.238	33394.648	38963.531	37200.031	35062.848	33854.199	37860.367	35159.387	36016.215	36786.816	39329.566	37260.324	37340.48	33293.621	32607.275	37331.344	38025.387	40138.438	36022.668	37662.473	38125.09	39162.297	35572.281	36017.172	39426.18	36143.109	33522.32	38204.188	37824.098	35031.816	36528.188	41416.648	36260.531	35078.246	34788.152	38465.844
0.6671	37088.262	34716.121	35394.359	30546.598	39130.77	32805.059	37286.605	37248.41	38262.316	38776.039	40497.07	37877.145	34965.02	35505.207	34383.246	36772.473	33282.516	34735.863	37444.406	35384.66	36359.395	40898.953	31798.266	33317.938	35121.512	35211.758	33039.121	36876.02	39194.047	37481.082	34613.34	36677.195	32664.197	39376.258	39152.934	36908.977	31825.389	33302.953	31096.453	35516.035	37234.121	33588.719	36854.02	33925.145	36812.695	37332.953	37435.328	40596.762	37171.383	39216.641	35685.871	38325.527	34248.754	38509.152	38424.18	35377.348	35465.277	40251.75	36637.398	38249.441	40655.219	42351.59	39552.938	38584.914	33720.395	31975.83	39277.562	37605.156	39917.219	34815.441	37970.895	37467.957	38754.676	37134.445	35726.895	43264.418	37527.121	34174.805	40442.625	37564.469	35011.531	37731.801	49253.098	35589.715	37284.367	35763.387	39698.598
0.8005	38437.273	35246.473	37639.977	33264.844	37748.582	33032.492	38431.133	40750.48	41267.004	36715.805	40616.645	37977.152	35628.75	39808.812	36832.121	36729.621	32911.293	35567.512	39132.809	35880.137	38955.402	41711.238	35320.625	34048.566	35589.402	33502.469	32878.504	39504.66	38996.355	38022.027	35169.402	37142.797	34183.988	40285.445	38947.418	37018.441	32384.418	34214.02	30915.289	35706.699	39857.043	35052.371	37843.512	35532.734	37431.371	40847.062	38837.367	43167.527	41879.734	40636.934	35649.398	39503.402	35717.75	39495.602	37563.996	35720.039	34722.34	39954.688	38180.062	45271.332	44354.363	49813.812	46641.523	39206.918	33644.777	34206.004	42802.008	39456.098	39762.812	36537.793	43259	36806.777	40124.691	38082.418	36375.051	52883.102	38099.82	36876.266	38666.898	38726.062	33932.102	36639.207	61636.227	35118.984	38476.188	38744.645	40323.043
0.934	37618.438	35907.625	40069.609	39473.199	38033.902	34475.871	39238.883	44056.059	47199.547	38390.648	47542.461	38062.102	39713.387	47310.082	42625.91	36646.832	33801.02	39006.586	46297.102	36636.777	45386.125	45685.551	43582.555	36220.707	37838.891	34666.336	33615.629	43304.98	38875.293	39093.109	36357.613	42227.969	36236.75	45689.348	40681.793	37768.25	33884.219	35419.801	32667.656	34525.34	43088.941	35737.77	41020.285	38233.66	40195.969	41083.715	41460.961	45217.652	57289.23	40733.605	36586.859	41998.336	38016.77	42620.695	38377.555	35808.988	34996.996	41500.898	41477.199	63143.25	54988.18	68605.375	64096.703	39454.891	32183.074	36714.727	47217.637	40971.082	41569.055	39704.734	52140.477	36797.512	40411.145	39248.211	38975.188	69303.641	40048.824	43459.855	39839.801	40552.219	35228.008	34791.988	93345.391	36107.441	41941.555	38526.832	45776.566
1.0674	36194.625	36223.836	52731.594	53368.895	36449.785	35369.176	43300.086	53921.461	67843.008	39928.289	56824.445	42219.121	46981.188	65616.766	56851.312	38912.488	32738.98	47487.641	59967.32	38544.93	60991.758	59847.613	56743.191	40110.77	39305.562	35302.906	34705.312	52014.852	39122.004	45641.746	41145.953	50308.027	41762.266	56298.844	44783.113	40681.309	37647.832	37084.648	32153.305	35058.863	54641.094	38444.562	49934.832	41878.062	44328.562	42687.062	49220.715	55613.461	73841.461	46896.93	39954.492	46521.66	41428.387	46034.422	39849.277	39915.766	34535.641	46332.828	48459.887	96567.562	82493.148	101941.992	70813.422	39869.508	35230.141	43763.828	62473.406	45904.637	43262.324	50310.77	80721.922	39204.703	42594.109	41107.906	44634.66	99003.773	42330.746	64045.086	43818.801	41061.406	37308.598	35850.285	104595.711	36515.305	49624.352	43317.84	55123.324
1.2008	39742.805	38897.441	79356.523	63024.48	37960.996	41031.785	48341.078	78070.766	107691.156	42200.219	83347.836	47240.559	64400.074	75499.969	79356.406	41773.648	34842.723	62183.348	85337.672	43318.906	94571.242	88235.242	87617.797	52146.352	42808.617	37604.578	36511.914	76258.773	41632.27	60794.07	51809.727	69763.062	56866.531	92994.828	52349.336	48889.727	47232.219	40445.785	32121.033	37644.402	78048.203	43481.191	72742.633	55035.035	54058.977	50507.105	73776.469	69618.172	80409.516	53528.535	48847.344	54216.727	49196.605	49744.938	44663.984	44656.883	37961.945	65544.047	61603.414	132137.812	108500.93	107384.477	60529.426	43973.902	39263.484	51433.43	97419.25	58050.328	49337.895	71890.398	122966.812	44191.383	46390.438	49181.008	61761.754	103956.18	50616.645	106286.203	47339.508	46124.691	44698.992	36787.559	73377.75	39263.836	69614.453	60033.973	79494.242
1.3342	41872.945	47319.809	105227.578	55886.379	38572.277	50122.246	62194.992	117521.852	141928.703	51776.07	103530.25	67730.148	91592.906	63801.34	89671.227	48018.801	41111.777	67242.609	94258.578	53113.391	124513.961	121314.297	89035.164	79032.375	57085.824	43819.59	40367.277	101774.297	47592.223	99573.312	77025.438	90522.734	94150.336	136095.812	69538.57	67295.688	61948.02	48410.781	33578.648	40283.188	121474.211	56086.844	109412.984	79386.586	62713.891	65914.727	110961.914	73249.68	63245.23	80154.859	73086.562	74051.227	72718.969	60930.188	53513.348	58898.238	44890.055	91539.375	68288.164	130155.953	96911.711	77236.758	46967.656	55450.473	52886.711	55198.152	145503.406	82649.625	64275.484	117071.797	118272.836	56029.297	58708.801	64501.738	73330.148	74202.992	78354.867	122936.125	62593.984	64224.598	62209.711	37624.285	54414.18	44245.535	105641.969	88082.312	95851.055
1.4676	46493.547	66520.352	96777.547	42275.836	40666.383	75008.414	90755.289	130359.891	122463.148	70796.703	81323.789	105926.047	86982.25	45547.375	66029.086	61870.535	54863.762	53046.996	70400.133	82315.789	111736.938	105729.375	63081.859	125044.094	86595.945	56664.867	48566.289	92023.891	60309.23	135781.312	106357.094	80398.953	145870.594	136587.062	98972.516	94623.141	72066.141	73439.438	37950.5	50149.523	134345.578	68370.211	129480.148	90786.758	57902.367	100991.789	119992.297	59074.594	46021.352	124729.234	109346.039	125814.391	106880.93	86649.438	82793.609	94543.484	64408.215	92354.664	57614.891	81759.867	68556.422	50830.418	43070.906	73948.133	78459.812	67936.875	146081.797	118604.594	89934.641	136680.062	75653.477	87698.766	85622.992	78487.531	62525.934	50865.051	115543.508	87421.391	93987.992	99135.43	70315.398	39236.18	50913.254	56189.875	112858.438	100612.242	75788.82
1.6011	59415.832	102480.516	64269.984	36528.551	46633.547	88817.773	126718.969	89925.641	79600.094	83050.383	57245.496	119755.383	62340.863	NaN	44521.469	93526.664	81009.414	42747.648	50116.824	120757.344	78961.422	69477.359	46567.773	136682.766	116709.844	68081.367	62445.172	64977.648	86323.258	114202.195	101901.711	56903.945	133981.141	88804.242	96102.617	107830.695	57143.234	101775.742	50976.434	68785.031	97429.094	59400.59	103045.406	73200.438	49509.289	127536.68	81833.258	47891.133	42570.258	144887.406	100702.203	161234.625	113103.477	115648.023	145267.812	143962.719	98274.711	68159.266	44987.059	54119.41	51557.242	NaN	41420.332	90946.211	95323.586	88205.867	94871.25	121799.93	91907.539	103331.352	52693.656	113948.531	111554.812	73785.781	48619.867	40398.281	113019.859	59189.277	115016.281	138807.844	61722.762	42832.332	NaN	82739.094	84207.023	77537.18	55813.484
1.7345	82587.188	130934.219	NaN	33886.457	57530.766	79020.82	118482.938	59424.609	56939.285	72198.547	NaN	94553.234	45043.582	NaN	41548.312	126484.172	99990.477	37422.82	NaN	131640.25	66017.727	48936.785	NaN	101695.969	95014.969	58571.664	69825.328	46016.328	107045.703	76092.531	67615.961	47922.871	83431.359	59973.762	69482.93	82172.336	43430.699	93400.789	69011.117	106563.242	59794.562	46467.871	66299.258	49596.254	NaN	112356.914	53296.027	NaN	NaN	103551.039	66703	129946.82	81037.859	102671.109	202542.688	158888.469	108574.305	50718.25	41202.781	43881.934	NaN	NaN	NaN	74019.328	76876.523	77228.102	59338.516	88722.82	67311.289	64925.051	NaN	101111.148	102850.133	56766.391	40124.648	NaN	80461.711	45879.785	94851.523	127180.133	46440.492	51963.762	NaN	113057.312	54555.645	54331.355	46670.098
1.8679	100365.32	105912.695	NaN	NaN	75635.578	57323.574	77420.391	49592.828	NaN	51815.234	NaN	58244.422	NaN	NaN	39157.605	109649.531	81355.609	NaN	NaN	91937.078	56807.961	42155.031	NaN	62486.301	60333.273	44471.238	57186.617	39690.715	90976.102	51154	48132.398	44695.332	52705.152	48098.602	50937.086	53908.867	NaN	65589.609	62593.879	132628.766	44638.066	38595.594	47315.484	41084.898	NaN	72827.648	45968.801	NaN	NaN	63184.754	50595.32	74960.609	49846.629	66751.297	171951.406	126345.789	81879.789	42938.73	NaN	40224.039	NaN	NaN	NaN	53793.797	52251.594	56297.805	45348.469	59451.309	50365.023	47172.922	NaN	69129.047	70036.906	46470.184	36986.781	NaN	58120.5	42276.586	66109.156	82928.164	40241.168	66752.875	NaN	111367.094	NaN	42725.289	44471.879
2.0013	82316.906	67137.672	NaN	NaN	73821.953	44775.223	52487.535	46475.781	NaN	43917.352	NaN	NaN	NaN	NaN	NaN	72219.062	55610.32	NaN	NaN	59634.512	NaN	37959.051	NaN	NaN	44911.973	38584.012	44737.832	38152.02	63073.57	NaN	NaN	NaN	41693.441	NaN	44880.387	46937.102	NaN	47161.121	49392.559	103286.969	39023.934	NaN	NaN	37282.137	NaN	53812.68	42989.285	NaN	NaN	47406.926	NaN	49622.48	37779.203	47972.078	112032.633	93955.25	55840.938	NaN	NaN	NaN	NaN	NaN	NaN	42280.363	43066.781	42765.66	NaN	49600.461	NaN	42723.152	NaN	49732.992	50315.145	41906.855	NaN	NaN	49042.312	NaN	49520.293	55667.363	NaN	80890.742	NaN	72481.641	NaN	NaN	NaN
2.1348	58568.082	51900.648	NaN	NaN	56480.25	39629.195	45090.578	NaN	NaN	NaN	NaN	NaN	NaN	NaN	NaN	52971.234	43090.473	NaN	NaN	47480.562	NaN	NaN	NaN	NaN	NaN	35784.137	37445.355	NaN	48433.785	NaN	NaN	NaN	35966.547	NaN	NaN	41257.711	NaN	38075.828	41563.539	65747.195	NaN	NaN	NaN	NaN	NaN	45682.777	NaN	NaN	NaN	42252.293	NaN	41881.766	NaN	NaN	77016.422	70158.945	45233.582	NaN	NaN	NaN	NaN	NaN	NaN	NaN	38251.758	NaN	NaN	44898.051	NaN	NaN	NaN	NaN	42534.676	NaN	NaN	NaN	44252.102	NaN	NaN	NaN	NaN	70640.633	NaN	51143.211	NaN	NaN	NaN
2.2682	44378.539	42522.66	NaN	NaN	NaN	NaN	NaN	NaN	NaN	NaN	NaN	NaN	NaN	NaN	NaN	44511.203	37069.676	NaN	NaN	NaN	NaN	NaN	NaN	NaN	NaN	36670.504	35026.027	NaN	44388.855	NaN	NaN	NaN	NaN	NaN	NaN	NaN	NaN	NaN	34535.141	46958.254	NaN	NaN	NaN	NaN	NaN	NaN	NaN	NaN	NaN	NaN	NaN	39469.984	NaN	NaN	57571.836	51603.383	NaN	NaN	NaN	NaN	NaN	NaN	NaN	NaN	NaN	NaN	NaN	NaN	NaN	NaN	NaN	NaN	NaN	NaN	NaN	NaN	NaN	NaN	NaN	NaN	NaN	54243.957	NaN	43291.398	NaN	NaN	NaN
2.4016	NaN	NaN	NaN	NaN	NaN	NaN	NaN	NaN	NaN	NaN	NaN	NaN	NaN	NaN	NaN	NaN	NaN	NaN	NaN	NaN	NaN	NaN	NaN	NaN	NaN	NaN	NaN	NaN	NaN	NaN	NaN	NaN	NaN	NaN	NaN	NaN	NaN	NaN	33884.172	39465.211	NaN	NaN	NaN	NaN	NaN	NaN	NaN	NaN	NaN	NaN	NaN	NaN	NaN	NaN	46144.25	41955.863	NaN	NaN	NaN	NaN	NaN	NaN	NaN	NaN	NaN	NaN	NaN	NaN	NaN	NaN	NaN	NaN	NaN	NaN	NaN	NaN	NaN	NaN	NaN	NaN	NaN	45305.246	NaN	39593.582	NaN	NaN	NaN
2.535	NaN	NaN	NaN	NaN	NaN	NaN	NaN	NaN	NaN	NaN	NaN	NaN	NaN	NaN	NaN	NaN	NaN	NaN	NaN	NaN	NaN	NaN	NaN	NaN	NaN	NaN	NaN	NaN	NaN	NaN	NaN	NaN	NaN	NaN	NaN	NaN	NaN	NaN	NaN	38414.125	NaN	NaN	NaN	NaN	NaN	NaN	NaN	NaN	NaN	NaN	NaN	NaN	NaN	NaN	40965.379	38384.832	NaN	NaN	NaN	NaN	NaN	NaN	NaN	NaN	NaN	NaN	NaN	NaN	NaN	NaN	NaN	NaN	NaN	NaN	NaN	NaN	NaN	NaN	NaN	NaN	NaN	41995.414	NaN	NaN	NaN	NaN	NaN
2.6684	NaN	NaN	NaN	NaN	NaN	NaN	NaN	NaN	NaN	NaN	NaN	NaN	NaN	NaN	NaN	NaN	NaN	NaN	NaN	NaN	NaN	NaN	NaN	NaN	NaN	NaN	NaN	NaN	NaN	NaN	NaN	NaN	NaN	NaN	NaN	NaN	NaN	NaN	NaN	38129.348	NaN	NaN	NaN	NaN	NaN	NaN	NaN	NaN	NaN	NaN	NaN	NaN	NaN	NaN	NaN	NaN	NaN	NaN	NaN	NaN	NaN	NaN	NaN	NaN	NaN	NaN	NaN	NaN	NaN	NaN	NaN	NaN	NaN	NaN	NaN	NaN	NaN	NaN	NaN	NaN	NaN	NaN	NaN	NaN	NaN	NaN	NaN
2.8019	NaN	NaN	NaN	NaN	NaN	NaN	NaN	NaN	NaN	NaN	NaN	NaN	NaN	NaN	NaN	NaN	NaN	NaN	NaN	NaN	NaN	NaN	NaN	NaN	NaN	NaN	NaN	NaN	NaN	NaN	NaN	NaN	NaN	NaN	NaN	NaN	NaN	NaN	NaN	NaN	NaN	NaN	NaN	NaN	NaN	NaN	NaN	NaN	NaN	NaN	NaN	NaN	NaN	NaN	NaN	NaN	NaN	NaN	NaN	NaN	NaN	NaN	NaN	NaN	NaN	NaN	NaN	NaN	NaN	NaN	NaN	NaN	NaN	NaN	NaN	NaN	NaN	NaN	NaN	NaN	NaN	NaN	NaN	NaN	NaN	NaN	NaN
2.9353	NaN	NaN	NaN	NaN	NaN	NaN	NaN	NaN	NaN	NaN	NaN	NaN	NaN	NaN	NaN	NaN	NaN	NaN	NaN	NaN	NaN	NaN	NaN	NaN	NaN	NaN	NaN	NaN	NaN	NaN	NaN	NaN	NaN	NaN	NaN	NaN	NaN	NaN	NaN	NaN	NaN	NaN	NaN	NaN	NaN	NaN	NaN	NaN	NaN	NaN	NaN	NaN	NaN	NaN	NaN	NaN	NaN	NaN	NaN	NaN	NaN	NaN	NaN	NaN	NaN	NaN	NaN	NaN	NaN	NaN	NaN	NaN	NaN	NaN	NaN	NaN	NaN	NaN	NaN	NaN	NaN	NaN	NaN	NaN	NaN	NaN	NaN
3.0687	NaN	NaN	NaN	NaN	NaN	NaN	NaN	NaN	NaN	NaN	NaN	NaN	NaN	NaN	NaN	NaN	NaN	NaN	NaN	NaN	NaN	NaN	NaN	NaN	NaN	NaN	NaN	NaN	NaN	NaN	NaN	NaN	NaN	NaN	NaN	NaN	NaN	NaN	NaN	NaN	NaN	NaN	NaN	NaN	NaN	NaN	NaN	NaN	NaN	NaN	NaN	NaN	NaN	NaN	NaN	NaN	NaN	NaN	NaN	NaN	NaN	NaN	NaN	NaN	NaN	NaN	NaN	NaN	NaN	NaN	NaN	NaN	NaN	NaN	NaN	NaN	NaN	NaN	NaN	NaN	NaN	NaN	NaN	NaN	NaN	NaN	NaN
3.2021	NaN	NaN	NaN	NaN	NaN	NaN	NaN	NaN	NaN	NaN	NaN	NaN	NaN	NaN	NaN	NaN	NaN	NaN	NaN	NaN	NaN	NaN	NaN	NaN	NaN	NaN	NaN	NaN	NaN	NaN	NaN	NaN	NaN	NaN	NaN	NaN	NaN	NaN	NaN	NaN	NaN	NaN	NaN	NaN	NaN	NaN	NaN	NaN	NaN	NaN	NaN	NaN	NaN	NaN	NaN	NaN	NaN	NaN	NaN	NaN	NaN	NaN	NaN	NaN	NaN	NaN	NaN	NaN	NaN	NaN	NaN	NaN	NaN	NaN	NaN	NaN	NaN	NaN	NaN	NaN	NaN	NaN	NaN	NaN	NaN	NaN	NaN
3.3356	NaN	NaN	NaN	NaN	NaN	NaN	NaN	NaN	NaN	NaN	NaN	NaN	NaN	NaN	NaN	NaN	NaN	NaN	NaN	NaN	NaN	NaN	NaN	NaN	NaN	NaN	NaN	NaN	NaN	NaN	NaN	NaN	NaN	NaN	NaN	NaN	NaN	NaN	NaN	NaN	NaN	NaN	NaN	NaN	NaN	NaN	NaN	NaN	NaN	NaN	NaN	NaN	NaN	NaN	NaN	NaN	NaN	NaN	NaN	NaN	NaN	NaN	NaN	NaN	NaN	NaN	NaN	NaN	NaN	NaN	NaN	NaN	NaN	NaN	NaN	NaN	NaN	NaN	NaN	NaN	NaN	NaN	NaN	NaN	NaN	NaN	NaN
3.469	NaN	NaN	NaN	NaN	NaN	NaN	NaN	NaN	NaN	NaN	NaN	NaN	NaN	NaN	NaN	NaN	NaN	NaN	NaN	NaN	NaN	NaN	NaN	NaN	NaN	NaN	NaN	NaN	NaN	NaN	NaN	NaN	NaN	NaN	NaN	NaN	NaN	NaN	NaN	NaN	NaN	NaN	NaN	NaN	NaN	NaN	NaN	NaN	NaN	NaN	NaN	NaN	NaN	NaN	NaN	NaN	NaN	NaN	NaN	NaN	NaN	NaN	NaN	NaN	NaN	NaN	NaN	NaN	NaN	NaN	NaN	NaN	NaN	NaN	NaN	NaN	NaN	NaN	NaN	NaN	NaN	NaN	NaN	NaN	NaN	NaN	NaN
3.6024	NaN	NaN	NaN	NaN	NaN	NaN	NaN	NaN	NaN	NaN	NaN	NaN	NaN	NaN	NaN	NaN	NaN	NaN	NaN	NaN	NaN	NaN	NaN	NaN	NaN	NaN	NaN	NaN	NaN	NaN	NaN	NaN	NaN	NaN	NaN	NaN	NaN	NaN	NaN	NaN	NaN	NaN	NaN	NaN	NaN	NaN	NaN	NaN	NaN	NaN	NaN	NaN	NaN	NaN	NaN	NaN	NaN	NaN	NaN	NaN	NaN	NaN	NaN	NaN	NaN	NaN	NaN	NaN	NaN	NaN	NaN	NaN	NaN	NaN	NaN	NaN	NaN	NaN	NaN	NaN	NaN	NaN	NaN	NaN	NaN	NaN	NaN
3.7358	NaN	NaN	NaN	NaN	NaN	NaN	NaN	NaN	NaN	NaN	NaN	NaN	NaN	NaN	NaN	NaN	NaN	NaN	NaN	NaN	NaN	NaN	NaN	NaN	NaN	NaN	NaN	NaN	NaN	NaN	NaN	NaN	NaN	NaN	NaN	NaN	NaN	NaN	NaN	NaN	NaN	NaN	NaN	NaN	NaN	NaN	NaN	NaN	NaN	NaN	NaN	NaN	NaN	NaN	NaN	NaN	NaN	NaN	NaN	NaN	NaN	NaN	NaN	NaN	NaN	NaN	NaN	NaN	NaN	NaN	NaN	NaN	NaN	NaN	NaN	NaN	NaN	NaN	NaN	NaN	NaN	NaN	NaN	NaN	NaN	NaN	NaN
3.8692	NaN	NaN	NaN	NaN	NaN	NaN	NaN	NaN	NaN	NaN	NaN	NaN	NaN	NaN	NaN	NaN	NaN	NaN	NaN	NaN	NaN	NaN	NaN	NaN	NaN	NaN	NaN	NaN	NaN	NaN	NaN	NaN	NaN	NaN	NaN	NaN	NaN	NaN	NaN	NaN	NaN	NaN	NaN	NaN	NaN	NaN	NaN	NaN	NaN	NaN	NaN	NaN	NaN	NaN	NaN	NaN	NaN	NaN	NaN	NaN	NaN	NaN	NaN	NaN	NaN	NaN	NaN	NaN	NaN	NaN	NaN	NaN	NaN	NaN	NaN	NaN	NaN	NaN	NaN	NaN	NaN	NaN	NaN	NaN	NaN	NaN	NaN
4.0027	NaN	NaN	NaN	NaN	NaN	NaN	NaN	NaN	NaN	NaN	NaN	NaN	NaN	NaN	NaN	NaN	NaN	NaN	NaN	NaN	NaN	NaN	NaN	NaN	NaN	NaN	NaN	NaN	NaN	NaN	NaN	NaN	NaN	NaN	NaN	NaN	NaN	NaN	NaN	NaN	NaN	NaN	NaN	NaN	NaN	NaN	NaN	NaN	NaN	NaN	NaN	NaN	NaN	NaN	NaN	NaN	NaN	NaN	NaN	NaN	NaN	NaN	NaN	NaN	NaN	NaN	NaN	NaN	NaN	NaN	NaN	NaN	NaN	NaN	NaN	NaN	NaN	NaN	NaN	NaN	NaN	NaN	NaN	NaN	NaN	NaN	NaN
4.1361	NaN	NaN	NaN	NaN	NaN	NaN	NaN	NaN	NaN	NaN	NaN	NaN	NaN	NaN	NaN	NaN	NaN	NaN	NaN	NaN	NaN	NaN	NaN	NaN	NaN	NaN	NaN	NaN	NaN	NaN	NaN	NaN	NaN	NaN	NaN	NaN	NaN	NaN	NaN	NaN	NaN	NaN	NaN	NaN	NaN	NaN	NaN	NaN	NaN	NaN	NaN	NaN	NaN	NaN	NaN	NaN	NaN	NaN	NaN	NaN	NaN	NaN	NaN	NaN	NaN	NaN	NaN	NaN	NaN	NaN	NaN	NaN	NaN	NaN	NaN	NaN	NaN	NaN	NaN	NaN	NaN	NaN	NaN	NaN	NaN	NaN	NaN
4.2695	NaN	NaN	NaN	NaN	NaN	NaN	NaN	NaN	NaN	NaN	NaN	NaN	NaN	NaN	NaN	NaN	NaN	NaN	NaN	NaN	NaN	NaN	NaN	NaN	NaN	NaN	NaN	NaN	NaN	NaN	NaN	NaN	NaN	NaN	NaN	NaN	NaN	NaN	NaN	NaN	NaN	NaN	NaN	NaN	NaN	NaN	NaN	NaN	NaN	NaN	NaN	NaN	NaN	NaN	NaN	NaN	NaN	NaN	NaN	NaN	NaN	NaN	NaN	NaN	NaN	NaN	NaN	NaN	NaN	NaN	NaN	NaN	NaN	NaN	NaN	NaN	NaN	NaN	NaN	NaN	NaN	NaN	NaN	NaN	NaN	NaN	NaN
4.4029	NaN	NaN	NaN	NaN	NaN	NaN	NaN	NaN	NaN	NaN	NaN	NaN	NaN	NaN	NaN	NaN	NaN	NaN	NaN	NaN	NaN	NaN	NaN	NaN	NaN	NaN	NaN	NaN	NaN	NaN	NaN	NaN	NaN	NaN	NaN	NaN	NaN	NaN	NaN	NaN	NaN	NaN	NaN	NaN	NaN	NaN	NaN	NaN	NaN	NaN	NaN	NaN	NaN	NaN	NaN	NaN	NaN	NaN	NaN	NaN	NaN	NaN	NaN	NaN	NaN	NaN	NaN	NaN	NaN	NaN	NaN	NaN	NaN	NaN	NaN	NaN	NaN	NaN	NaN	NaN	NaN	NaN	NaN	NaN	NaN	NaN	NaN
4.5363	NaN	NaN	NaN	NaN	NaN	NaN	NaN	NaN	NaN	NaN	NaN	NaN	NaN	NaN	NaN	NaN	NaN	NaN	NaN	NaN	NaN	NaN	NaN	NaN	NaN	NaN	NaN	NaN	NaN	NaN	NaN	NaN	NaN	NaN	NaN	NaN	NaN	NaN	NaN	NaN	NaN	NaN	NaN	NaN	NaN	NaN	NaN	NaN	NaN	NaN	NaN	NaN	NaN	NaN	NaN	NaN	NaN	NaN	NaN	NaN	NaN	NaN	NaN	NaN	NaN	NaN	NaN	NaN	NaN	NaN	NaN	NaN	NaN	NaN	NaN	NaN	NaN	NaN	NaN	NaN	NaN	NaN	NaN	NaN	NaN	NaN	NaN
4.6698	NaN	NaN	NaN	NaN	NaN	NaN	NaN	NaN	NaN	NaN	NaN	NaN	NaN	NaN	NaN	NaN	NaN	NaN	NaN	NaN	NaN	NaN	NaN	NaN	NaN	NaN	NaN	NaN	NaN	NaN	NaN	NaN	NaN	NaN	NaN	NaN	NaN	NaN	NaN	NaN	NaN	NaN	NaN	NaN	NaN	NaN	NaN	NaN	NaN	NaN	NaN	NaN	NaN	NaN	NaN	NaN	NaN	NaN	NaN	NaN	NaN	NaN	NaN	NaN	NaN	NaN	NaN	NaN	NaN	NaN	NaN	NaN	NaN	NaN	NaN	NaN	NaN	NaN	NaN	NaN	NaN	NaN	NaN	NaN	NaN	NaN	NaN
4.8032	NaN	NaN	NaN	NaN	NaN	NaN	NaN	NaN	NaN	NaN	NaN	NaN	NaN	NaN	NaN	NaN	NaN	NaN	NaN	NaN	NaN	NaN	NaN	NaN	NaN	NaN	NaN	NaN	NaN	NaN	NaN	NaN	NaN	NaN	NaN	NaN	NaN	NaN	NaN	NaN	NaN	NaN	NaN	NaN	NaN	NaN	NaN	NaN	NaN	NaN	NaN	NaN	NaN	NaN	NaN	NaN	NaN	NaN	NaN	NaN	NaN	NaN	NaN	NaN	NaN	NaN	NaN	NaN	NaN	NaN	NaN	NaN	NaN	NaN	NaN	NaN	NaN	NaN	NaN	NaN	NaN	NaN	NaN	NaN	NaN	NaN	NaN
4.9366	NaN	NaN	NaN	NaN	NaN	NaN	NaN	NaN	NaN	NaN	NaN	NaN	NaN	NaN	NaN	NaN	NaN	NaN	NaN	NaN	NaN	NaN	NaN	NaN	NaN	NaN	NaN	NaN	NaN	NaN	NaN	NaN	NaN	NaN	NaN	NaN	NaN	NaN	NaN	NaN	NaN	NaN	NaN	NaN	NaN	NaN	NaN	NaN	NaN	NaN	NaN	NaN	NaN	NaN	NaN	NaN	NaN	NaN	NaN	NaN	NaN	NaN	NaN	NaN	NaN	NaN	NaN	NaN	NaN	NaN	NaN	NaN	NaN	NaN	NaN	NaN	NaN	NaN	NaN	NaN	NaN	NaN	NaN	NaN	NaN	NaN	NaN
5.07	NaN	NaN	NaN	NaN	NaN	NaN	NaN	NaN	NaN	NaN	NaN	NaN	NaN	NaN	NaN	NaN	NaN	NaN	NaN	NaN	NaN	NaN	NaN	NaN	NaN	NaN	NaN	NaN	NaN	NaN	NaN	NaN	NaN	NaN	NaN	NaN	NaN	NaN	NaN	NaN	NaN	NaN	NaN	NaN	NaN	NaN	NaN	NaN	NaN	NaN	NaN	NaN	NaN	NaN	NaN	NaN	NaN	NaN	NaN	NaN	NaN	NaN	NaN	NaN	NaN	NaN	NaN	NaN	NaN	NaN	NaN	NaN	NaN	NaN	NaN	NaN	NaN	NaN	NaN	NaN	NaN	NaN	NaN	NaN	NaN	NaN	NaN
5.2035	NaN	NaN	NaN	NaN	NaN	NaN	NaN	NaN	NaN	NaN	NaN	NaN	NaN	NaN	NaN	NaN	NaN	NaN	NaN	NaN	NaN	NaN	NaN	NaN	NaN	NaN	NaN	NaN	NaN	NaN	NaN	NaN	NaN	NaN	NaN	NaN	NaN	NaN	NaN	NaN	NaN	NaN	NaN	NaN	NaN	NaN	NaN	NaN	NaN	NaN	NaN	NaN	NaN	NaN	NaN	NaN	NaN	NaN	NaN	NaN	NaN	NaN	NaN	NaN	NaN	NaN	NaN	NaN	NaN	NaN	NaN	NaN	NaN	NaN	NaN	NaN	NaN	NaN	NaN	NaN	NaN	NaN	NaN	NaN	NaN	NaN	NaN
5.3369	NaN	NaN	NaN	NaN	NaN	NaN	NaN	NaN	NaN	NaN	NaN	NaN	NaN	NaN	NaN	NaN	NaN	NaN	NaN	NaN	NaN	NaN	NaN	NaN	NaN	NaN	NaN	NaN	NaN	NaN	NaN	NaN	NaN	NaN	NaN	NaN	NaN	NaN	NaN	NaN	NaN	NaN	NaN	NaN	NaN	NaN	NaN	NaN	NaN	NaN	NaN	NaN	NaN	NaN	NaN	NaN	NaN	NaN	NaN	NaN	NaN	NaN	NaN	NaN	NaN	NaN	NaN	NaN	NaN	NaN	NaN	NaN	NaN	NaN	NaN	NaN	NaN	NaN	NaN	NaN	NaN	NaN	NaN	NaN	NaN	NaN	NaN
