0.00000,35644.301
0.13342,36995.680
0.26684,35831.277
0.40027,36418.062
0.53369,36601.801
0.66711,37075.422
0.80053,36589.195
0.93395,35505.258
1.06737,37536.102
1.20080,39759.789
1.33422,40408.828
1.46764,47707.715
1.60106,69406.891
1.73448,98977.852
1.86791,92856.352
2.00133,65568.023
2.13475,47519.629
2.26817,43556.391
2.40159,39370.266
