x	Y_20180130_15109_21_5g	Y_20180130_15109_25_5g
0	34390.48	33242.273
0.1334	35024.133	33392.902
0.2668	37450.465	32960.367
0.4003	38054.5	33421.66
0.5337	37275.23	33342.227
0.6671	36796.297	33152.16
0.8005	37499.555	33389.762
0.934	38779.344	34683.168
1.0674	38602.391	35328.801
1.2008	39322.922	34964.906
1.3342	37324.984	36730.227
1.4676	35806.09	33741.566
1.6011	37824.129	33734.578
1.7345	37055.898	34397.816
1.8679	36375.758	33294.711
2.0013	38160.148	34593.195
2.1348	36819.473	34394.477
2.2682	35639.207	33948.328
2.4016	35953.855	33449.527
2.535	37767.68	33957.496
2.6684	37273.445	35601.441
2.8019	39019.074	36459.336
2.9353	40032.18	36861.41
3.0687	44784.844	40967.641
3.2021	56662.098	48046.801
3.3356	76818.602	70122.016
3.469	85134.266	107392.156
3.6024	74498.57	114863.781
3.7358	70267.734	84928.297
3.8692	63269.258	56749.891
4.0027	NaN	43215.848
4.1361	NaN	37628.613
4.2695	NaN	36571.148
4.4029	NaN	NaN
4.5363	NaN	NaN
4.6698	NaN	NaN
4.8032	NaN	NaN
4.9366	NaN	NaN
5.07	NaN	NaN
5.2035	NaN	NaN
5.3369	NaN	NaN
5.4703	NaN	NaN
5.6037	NaN	NaN
5.7371	NaN	NaN
