0.0000	36707.1992
0.1334	38829.1641
0.2668	37385.6055
0.4003	36479.1836
0.5337	37307.0234
0.6671	37685.5781
0.8005	37648.4141
0.9340	38925.4648
1.0674	40947.4219
1.2008	45866.3477
1.3342	61214.6836
1.4676	92907.3984
1.6011	144311.2031
1.7345	160979.2969
1.8679	112487.0859
2.0013	66041.7266
2.1347	48082.7578
2.2682	41354.5703
2.4016	39638.5469
2.5350	38914.4844
