0.00000,11769.287
0.13342,12476.997
0.26684,13478.592
0.40027,15599.297
0.53369,20808.789
0.66711,23668.850
0.80053,24475.430
0.93395,22244.178
1.06737,19369.014
1.20080,18248.750
1.33422,16679.059
1.46764,15432.619
1.60106,14874.703
1.73448,14126.503
1.86791,13659.476
2.00133,13273.494
2.13475,12447.531
