0.0000	29661.0430
0.1334	29356.0645
0.2668	30291.0723
0.4003	29894.3809
0.5337	30749.6055
0.6671	30159.8086
0.8005	30193.3555
0.9340	29542.8477
1.0674	31836.2461
1.2008	33265.5781
1.3342	35663.6680
1.4676	44496.5430
1.6011	60683.8086
1.7345	108679.3203
1.8679	145958.6562
2.0013	115505.3672
2.1347	67177.9375
2.2682	45886.4375
2.4016	37643.2578
2.5350	35529.1836
2.6684	35903.3711
