0.0000	16091.6055
0.1334	16907.5352
0.2668	18826.1094
0.4003	19275.9102
0.5337	18184.6348
0.6671	17173.5176
0.8005	17602.8633
0.9340	18278.8457
1.0674	18125.8242
1.2008	16215.2910
1.3342	15372.6309
1.4676	14398.6484
1.6011	12933.4707
1.7345	13305.7178
