X,Y
0.00000,16245.588
0.13342,16350.858
0.26684,15865.449
0.40027,14972.461
0.53369,15376.838
0.66711,16019.516
0.80053,15434.718
0.93395,16252.124
1.06737,17195.646
1.20080,16010.590
1.33422,16442.807
1.46764,16598.938
1.60106,16350.841
1.73448,16469.322
1.86791,16403.986
2.00133,17480.715
2.13475,19002.260
2.26817,21318.457
2.40159,27533.117
2.53502,39453.578
2.66844,41961.902
2.80186,33197.008
2.93528,22979.221
3.06870,18432.025
