0.00000,37135.719
0.13342,35720.645
0.26684,37567.340
0.40027,40389.402
0.53369,42963.953
0.66711,46153.176
0.80053,52554.504
0.93395,67762.188
1.06737,109957.570
1.20080,155013.172
1.33422,142769.734
1.46764,92237.812
1.60106,61569.270
