X,Y
0.00000,12768.505
0.13342,12373.314
0.26684,12473.557
0.40027,13020.339
0.53369,14934.469
0.66711,17192.736
0.80053,18946.734
0.93395,16715.141
1.06737,15761.218
1.20080,15197.840
1.33422,15625.971
1.46764,15152.631
1.60106,13892.543
1.73448,13188.067
1.86791,12394.794
2.00133,12201.962
