0.00000,13991.153
0.13342,13787.860
0.26684,15119.731
0.40027,16404.521
0.53369,21482.336
0.66711,27686.371
0.80053,36274.199
0.93395,39173.027
1.06737,37797.148
1.20080,34187.809
1.33422,31721.285
1.46764,27933.221
1.60106,24453.930
1.73448,20797.465
1.86791,18388.492
2.00133,16898.953
2.13475,15208.046
2.26817,13770.499
2.40159,13354.092
2.53502,13403.351
2.66844,13018.476
