X,Y
0.00000,34884.723
0.13342,38337.086
0.26684,37005.246
0.40027,35632.113
0.53369,35542.262
0.66711,37385.148
0.80053,35531.902
0.93395,34976.301
1.06737,37126.816
1.20080,37598.328
1.33422,37865.883
1.46764,37770.637
1.60106,39754.258
1.73448,43043.133
1.86791,55893.574
2.00133,84872.406
2.13475,96313.555
2.26817,76993.328
2.40159,55339.559
2.53502,44310.969
2.66844,39041.926
