0.00000,37617.465
0.13342,38393.750
0.26684,39790.848
0.40027,40194.938
0.53369,38286.082
0.66711,39941.766
0.80053,38967.031
0.93395,40472.348
1.06737,43828.625
1.20080,45956.230
1.33422,53184.355
1.46764,74668.602
1.60106,110925.305
1.73448,131707.969
1.86791,105647.312
2.00133,68170.164
2.13475,51824.141
