x	Y_20180130_15109_14_11g	Y_20180130_15109_14_3g	Y_20180130_15109_14_5g	Y_20180130_15109_14_9g	Y_20180130_15109_15_7g	Y_20180130_15109_16_16g	Y_20180130_15109_16_4g	Y_20180130_15109_16_5g	Y_20180130_15109_16_7g	Y_20180130_15109_16_9g	Y_20180130_15109_17_14g	Y_20180130_15109_17_15g	Y_20180130_15109_17_1g	Y_20180130_15109_17_20g	Y_20180130_15109_17_7g	Y_20180130_15109_17_9g
0	13523	14851.8	15432.818	16796.021	16064.703	14646.351	14974.505	14789.496	17231.625	16336.1	15929.727	15890.852	16449.855	16747.191	14818.064	15300.371
0.1334	14220.751	15275.253	15761.193	15847.464	15146.091	15262.69	15029.307	14499.839	17384.162	15637.167	15985.111	15660.363	17323.82	16052.159	14782.8	16224.397
0.2668	14132.936	14922.488	15401.323	16266.938	15857.152	14475.756	15231.444	14822.109	16932.887	17221.324	15697.431	15623.806	16845.574	16137.847	14737.057	15974.438
0.4003	13306.999	14719.896	16297.16	15419.953	16167.131	14081.744	14937.479	14663.577	16288.027	15890.938	16103.595	16640.188	15293.937	15754.331	14101.242	16425.943
0.5337	13949.393	14721.986	16303.883	16262.195	15765.086	14845.654	15044.607	14722.2	15982.51	16565.826	15784.066	16213.273	16622.885	16485.504	14012.382	16323.259
0.6671	13998.274	14777.035	15570.824	16617.01	15705.504	15040.163	15152.027	14785.188	16180.662	15189.424	16235.455	16055.552	15999.558	16055.237	14143.159	16436.076
0.8005	14466.653	14751.104	15997.165	16350.656	15915.081	14643.396	15696.879	14473.109	16818.584	15603.196	16210.441	16004.056	16780.014	15588.315	14431.738	15106.729
0.934	13768.691	15157.883	15287.123	16001.062	16028.883	15190.846	16363.013	15032.965	15723.196	16110.084	14915.079	15680.093	16647.148	16033.33	15169.524	15113.353
1.0674	14182.239	14282.223	15657.121	17465.082	15165.683	13990.65	15980.812	14669.699	16321.809	15862.974	14724.938	15693.321	16074.256	15609.125	14865.92	15033.549
1.2008	13697.749	15357.146	15195.201	17066.412	15572.072	15840.235	16578.561	14261.36	16351.812	15747.673	14988.874	16073.057	17008.969	16548.688	15032.917	16086.349
1.3342	14601.146	15698.71	15485.56	16687.184	15614.454	15594.146	16974.811	14922.202	15803.369	16729.662	15926.191	15492.883	16408.922	15746.731	14477.434	16201.233
1.4676	15198.104	15597.236	16008.524	16385.064	16777.258	15450.693	18481.189	15760.954	16063.363	15878.942	15318.313	16064.271	16220.719	17862.305	14591.083	15056.728
1.6011	15759.784	18874.861	15478.115	16532.549	18968.186	14988.474	21949.059	16419.092	17043.15	16840.371	15302.904	16282.45	16155.559	22900.324	15234.989	16518.4
1.7345	17343.85	22639.811	15265.967	18392.336	24285.996	16305.849	29263.51	18448.039	18597.16	17601.734	16104.824	16717.145	15396.365	32996.152	17186.066	16793.791
1.8679	21557.885	34396.441	17694.947	22010.971	28943.604	17603.979	34632.578	23339.365	23244.684	20490.836	16705.809	18477.555	16293.402	55179.832	22224.402	17121.531
2.0013	26555.76	35830.652	20702.734	31161.531	27487.025	22143.699	31827.133	29713.758	33783.902	23837.43	19359.365	22129.92	17741.504	64749.562	25761.736	17864.713
2.1348	27560.398	26299.646	30008.455	37666.441	21326.73	31087.012	23692.066	29434.039	43104.207	32774.879	23926.561	27808.049	21379.023	45175.379	25086.322	19823.377
2.2682	22002.166	20040.533	42849.273	32491.705	17745.725	39219.898	20151.557	22964.049	38220.738	31553.166	34953.863	36025.289	29650.1	28168.176	20757.328	23375.066
2.4016	17865.588	16915.463	38098.207	25156.869	16901.059	32832.852	17148.053	NaN	27073.59	23499.863	41521.227	35092.684	43776.609	21639.271	17459.33	32496.039
2.535	16608.301	15563.521	25684.754	19814.904	NaN	23606.592	NaN	NaN	20059.074	19630.904	33502.305	24787.572	51090.93	18335.219	16712.709	48152.207
2.6684	15256.4	NaN	21220.994	17097.406	NaN	18725.355	NaN	NaN	NaN	18293.535	25583.449	19829.004	38575.398	17617.863	17330.721	55715.719
2.8019	NaN	NaN	19681.525	16805.184	NaN	NaN	NaN	NaN	NaN	NaN	23379.955	NaN	25834.867	NaN	NaN	41295.75
2.9353	NaN	NaN	NaN	NaN	NaN	NaN	NaN	NaN	NaN	NaN	NaN	NaN	19130.283	NaN	NaN	27358.887
3.0687	NaN	NaN	NaN	NaN	NaN	NaN	NaN	NaN	NaN	NaN	NaN	NaN	NaN	NaN	NaN	21296.732
3.2021	NaN	NaN	NaN	NaN	NaN	NaN	NaN	NaN	NaN	NaN	NaN	NaN	NaN	NaN	NaN	18777.83
3.3356	NaN	NaN	NaN	NaN	NaN	NaN	NaN	NaN	NaN	NaN	NaN	NaN	NaN	NaN	NaN	NaN
3.469	NaN	NaN	NaN	NaN	NaN	NaN	NaN	NaN	NaN	NaN	NaN	NaN	NaN	NaN	NaN	NaN
3.6024	NaN	NaN	NaN	NaN	NaN	NaN	NaN	NaN	NaN	NaN	NaN	NaN	NaN	NaN	NaN	NaN
3.7358	NaN	NaN	NaN	NaN	NaN	NaN	NaN	NaN	NaN	NaN	NaN	NaN	NaN	NaN	NaN	NaN
3.8692	NaN	NaN	NaN	NaN	NaN	NaN	NaN	NaN	NaN	NaN	NaN	NaN	NaN	NaN	NaN	NaN
4.0027	NaN	NaN	NaN	NaN	NaN	NaN	NaN	NaN	NaN	NaN	NaN	NaN	NaN	NaN	NaN	NaN
4.1361	NaN	NaN	NaN	NaN	NaN	NaN	NaN	NaN	NaN	NaN	NaN	NaN	NaN	NaN	NaN	NaN
4.2695	NaN	NaN	NaN	NaN	NaN	NaN	NaN	NaN	NaN	NaN	NaN	NaN	NaN	NaN	NaN	NaN
4.4029	NaN	NaN	NaN	NaN	NaN	NaN	NaN	NaN	NaN	NaN	NaN	NaN	NaN	NaN	NaN	NaN
4.5363	NaN	NaN	NaN	NaN	NaN	NaN	NaN	NaN	NaN	NaN	NaN	NaN	NaN	NaN	NaN	NaN
4.6698	NaN	NaN	NaN	NaN	NaN	NaN	NaN	NaN	NaN	NaN	NaN	NaN	NaN	NaN	NaN	NaN
4.8032	NaN	NaN	NaN	NaN	NaN	NaN	NaN	NaN	NaN	NaN	NaN	NaN	NaN	NaN	NaN	NaN
4.9366	NaN	NaN	NaN	NaN	NaN	NaN	NaN	NaN	NaN	NaN	NaN	NaN	NaN	NaN	NaN	NaN
5.07	NaN	NaN	NaN	NaN	NaN	NaN	NaN	NaN	NaN	NaN	NaN	NaN	NaN	NaN	NaN	NaN
5.2035	NaN	NaN	NaN	NaN	NaN	NaN	NaN	NaN	NaN	NaN	NaN	NaN	NaN	NaN	NaN	NaN
