0.00000,16336.100
0.13342,15637.167
0.26684,17221.324
0.40027,15890.938
0.53369,16565.826
0.66711,15189.424
0.80053,15603.196
0.93395,16110.084
1.06737,15862.974
1.20080,15747.673
1.33422,16729.662
1.46764,15878.942
1.60106,16840.371
1.73448,17601.734
1.86791,20490.836
2.00133,23837.430
2.13475,32774.879
2.26817,31553.166
2.40159,23499.863
2.53502,19630.904
2.66844,18293.535
