0.00000,13491.022
0.13342,14685.496
0.26684,16853.277
0.40027,20241.303
0.53369,21964.221
0.66711,21304.883
0.80053,21211.693
0.93395,19667.238
1.06737,19455.652
1.20080,19101.627
1.33422,18995.215
1.46764,18877.301
1.60106,20664.963
1.73448,19677.988
1.86791,18471.783
2.00133,17552.385
2.13475,16243.518
2.26817,15613.642
2.40159,15439.982
2.53502,13760.245
2.66844,13063.146
2.80186,12882.026
