0.00000,35484.703
0.13342,36174.477
0.26684,35953.129
0.40027,37666.594
0.53369,38032.734
0.66711,37669.953
0.80053,37647.801
0.93395,38520.344
1.06737,38395.742
1.20080,38037.789
1.33422,45032.500
1.46764,60592.336
1.60106,87282.633
1.73448,88371.086
1.86791,67154.648
2.00133,49928.074
2.13475,44725.941
