X,Y
0.00000,38148.711
0.13342,38416.855
0.26684,39887.883
0.40027,39744.512
0.53369,42688.293
0.66711,41616.973
0.80053,39858.609
0.93395,38414.324
1.06737,38733.055
1.20080,35683.145
1.33422,35802.539
1.46764,37173.391
1.60106,37879.258
1.73448,38677.355
1.86791,39996.652
2.00133,44185.855
2.13475,57437.125
2.26817,71919.281
2.40159,65919.391
2.53502,50370.391
2.66844,42904.438
2.80186,39984.883
