X,Y
0.00000,12645.669
0.13342,13138.898
0.26684,13817.992
0.40027,16018.263
0.53369,14438.676
0.66711,14015.656
0.80053,13284.771
0.93395,13311.999
1.06737,13050.172
1.20080,13423.974
1.33422,13769.709
1.46764,12466.705
1.60106,12446.062
1.73448,13134.121
1.86791,12213.907
2.00133,11953.857
2.13475,12715.492
