x	Y_20180130_15109_42_12g	Y_20180130_15109_42_3g	Y_20180130_15109_42_4g	Y_20180130_15109_42_5g
0	23260.152	24668.744	23694.531	26231.967
0.1334	23660.156	24862.66	25229.184	25825.855
0.2668	24417.158	22922.877	25007.939	25872.779
0.4003	24665.801	23450.609	23111.186	24462.83
0.5337	24053.355	24384.455	23044.854	24548.703
0.6671	23733.68	25123.379	23669.168	24239.25
0.8005	23409.902	24897.146	23322.43	24922.133
0.934	24219.076	25129.088	23673.01	26202.545
1.0674	24554.184	24528.33	23482.326	28801.748
1.2008	24143.91	27220.709	23505.18	30345.564
1.3342	24411.99	29583.402	24354.605	34534.18
1.4676	24781.961	35756.07	23469.227	47579.441
1.6011	25125.24	52552.148	26992.133	68113.117
1.7345	27661.928	67673.609	31239.311	94678.203
1.8679	34439.57	68035.648	44350.629	95373.719
2.0013	48036.363	49192.816	55178.73	65556.242
2.1348	69997.875	34724.09	51237.887	43870.098
2.2682	66063.609	29113.127	36245.676	35437.156
2.4016	46633.965	27628.236	30559.031	NaN
2.535	34048.961	NaN	28420.41	NaN
2.6684	29662.859	NaN	NaN	NaN
2.8019	26011.256	NaN	NaN	NaN
2.9353	NaN	NaN	NaN	NaN
3.0687	NaN	NaN	NaN	NaN
3.2021	NaN	NaN	NaN	NaN
3.3356	NaN	NaN	NaN	NaN
3.469	NaN	NaN	NaN	NaN
3.6024	NaN	NaN	NaN	NaN
3.7358	NaN	NaN	NaN	NaN
3.8692	NaN	NaN	NaN	NaN
4.0027	NaN	NaN	NaN	NaN
4.1361	NaN	NaN	NaN	NaN
4.2695	NaN	NaN	NaN	NaN
4.4029	NaN	NaN	NaN	NaN
4.5363	NaN	NaN	NaN	NaN
