X,Y
0.00000,36353.680
0.13342,35328.246
0.26684,34666.816
0.40027,36878.707
0.53369,36927.613
0.66711,34851.664
0.80053,36035.445
0.93395,36677.840
1.06737,34243.969
1.20080,34719.438
1.33422,34730.695
1.46764,35553.449
1.60106,36092.453
1.73448,36353.977
1.86791,36662.434
2.00133,39371.309
2.13475,41474.973
2.26817,51948.484
2.40159,70530.367
2.53502,73998.891
2.66844,56664.020
2.80186,43801.012
