X,Y
0.00000,36925.133
0.13342,35073.301
0.26684,35569.090
0.40027,34636.988
0.53369,35867.520
0.66711,35221.680
0.80053,34679.898
0.93395,35045.188
1.06737,34902.137
1.20080,34217.285
1.33422,33470.156
1.46764,34232.445
1.60106,37235.801
1.73448,39947.961
1.86791,47487.992
2.00133,65800.359
2.13475,98414.062
2.26817,101131.422
2.40159,73478.258
2.53502,51915.832
2.66844,45618.250
