0.00000,15048.217
0.13342,15494.478
0.26684,18089.074
0.40027,22317.918
0.53369,23729.186
0.66711,24665.793
0.80053,24423.354
0.93395,24509.389
1.06737,25097.057
1.20080,24446.271
1.33422,24307.082
1.46764,21749.623
1.60106,20641.975
1.73448,18891.211
1.86791,17072.867
2.00133,15194.699
2.13475,14192.771
2.26817,14001.457
2.40159,13922.333
2.53502,14114.167
2.66844,14163.839
2.80186,13526.506
