0.00000,36669.453
0.13342,35023.457
0.26684,35486.902
0.40027,35723.199
0.53369,35587.254
0.66711,35788.957
0.80053,34442.426
0.93395,36849.848
1.06737,40857.746
1.20080,48483.781
1.33422,65683.953
1.46764,96582.406
1.60106,118889.227
1.73448,99033.711
1.86791,63654.555
2.00133,47938.141
2.13475,41034.539
