0.00000,39629.996
0.13342,37682.438
0.26684,38648.809
0.40027,37562.832
0.53369,37322.699
0.66711,37656.844
0.80053,39006.547
0.93395,38562.402
1.06737,38476.520
1.20080,41298.945
1.33422,48769.773
1.46764,71304.953
1.60106,109120.891
1.73448,126985.766
1.86791,97143.164
2.00133,63405.848
2.13475,49866.348
2.26817,45144.172
