X,Y
0.00000,12746.506
0.13342,12128.817
0.26684,13242.772
0.40027,15677.520
0.53369,18062.744
0.66711,19942.348
0.80053,19606.184
0.93395,21111.162
1.06737,22188.160
1.20080,21041.373
1.33422,19782.674
1.46764,18388.748
1.60106,17334.256
1.73448,16837.537
1.86791,17289.973
2.00133,16050.720
2.13475,14665.065
2.26817,14081.836
2.40159,13677.663
2.53502,13198.417
2.66844,13520.788
2.80186,14237.336
2.93528,14384.353
3.06870,14896.844
3.20212,16039.040
3.33555,14804.886
3.46897,13811.146
3.60239,12783.113
3.73581,12267.771
3.86923,12721.769
4.00266,11978.725
