0.0000	31945.0059
0.1334	30811.7441
0.2668	30766.6621
0.4003	30248.0508
0.5337	28905.3301
0.6671	30264.9277
0.8005	31500.2559
0.9340	32598.9766
1.0674	31564.7715
1.2008	30073.5039
1.3342	31727.4961
1.4676	32327.3789
1.6011	34521.4570
1.7345	40119.9492
1.8679	54916.4766
2.0013	67599.1953
2.1347	59892.9492
2.2682	46745.7031
2.4016	41404.0117
