x	Y_20180130_15109_1_15g	Y_20180130_15109_1_16g	Y_20180130_15109_1_7g	Y_20180130_15109_10_5g	Y_20180130_15109_10_6g	Y_20180130_15109_2_10g	Y_20180130_15109_2_11g	Y_20180130_15109_2_18g	Y_20180130_15109_2_19g	Y_20180130_15109_2_2g	Y_20180130_15109_2_3g	Y_20180130_15109_2_6g	Y_20180130_15109_2_7g	Y_20180130_15109_3_6g	Y_20180130_15109_5_14g	Y_20180130_15109_5_16g	Y_20180130_15109_6_1g	Y_20180130_15109_6_5g	Y_20180130_15109_6_6g	Y_20180130_15109_7_9g
0	34090.586	37095.984	39031.695	40212.461	37559.234	31331.832	33442.105	39597.102	36974.355	37490.543	33733.547	39924.852	42272.117	35460.117	38862.133	38382.941	36284.984	35846.113	36501.762	37219.492
0.1334	34195.992	39150.727	38639.621	41572.895	36780.691	30933.994	34588.738	38479.605	37760.945	39508.402	32997.848	40620.637	40716.609	35257.531	40524.879	39590.973	38321.332	37368.547	37752.387	36813.316
0.2668	34779.969	38728.098	40912.164	40434.434	38165.566	32834.98	35709.047	34732.402	37670.852	36393.766	32255.127	41326.105	40429.051	34700.047	40422.961	39003.203	39460.125	37922.941	38255.953	36041.086
0.4003	35324.82	37848.672	40243.551	39946.48	37956.945	33707.625	34295.426	36043.887	37831.266	37576.262	33020.797	41209.723	41170.637	33295.383	40852.68	39529.246	38375.766	38403.801	38441.621	36165.371
0.5337	32878.137	36760.98	40167.172	37988.348	38592.203	33303.391	35559.992	36333.184	36666.98	37170.902	34647.23	41826.391	40850.566	33493.547	39922.762	38908.777	38572.738	37851.387	36333.105	34708.77
0.6671	32576.799	36251.496	41341.523	37883.066	37368.695	33025.969	34733.953	35559.516	34881.258	36567.496	32704.979	40100.418	40221.879	35899.988	38985.117	38979.551	39354.562	37062.461	36463.508	34882.344
0.8005	33638.5	38085.855	41947.371	40230.055	38641.148	31880.527	36236.234	36030.758	36103.824	37070.848	34219.844	41703.879	39478.805	34132.992	39898.25	39798.004	39638.801	37232.254	36588.57	34874.641
0.934	33112.965	35801.848	39608.477	40041.621	41367.84	33150.285	35897.59	36717.023	36952.191	36622.594	33717.965	41285.496	39690.102	34268.125	39949.027	39046.113	39724.996	37356.148	38265.199	36183.777
1.0674	32428.979	36180.516	38580.84	41224.637	41219.098	33594.363	33724.047	35481.551	38113.098	38038.789	34193.379	40176.047	40231.414	34978.988	39371.512	38557.773	38550.965	38140.191	37364.16	34491.297
1.2008	32180.578	37373.07	40594.312	41143.145	38456.531	33875.977	35929.367	35095.504	38663.57	36932.293	38674.777	41205.914	41205.062	35312.191	38663.93	40511.551	37304.707	37897.984	37395.82	36551.285
1.3342	34496.078	38324.371	39344.457	42585.812	38249.199	36483.582	36392.219	36741.664	42576.445	36493.754	38055.883	43376.648	41691.445	36458.73	38948.164	41991.102	36183.777	41023.926	37050.449	36882.648
1.4676	37249.414	38019.992	42551.184	44767.273	37450.344	38072.492	38948.918	36247.461	49040.359	37739.113	44947.297	46156.469	44372.047	38114.352	38440.953	43906.551	37602.352	42795.828	37962.422	38130.621
1.6011	43845.816	41234.012	44198.875	52661.375	38997.285	41737.195	46752.746	37272.051	67004.07	38062.703	60288.629	48930.246	54364.309	42284.844	38452.629	47381.051	38778.613	46831.766	37330.062	39422.613
1.7345	55947.426	49987.449	51345	73523.711	40853.105	51203.43	64165.285	42407.293	110477.023	39418.391	88493.875	57550.891	77707.258	51080.629	40009.27	57142.211	44170.16	60727.238	40972.199	45682.227
1.8679	79955.234	68046.93	72376.617	129054.938	47135.113	77782.938	92071.164	57396.301	148956.297	43764.574	111139.438	69837.391	130301.352	68487.125	39883.309	84199.406	57085.215	90714.031	47677.312	61320.246
2.0013	91868.609	91676.102	121438.039	185473.328	62190.859	110781.422	105385.312	82467.07	126271.75	58058.672	114434.992	89044.969	191503.938	109348.992	41761	125905.766	77699.281	121938.336	64027.523	93273.867
2.1348	73566.938	86866.57	187069.25	160639.844	83428.68	113967.234	84293.43	101383.625	77955.297	91593.18	82714.086	96008.672	162646.875	136351.734	49557.766	128447.32	97776.688	113082.523	76014.234	122933.055
2.2682	50128.105	59159.824	167652.766	97474.172	79956.133	80886.641	54829.254	84371.055	53507.328	150950.234	54342.742	82777.289	102055.57	100505.312	67864.562	86524.18	79304.453	75737.195	67051.047	107908.055
2.4016	40053.457	47002.629	101647.148	62792.137	59385.188	52850.332	43458.723	59077.355	44395.219	161158.875	NaN	71380.047	63466.941	63346.508	99707.578	56199.539	55318.824	53840.055	59012.367	69477.227
2.535	37440.93	42654.234	63300.453	52206.488	48562.543	41292.301	NaN	46968.52	38679.574	105269.117	NaN	66686.844	51234.262	45556.398	112450.977	46377.887	46484.457	43661.125	54103.672	50424.457
2.6684	35974.5	40379.73	49573.766	44948.02	41845.844	NaN	NaN	42755.586	37063.496	65670.922	NaN	57696.152	NaN	39752.191	89448.547	NaN	NaN	NaN	46036.789	43669.133
2.8019	NaN	NaN	NaN	NaN	NaN	NaN	NaN	NaN	37188.207	49369.852	NaN	NaN	NaN	37522.785	65366.316	NaN	NaN	NaN	NaN	39001.723
2.9353	NaN	NaN	NaN	NaN	NaN	NaN	NaN	NaN	NaN	NaN	NaN	NaN	NaN	NaN	54219.688	NaN	NaN	NaN	NaN	NaN
3.0687	NaN	NaN	NaN	NaN	NaN	NaN	NaN	NaN	NaN	NaN	NaN	NaN	NaN	NaN	47012.57	NaN	NaN	NaN	NaN	NaN
3.2021	NaN	NaN	NaN	NaN	NaN	NaN	NaN	NaN	NaN	NaN	NaN	NaN	NaN	NaN	44732.773	NaN	NaN	NaN	NaN	NaN
3.3356	NaN	NaN	NaN	NaN	NaN	NaN	NaN	NaN	NaN	NaN	NaN	NaN	NaN	NaN	NaN	NaN	NaN	NaN	NaN	NaN
3.469	NaN	NaN	NaN	NaN	NaN	NaN	NaN	NaN	NaN	NaN	NaN	NaN	NaN	NaN	NaN	NaN	NaN	NaN	NaN	NaN
3.6024	NaN	NaN	NaN	NaN	NaN	NaN	NaN	NaN	NaN	NaN	NaN	NaN	NaN	NaN	NaN	NaN	NaN	NaN	NaN	NaN
3.7358	NaN	NaN	NaN	NaN	NaN	NaN	NaN	NaN	NaN	NaN	NaN	NaN	NaN	NaN	NaN	NaN	NaN	NaN	NaN	NaN
3.8692	NaN	NaN	NaN	NaN	NaN	NaN	NaN	NaN	NaN	NaN	NaN	NaN	NaN	NaN	NaN	NaN	NaN	NaN	NaN	NaN
4.0027	NaN	NaN	NaN	NaN	NaN	NaN	NaN	NaN	NaN	NaN	NaN	NaN	NaN	NaN	NaN	NaN	NaN	NaN	NaN	NaN
4.1361	NaN	NaN	NaN	NaN	NaN	NaN	NaN	NaN	NaN	NaN	NaN	NaN	NaN	NaN	NaN	NaN	NaN	NaN	NaN	NaN
4.2695	NaN	NaN	NaN	NaN	NaN	NaN	NaN	NaN	NaN	NaN	NaN	NaN	NaN	NaN	NaN	NaN	NaN	NaN	NaN	NaN
4.4029	NaN	NaN	NaN	NaN	NaN	NaN	NaN	NaN	NaN	NaN	NaN	NaN	NaN	NaN	NaN	NaN	NaN	NaN	NaN	NaN
4.5363	NaN	NaN	NaN	NaN	NaN	NaN	NaN	NaN	NaN	NaN	NaN	NaN	NaN	NaN	NaN	NaN	NaN	NaN	NaN	NaN
