0.0000	30949.5488
0.1334	30404.8223
0.2668	30359.9707
0.4003	31259.8691
0.5337	31379.2969
0.6671	30034.7891
0.8005	32233.9883
0.9340	33183.3008
1.0674	33701.4766
1.2008	32354.0078
1.3342	33359.6758
1.4676	34762.8906
1.6011	40446.4922
1.7345	55548.5742
1.8679	78019.4062
2.0013	80624.3594
2.1347	60503.1641
2.2682	46392.9922
