x	Y_20180130_15101_27_10g	Y_20180130_15101_7_23g
0	15200.649	16297.421
0.1334	16345.613	17800.176
0.2668	16988.156	21392.871
0.4003	20175.551	22572.365
0.5337	22041.492	22394.645
0.6671	21939.773	21584.945
0.8005	21499.014	19107.566
0.934	19894.854	17577.373
1.0674	19333.932	18422.982
1.2008	19576.441	18583.852
1.3342	18882.881	19545.271
1.4676	17940.363	21225.77
1.6011	16087.022	20798.801
1.7345	16164.076	21331.646
1.8679	15956.122	23585.314
2.0013	15469.18	25665.598
2.1348	15310.408	27385.885
2.2682	15648.721	28746.23
2.4016	15048.913	24793.189
2.535	14735.29	23621.719
2.6684	15195.827	19965.408
2.8019	15170.798	17111.818
2.9353	14802.088	15054.73
3.0687	13977.286	13922.125
3.2021	13634.32	13137.826
3.3356	NaN	13563.895
3.469	NaN	13102.678
3.6024	NaN	13021.09
3.7358	NaN	NaN
3.8692	NaN	NaN
4.0027	NaN	NaN
