X,Y
0.00000,35460.117
0.13342,35257.531
0.26684,34700.047
0.40027,33295.383
0.53369,33493.547
0.66711,35899.988
0.80053,34132.992
0.93395,34268.125
1.06737,34978.988
1.20080,35312.191
1.33422,36458.730
1.46764,38114.352
1.60106,42284.844
1.73448,51080.629
1.86791,68487.125
2.00133,109348.992
2.13475,136351.734
2.26817,100505.312
2.40159,63346.508
2.53502,45556.398
2.66844,39752.191
2.80186,37522.785
