0.0000	38090.3516
0.1334	37486.5312
0.2668	36594.0508
0.4003	36129.5625
0.5337	34853.7227
0.6671	34588.7734
0.8005	33205.5898
0.9340	34175.2305
1.0674	32824.2500
1.2008	33691.5742
1.3342	35269.6016
1.4676	36245.5781
1.6011	40977.5625
1.7345	50524.7344
1.8679	65355.2656
2.0013	64272.1602
2.1347	48090.8359
2.2682	42052.9492
2.4016	38337.4961
