x	Y_20180514_15338_c2_1_3g	Y_20180514_15338_c2_11_8g	Y_20180514_15338_c2_12_12g	Y_20180514_15338_c2_12_15g	Y_20180514_15338_c2_12_16g	Y_20180514_15338_c2_12_3g	Y_20180514_15338_c2_12_8g	Y_20180514_15338_c2_13_10g	Y_20180514_15338_c2_13_1g	Y_20180514_15338_c2_14_11g	Y_20180514_15338_c2_14_2g	Y_20180514_15338_c2_14_3g	Y_20180514_15338_c2_14_4g	Y_20180514_15338_c2_16_10g	Y_20180514_15338_c2_16_1g	Y_20180514_15338_c2_16_2g	Y_20180514_15338_c2_16_4g	Y_20180514_15338_c2_17_2g	Y_20180514_15338_c2_17_7g	Y_20180514_15338_c2_18_6g	Y_20180514_15338_c2_19_1g	Y_20180514_15338_c2_19_8g	Y_20180514_15338_c2_2_1g	Y_20180514_15338_c2_2_3g	Y_20180514_15338_c2_20_1g	Y_20180514_15338_c2_20_2g	Y_20180514_15338_c2_23_12g	Y_20180514_15338_c2_23_1g	Y_20180514_15338_c2_23_6g	Y_20180514_15338_c2_23_9g	Y_20180514_15338_c2_25_3g	Y_20180514_15338_c2_25_4g	Y_20180514_15338_c2_26_2g	Y_20180514_15338_c2_27_2g	Y_20180514_15338_c2_27_3g	Y_20180514_15338_c2_29_2g	Y_20180514_15338_c2_3_4g	Y_20180514_15338_c2_3_7g	Y_20180514_15338_c2_30_1g	Y_20180514_15338_c2_32_2g	Y_20180514_15338_c2_33_12g	Y_20180514_15338_c2_33_2g	Y_20180514_15338_c2_33_6g	Y_20180514_15338_c2_33_8g	Y_20180514_15338_c2_34_2g	Y_20180514_15338_c2_34_5g	Y_20180514_15338_c2_35_4g	Y_20180514_15338_c2_36_2g	Y_20180514_15338_c2_36_4g	Y_20180514_15338_c2_36_7g	Y_20180514_15338_c2_36_9g	Y_20180514_15338_c2_4_11g	Y_20180514_15338_c2_4_2g	Y_20180514_15338_c2_4_3g	Y_20180514_15338_c2_5_3g	Y_20180514_15338_c2_5_4g	Y_20180514_15338_c2_5_8g	Y_20180514_15338_c2_6_6g	Y_20180514_15338_c2_6_8g	Y_20180514_15338_c2_7_11g	Y_20180514_15338_c2_7_7g	Y_20180514_15338_c2_8_10g	Y_20180514_15338_c2_8_3g	Y_20180514_15338_c2_8_5g	Y_20180514_15338_c2_8_9g	Y_20180514_15338_c2_9_11g	Y_20180514_15338_c2_9_12g	Y_20180514_15338_c2_9_6g	Y_20180514_15338_c2_9_7g	Y_20180514_15338_c1_1_10g	Y_20180514_15338_c1_10_1g	Y_20180514_15338_c1_10_7g	Y_20180514_15338_c1_11_2g	Y_20180514_15338_c1_11_3g	Y_20180514_15338_c1_11_4g	Y_20180514_15338_c1_11_7g	Y_20180514_15338_c1_12_2g	Y_20180514_15338_c1_13_1g	Y_20180514_15338_c1_14_1g	Y_20180514_15338_c1_14_4g	Y_20180514_15338_c1_14_5g	Y_20180514_15338_c1_14_9g	Y_20180514_15338_c1_15_4g	Y_20180514_15338_c1_17_1g	Y_20180514_15338_c1_17_8g	Y_20180514_15338_c1_18_5g	Y_20180514_15338_c1_18_8g	Y_20180514_15338_c1_18_9g	Y_20180514_15338_c1_19_18g	Y_20180514_15338_c1_20_6g	Y_20180514_15338_c1_4_2g	Y_20180514_15338_c1_4_5g	Y_20180514_15338_c1_5_2g	Y_20180514_15338_c1_7_11g	Y_20180514_15338_c1_7_4g	Y_20180514_15338_c1_7_5g	Y_20180514_15338_c1_8_15g	Y_20180514_15338_c1_8_1g	Y_20180514_15338_c1_8_7g	Y_20180514_15338_c1_9_10g	Y_20180514_15338_c1_9_6g
0	29018.0312	30442.4805	35350.1445	31389.0234	33798.1953	33088.1289	32319.0098	31762.9297	31312.1152	31695.5781	31409.0723	29930.127	32049.7871	31265.0859	32559.1504	33461.1094	33955.2891	33954.8672	28595.7266	33125.8242	33289.7852	36536.4062	32813.5391	33492.9961	32222.8203	27455.6699	30902.793	31825.1582	29812.459	30408.8516	30782.2324	32442.043	33611.4844	31806.4102	31989.0234	33013.668	29124.4219	31351.6445	33362.4219	32807.9805	32602.4863	31631.8848	30600.9629	31614.3594	28856.5723	34030.8906	29805.1094	35553.0195	32944.0273	32306.9785	28919.9902	34080.5625	33850.8477	31120.0469	34984.9961	31679.2734	30327.6816	33487.5	31908.8008	32847.5781	32262.1289	32233.1367	33258.5898	33321.1055	34985.2773	34068.332	32754.5586	31064.7617	34172.9727	28828.8555	34244.2812	33955.9609	36031.75	33597.4922	33961.1367	33836.9609	29901.9609	32750.25	32323.4277	33103.2305	34636.6484	33172.2461	32708.9238	27731	31666.6543	32205.4492	29917.8887	35027.6445	29013.5918	31182.4258	28261.0527	27219.5938	25268.9785	26695.1406	33100.5	26460.2285	31031.7188	26427.4531	33035.5	29734.9629	29525.3828
0.1334	29446.5645	31690.9492	35821.1641	31386.7422	33377.2891	32006.7344	32767.9785	32049.7891	32631.1094	31130.5898	30359.3047	29516.3027	31975.8203	30891.1895	30753.0469	32736.7031	32857.5117	32929.9141	27140.6094	33117.3398	31940.1777	35879.9727	34208.6328	34276.0664	32468.3125	27569.7129	30897.0352	32729.5391	28082.9355	30960.2734	31255.6758	31891.2969	35088.9883	32068.7656	32424.1094	33073.7109	29189.1445	31753.5312	33529.0938	31557.334	31095.2539	32155.7422	31565.3906	31642.7949	28617.6953	34600.9492	30501.123	35425.8867	31484.5	31097.918	28677.6855	33061.0859	32771.2188	31237.1035	34064.1055	32962.7031	30858.0488	32271.666	32208.8594	33093.5352	33014.3555	32466.6934	33739.3477	34606.7031	34095.8203	33266.0312	31779.7598	31514.5176	35343.5391	29443.9141	33125.2422	33752.9297	34573.293	31993.8711	35256.1523	33426.9297	30593.5176	32884.168	31939.2129	32632.0371	34995.0586	32649.7754	32549.2051	26593.6406	32175.8164	32098.3867	28565.0273	34191.8867	29799.7422	32362.4258	28096.7012	28512.7617	25546.6797	28919.9492	33303.7031	28051.3574	31036.7656	26684.5703	31389.8066	29284.7363	30563.0449
0.2668	28874.2695	32353.1289	35454.9688	30763.1445	32500.8379	33236.8555	32004.748	30473.1504	31308.2109	31227.0039	31028.7852	30504.498	32863.2422	33075.5039	32479.168	31482.1797	32395.248	33184.7188	27357.709	34882.9766	34358.7852	35565.5625	33471.6133	34562.4297	31751.0723	27271.9062	29890.1211	33176.7188	27995.3418	30420.0156	29906.2266	31653.6738	34777.8789	31237.4824	32313.8574	34151.6016	29088.4297	31152.7637	33870.9609	33684.5391	31420.2949	33273.3516	32338.1953	31053.4199	28625.0586	34966.1094	30919.2012	34449.5938	32399.8145	29993.2598	28321.9707	32938.2539	35606.9727	31472.0801	33010.7383	32528.8145	30062.1484	32215.5176	31787.3398	33496.4141	31163.3066	34455.5117	32870.0664	34091.8477	35839.6953	33948.5625	32184.4883	32177.3379	35574.9102	30108.3359	32229.2305	33444.0234	33600.7891	33172.2539	34722.6641	34563.832	29019.7031	33929.9023	32373.2656	33193.3984	35532.2891	33807.2031	32556.0586	26821.6328	31787.375	31569.5352	29931.2441	33235.3633	28764.373	30511.6973	26961.0566	28073.459	25307.4648	28297.1035	33220.7969	27299.9551	30126.2539	25903.7676	33067.1836	30162.8398	30980.8516
0.4003	29414.0195	30857.7598	34428.3828	30977.6836	33250.1484	31505.4023	32630.5039	30004.7344	29801.209	31649.8516	31924.0957	30436.3281	33491.8242	32014.0645	31826.877	32455.8828	32589.5625	30951.5801	27530.1309	32857.2344	33122.125	34865.0898	31864.0918	33964.4609	32203.9434	27695.9082	30561.8965	32117.998	29454.8125	29841.2949	29789.8418	32768.2422	32940.4062	31342.3711	31110.4766	36476.0625	31022.4707	31566.9609	32443.9707	34724.5742	32410.0801	31832.2734	31388.8398	30205.7441	29074.3809	34009.1211	32261.5566	33611.5	31741.8652	31599.1211	28860.6992	32735.8965	35434.9688	32165.9551	33697.2148	33206.9141	30689.1992	33258.293	30515.0273	32913.1641	31499.0215	34634.0391	32939.8594	33291.8281	34726.7461	34241.2148	31771.8223	30580.8535	33061.7539	29393.5273	31697.0293	33764.4375	34898.7305	33083.832	33390.668	33745.8164	29581.4004	32617.5312	32903.5	32808.1406	34973.1875	32754.3184	32008.0488	27148.2129	31783.0137	31026.4805	29522.168	32320.4082	29711.9023	31313.3379	25979.6094	27089.8672	25585.877	29391	34839.918	27831.9668	28950.6562	26507.1582	34000.0156	29396.1035	30523.8164
0.5337	29311.9355	31568.9766	33042.4297	30700.9258	33831.8164	30478.5	32293.2695	30152.9922	30632.4043	30652.0625	30279.168	30815.2891	32606.3105	29719.252	32966.4531	32305.1562	32169.9648	31765.1211	27950.9766	32826.1836	34438.293	34425.6758	34176.3125	32998.6211	30765.8867	28225.2734	30515.3379	32637.8398	28104.9258	28551.6309	29370.7266	33319.7578	32814.2031	31441.8086	32840.0625	33175.1328	30848.9648	31284.1484	31488.123	34130.5703	32943.957	32393.418	32724.9395	32058.4414	28403.1816	33435.9844	30922.9434	33652.9531	32936.0234	31950.207	29013.6406	33805.8047	33614.8398	31637.2559	34526.7344	31919.457	30636.6738	31762.498	31089.9902	33486.8711	32384.0215	33129.7031	33147.0898	34236.1289	34770.8125	33232.3359	31013.3848	31355.1035	33311.8438	29272.4824	32941.5195	34034.0781	34086.9531	32305.1035	33855.2617	33706.6328	29403.2227	31434.1992	33212.1914	33347.1484	33847.0391	33673.2891	30832.4141	26989.5332	29915.2656	32443.3418	30400.002	32269.0586	30586.1426	31612.9258	26791.6836	26806.4961	25566.5332	28032.8477	35255.2539	27466.4629	29837.6758	26403.1953	35022.7578	29845.0312	29937.627
0.6671	29706.75	30767.0996	34383.3906	30083.1016	33177.8359	32410.123	32177.7695	30797.0137	31047.9844	31304.7891	29865.4434	30441.1641	33013.0703	30494.5273	31442.6133	33174.0508	34314.8164	33134.2656	27141.3809	31624.1543	33647.5117	35253.1016	33375.3086	31907.4453	32120.2734	26962.4316	30431.6152	32601.6934	27799.168	30917.6797	30764.2949	34845.375	30776.3555	31566.5547	31488.0781	33019.0117	29415.666	32359.166	33863.5781	34548.8945	33241.0898	33770.3516	32687.584	31501.2168	29093.5918	35226.2852	31988.7715	34551.6562	31463.8477	31839.4238	29099.4277	34981.2891	32596.4922	30720.209	33461.4766	33745.625	30682.5645	32625.6348	30002.8242	33181.8945	33377.2617	32160.3965	34704.6445	35676.6484	34420.1914	33250.3711	30429.8633	32909.3828	33196.875	29854.9609	32678.7715	33650.4688	35104.0078	31798.9961	32287.877	32788.668	28317.2227	33072.8711	33238.2305	32612.8281	34510.9062	32230.4355	32222.9824	27507.7051	31046.9082	31280.9336	30480.4512	33594.1641	31897.9375	30725.0781	27512.6777	27031.8613	24522.7129	28048.9023	33057.1328	27736.3906	29271.2422	26429.3945	35458.1641	30090.5605	30236.0078
0.8005	29530.7832	31451.8145	35476.6562	31036.3691	31592.5801	32949.8672	31795.0371	31254.7363	31254.7812	30591.6875	30292.584	30121.4727	30891.4707	31334.2773	31556.5859	33723.6758	33427.6836	31091.1914	28346.3555	33671.2695	32897.668	34802.4062	35201.5625	32738.2988	33366.2422	27644.1953	29884.0645	31785.7402	29824.0977	31320.6348	29678.25	33794.5977	31351.9277	31979.1465	31407.5156	31962.7051	30564.8652	32766.5078	33363.5859	33672.9219	32064.9746	33366.3438	33574.4609	30700.2031	28814.5801	34534.7734	32331.7715	35482.168	31481.3066	31555.7402	31260.7852	34764.3281	33255.4922	30150.793	33194.7891	33770.5742	30850.1172	32209.8027	31302.8652	33462.1211	31447.582	32252.2637	35403.8945	36055.8125	35466.4648	32761.0957	32272.2363	31476.3633	34065.2148	29706.127	32552.8984	33723.9375	34293.0586	31094.3965	32018.1699	32806.5078	30631.5156	34442.5898	32821.5977	33656.4453	34844.1484	33702.6953	31466.4883	28945.5957	30908.918	33318.4102	30173.0469	33103.3945	30855.5879	31838.9414	27138.2227	28059.9746	24853.7695	28133.7676	34425.6523	25549.0273	29225.3867	25572.0645	33885.7969	30430.9863	31223.4219
0.934	29731.6133	30956.8965	34231.6133	31127.3145	31204.5898	33066.9336	32425.1309	31158.5254	30667.0391	33021.4414	30344.9648	31641.4434	31820.582	30486.6348	31930.1562	34271.6562	32683.3945	31543.7734	30198.5742	34741.7344	34703.957	33600.1992	37487.4336	33573.6641	33147.3555	28248.8477	29576.1719	33279.7891	31207.4766	32148.5098	29182.916	33402.9492	32442.3555	33766.875	31784.9199	32566.9961	30916.8496	32650.1914	30941.8828	33975.2617	32035.8105	32658.0156	34789.5508	30099.2383	28433.1113	34350.1836	31736.7559	33147.6211	30522.6699	32620.9766	36633.2305	31830.7246	31001.8906	30232.5645	33402.7773	36811.2344	31533.2344	31161.293	30834.2793	34933.9336	33859.582	34233.957	34130.6406	36878.3008	36292.4688	32676.7422	31906.8945	30850.9062	32024.9473	29790.6055	32317.8984	34126.3906	36023.1406	32411.6348	32601.5449	32966.7969	27772.1836	32737.9473	35689.0352	34799.8555	34667.8438	32784.2422	32911.918	27711.9629	31553.5078	33890.4805	28719.8359	34938.3828	30678.9766	33481.3008	27801.207	28706.877	24931.7344	27639.4336	36001.6133	26267.0312	29387.2559	26489.1152	32986.793	31004.8066	31453.4688
1.0674	29623.9805	32869.8398	34063.0195	30994.8672	31598.3652	32338.4121	34168.9219	31680.6992	33265.8281	33237.7891	29384.5508	29963.0078	32262.2168	32297.957	32347.4023	32068.7891	32493.7539	32989.0898	29310.2891	34592.5039	33296.168	34608.0938	41339.4688	33464.0312	32430.8184	29324.1641	29948.2285	33650.957	30013.6426	32169.5801	31803.2207	34191.875	32404.5449	32294.3789	33161.0156	32639.6426	33213.0117	31087.2754	31829.4766	34709.3164	32876.6875	32946.1875	36245.0664	31198.8398	28996.9863	36418.1758	33181.4297	35366.5586	30898.9785	32267.4688	53765.1523	33048.2383	32223.1406	30412.9531	33482.1836	40332.0547	30888.6699	33213.2539	31354.4805	34076.1562	33046.2539	35310.4062	33135.1758	37182.6445	36052.457	34797.7031	32364.4355	30492.8184	33076.8594	30114.3652	32058.8516	33385.2031	37316.957	32374.6738	32878.6406	32294.8047	28196.7285	33084.5742	40116.2969	35082.3594	34842.7188	34459.4922	31605.5957	29801.9648	32060.584	32289.4258	30916.0762	36351.2188	33647.9453	32968.8203	26182.5332	27557.6309	23724.6836	29312.0156	32039.5449	25593.4922	28797.7363	26300.752	33857.543	31637.2031	29563.4121
1.2008	30121.832	32114.457	33498.9531	32122.6777	31103.1582	32343.3477	32803.4453	32465.1113	32764.8125	34444.5703	28722.2207	29519.6113	31771.252	33824.1836	30750.0488	32136.7832	32507.0684	33106.1758	31292.0977	35681.2031	34335.7891	34103.0547	47104.4609	33366.2617	32273.2949	29807.5195	31537.5195	35033.4883	31634.7422	37205.7656	32254.7559	36188.3086	34444.4688	31815.1816	34190.6328	31608.0352	33785.2109	32466.5293	31081.1172	33329.0156	32744.6543	31405.2969	43734.9023	31868.998	30468.9512	37235.9961	33050.1875	35929.1016	31629.2031	33471.0273	82898.4766	35263.6289	32479.9824	30902.6699	32535.9238	48350.7266	33169.6914	36194.8516	30693.2656	33832.6211	32435.4961	34793.1914	32848.2305	41557.0703	34986.5078	37827.7266	33688.3242	31631.7246	34568.3867	29531.8555	31753.5137	33157.668	39012.4297	32903.9648	32067.0879	31025.6953	28700.5996	32648.3574	47401.8867	34424.3281	36228.9922	38309.6133	32286.7344	29769.293	31787.1582	33020.8086	33541.1758	42690.2031	32331.8398	37911.4805	27208.5605	28268.7363	24461.1758	27558.1289	34690.9141	26475.334	28912.6445	26616.4023	33428.8867	34300.3477	31285.2754
1.3342	31497.3496	36678.8047	35118.0547	32101.0098	32288.3633	34992.7461	33636.1602	31101.0273	33051.4492	36814.625	29780.5312	31408.2109	32072.9941	34071.3867	33068.8789	34212.2578	35032.4688	34691.207	32099.7578	33190.3164	37027.0469	35872.9531	65395.6133	33058.5	33405.6484	32547.0742	32482.8066	37754.1875	33240.4961	48717.4297	36033.1484	42362.7656	36523.5547	31353.9258	37581.0352	32802.9102	36038.6055	33629.8242	32046.2559	33064.4297	33713.6055	34108.1641	59793.168	33023.0234	30979.5059	39801.3477	33043.832	38707.0742	30963.4766	36831.1055	100207.375	36674.5664	31806.4688	30806.8672	35524.3125	70293.1484	37568.6602	45313.4766	30031.7676	35426.1406	33963.0312	34202.582	32706.8867	51022.3555	33613.1367	47772.2266	35155.5508	32463.2266	34045.5508	31772.2051	32020.9102	35878.9102	47591.2539	34570.3789	33368.7734	33362.6641	28556.8828	33266.3906	69377.9922	34346.6758	36859.8398	41854.5078	33269.5703	35136.5938	33295.6992	35193.9531	42805.9648	56584.7539	34270.7891	49972.0586	28587.0312	29408.1641	24014.6914	30034.9414	34954.543	26429.1094	30116.375	27105.5098	36126.6523	41164.5039	32171.6133
1.4676	34467.5	42780.1406	36104.5547	32423.9883	34544.3438	39319.6172	35028.6914	30948.123	38384.7188	37972.3125	30049.0762	33591.3281	32256.1973	40677.6328	33557.3906	37312.5391	35685.6641	36349.0938	38115.0469	37353.6484	44045.6367	39944.043	106568.4062	34245.207	36717.6055	43090.2969	34227.8203	48480.8008	40464.8672	73963.2188	42736.0117	56864.4648	42817.7539	32200.9277	45750.9062	35990.2383	42973.2734	35621.5391	35742.168	34451.957	37692.0938	37035.3242	95913.1406	30973.1699	30942.623	46709.3047	35878.332	44972.8711	35708.6406	43551.6953	80152.2188	39058.8984	33835.1484	32467.334	38800.5703	114703.6797	46493.3789	66055.0625	31711.8652	36010.2539	37662.2109	35503.0039	33961.8516	71340.3594	32316.5488	63664.8516	35687.6367	33649.4062	34554.5664	32234.7988	31627.2051	37493.9062	71202.6797	35373.6758	34889.8789	35463.7227	30209.8027	33272.1406	109081.0391	35035.8164	41459.7695	61440.6992	34349.5273	40408.1328	35251.3398	36353.0625	62671	83690.9062	39574.4414	69499.8438	29487	30131.5566	25500.7109	32618.2988	35680.9453	27605.1738	29042.5215	31368.5176	37538.0391	61280.3359	32829.9141
1.6011	42557.2695	61526.875	41274.7266	34257.3047	37830.3242	48942.3164	34457.0508	29101.2324	51950.9688	45888.6133	33202.7773	36916.7109	32061.8164	53320.3984	33974.8047	43213.9648	41903.1758	40904.2148	52534.8789	39652.6445	63790.4727	48232.9922	156013.625	35615.7227	40853.375	61636.6562	42507.543	74866.0625	58236.0195	99532.3594	56608.1914	90801.3438	58220.2188	36776.8906	65786.0547	39972.4609	59036.7227	40342.6016	38275.082	36741.0117	42631.4531	40417.4883	121290.0547	30721.959	36482.082	66510.5312	41327.9258	53424.2383	43251.5156	62903.7656	53279.1641	46682.1836	36159.5859	32902.1328	50501.5625	132442.4688	68431.8438	81318.3125	30132.0488	38060.5586	42902.3008	40406.957	35589.625	107837.3125	33606.3125	70573.4922	41626.3789	34773.3438	38985.9141	36980.8047	31769.5195	37427.8438	107868.4844	37162.9492	38430.2773	41077.7656	32230.3789	35071.6875	119249.2031	34967.0586	51606.832	106179.0547	34259.2266	38913.9766	38965.3203	37719.25	100903.9531	140614.0625	53889.6172	76138.2422	29901.6172	32839.0273	24247.6387	38798.6289	40061.9258	27432.8691	29348.6523	41331.7891	49322.1602	84395.0625	35617.9023
1.7345	63886.0625	98432.2891	47160.3906	38438.9219	47043.125	69408.1328	37584.8008	33556.2031	83908.7031	64257.9766	38179.9805	46671.9453	35896.6289	79020.7422	34961.6133	56844.8203	57834.6289	57973.1797	85836.8125	46134.1016	97004.5703	68725.8984	151460.4219	43291.6914	56021	75888.6406	55637.6016	114510.5156	83700.1406	78430.4766	70660.0469	126270.4531	85168.8672	42091.1367	92836.4453	45082.9297	89838.0391	54698.8125	44723.8711	42746.4961	49743.1992	53754.6055	100297.8047	30827.0156	46606.1094	105608.1484	52423.0078	75251.2812	62298.3789	75926.5938	40719.8711	63757.6406	40035.6836	38603.0859	72374.125	96682.8828	81216.7656	69173.9062	30048.9883	43017.9336	61313.7891	54178.8438	40687.1914	118068.1641	36081.082	57873.7773	56891.0859	39005.3125	49444.9062	46350.2422	32132.7598	39714.0938	126145.5469	41923.6836	45600.7461	55225.207	36691.5078	40893.3945	86979.9375	38106.9766	72792.4531	150404.2188	35818.1797	34908.7617	53114.8438	49579.6172	122506.7578	169026.1562	76154.1094	59972.3086	34086.7109	41870.2617	26551.25	54421.8633	50155.4023	29132.2285	35325.7148	60665.6562	74270.875	79833.6953	40409.2109
1.8679	89550.3828	132666.4062	70936.8828	47410.9297	72973.0234	82496.7031	41736.5742	37426.1953	124596.1641	112621.7344	49422.3516	70048.8594	43242.207	83011.1406	40729.5742	84453.3047	76906.7578	92618.5312	115398.4062	64155.6562	108953.7031	100027.3125	97984.3125	61077.7305	84059.5625	65995.3984	67895.2578	120011.7266	82162.9844	52498.8945	62965.2578	111816.6016	89817.3047	53772.293	94800.9062	64848.1719	100147.7266	82531.7031	66120.1875	54131.5	78269.0469	88078.6953	61572.3242	34661.5742	80126.6797	118378.7422	61704.6719	121352.2266	99833.5938	67286.1562	34172.6484	90266.9531	51878.9414	47011.043	90415.9141	58206.1289	66844.8438	48255.9609	31824.9941	57232.5664	90923.0156	78578.0859	52252.2695	83662.6641	40202.625	45560.1289	88099.9688	52736.9609	70153.0469	63727.9922	36238.6758	47209.1953	97178.8984	50810.1328	64554.6758	68776.4062	48847.1641	60645.3945	56603.8359	44616.2422	101620.6094	133192.9062	46285.9453	32486.6152	82112.8281	76721.4609	93293.0391	128993.0703	106484.9844	NaN	40399.5273	52332.6758	30859.1621	83898.5156	70803.3672	30910.7891	49193.6953	76790.3203	87488.7656	56212.3789	57584.5508
2.0013	85543.375	108592.9141	98214.2734	71270.8438	99810.4062	66835.7031	59225.168	44159.5547	119828.9531	144482.3438	73819.1562	106257.125	64284.1719	62123.5547	56172.7969	124170.9375	77688.2578	117228.8047	96593.2344	85331.2891	85343.6484	103167.5234	58817.1523	98846.4062	104554.0312	45518.4453	58261.7344	81956.7578	53066.4961	41547.5703	45789.875	72948.4531	64922.3359	86417.1094	69731.5312	102955.4922	73642.8672	102832.4609	93665.2031	81719.4141	116726.5703	140333.7969	43013.3125	40563.8164	128345.8906	83649.7109	55365.8555	168049.8594	127573.0859	52307.7109	NaN	89200.8203	75000.0391	68100.2891	78452.9375	42131.9453	45679.8359	NaN	31574.7656	82842.0781	94668.6016	104030.3828	81422.0312	52671.8594	47821.3398	36001.8125	120081.9297	89392.7188	88882.8438	70127.3906	40729.668	64526.0859	63131.7266	72357.5703	84242.8438	66439.8281	74663.7891	90046.6797	41828.9062	58620.2461	93712.2344	82720.3281	66124.8203	33426.4258	102992.2422	117772.9062	58958.4531	76404.0547	114581.9922	NaN	53192.2461	50179.2461	39921.5859	96992.1719	110883.6641	35270.3242	70968.6797	65400.4336	68906.6094	39867.5195	81518.2266
2.1347	55529.7188	65038.6875	98011.8594	99625.2734	97242.2031	45544.8906	90189.2422	51801.8711	79248.5	120100.3438	106653.8828	107780.6172	89760.2422	44994.4141	82940.5938	130731.3125	59477.6055	90921.0391	62910.7031	74480.1016	63192.4883	72188.1953	46900.4023	128655.375	81916.9219	35466.0859	42733.7188	53962.3945	37892.7734	NaN	38061.1055	49527.207	47260.8477	108013.4219	47595.5781	115533.1641	49806.5977	82217.1719	96608.5938	114898.8984	114537.5469	144075.2812	37124.3867	54577.4609	131617.7969	55499.3477	44406.8242	145003.6719	107838.6406	40920.8828	NaN	63904.832	98921.9609	94105.2734	56488.9453	37193.1172	35988.918	NaN	31936.7031	101673.3047	65729.4531	93489	98103.9375	NaN	53446.4297	34888.7969	109167.2344	125702.9688	78729.5234	59084.3828	48347.0625	104414.7656	47598.5156	100724.6328	79701.5547	48673.0547	92012.1406	102326.9375	39601.3242	89919.3438	62837.4922	54599.3906	93162.2812	32455.3965	89851.4375	118262.9375	43832.75	52823.7461	80868.2734	NaN	62998.8711	38954.6406	51556.3398	75723.8047	137468.9062	40669.0117	79387.3984	45035.2539	49648.6562	34315.8047	84018.4297
2.2682	40415.4102	46709.7969	70387.5781	95507.625	69863.2969	37748.9375	110375	48419.2734	47381.8789	74267.0703	101747.9297	78712.9844	83747.8125	37999.0938	94665.4688	91244.375	41523.0078	60709.6016	43649.418	54437.8242	49594.4336	49975.3516	46763.6328	109859.1797	53870.6016	NaN	37000.875	43080.9258	33060.2188	NaN	32949.3945	39983.4297	NaN	85821.1016	39015.5352	86551.8125	40094.2344	56739.5469	69790.9609	105982.2969	77509.6953	99768.9375	35922.4688	90880.0078	86524.0703	43506.7891	38926.0781	88335.75	71719.7109	35753.9727	NaN	46179.0039	84580.4688	83223.0781	48326.2539	NaN	31514.7754	NaN	34632.793	89979.8828	47683.3555	63559.0469	81975.3984	NaN	47460.6641	NaN	71715.9766	112412.3828	56868.1797	42742.3203	63041.3086	129294.4141	NaN	99838.1484	58767.4609	40912.8633	71612.4531	75103.6406	NaN	132191.2188	45544.0195	42972.8672	105243.3672	NaN	62339.7656	80202.9531	38678.75	42249.3789	49386.6836	NaN	53928.2109	33789.6211	54627.3555	46224.0156	103265.0938	57575.7461	60078.293	35400.4766	40765.5859	29424.3555	61914.9453
2.4016	34849.9297	37794.9531	47492.5586	64130.1211	49116.8672	34121.9648	87216.6641	39753.8594	36648.5156	49028.0273	69416.6641	52727.3906	58126.4453	NaN	73091.1406	57576.8359	36492.2305	45547.7734	36584.2344	43947.6367	41199.9727	40636.0195	44972.2539	69079.0078	40354.9531	NaN	34245.0469	36657.4961	32612.6621	NaN	32041.1875	NaN	NaN	55271.793	35676.875	57028.1523	37571.1875	41952.7812	46168.6836	68589.4688	51464.7695	60369.6328	38512.8125	121507.6797	55094.2656	39834.5273	34682.8281	53178.7266	49460.7383	NaN	NaN	39814.9609	56367.1211	56378.3242	42969.9727	NaN	NaN	NaN	43649.0039	56961.7227	38715.5	45607.7109	55652.9062	NaN	38461.625	NaN	52046.6484	74767.5547	44503.9961	35349.2734	67484.375	100543.6406	NaN	67740.8125	NaN	37916.7109	47494.9102	51481.1836	NaN	127638.8516	39150.7031	NaN	76355.375	NaN	46238.0898	55464.1758	NaN	44554.5977	37231.3086	NaN	38532.9258	NaN	45398.8711	36086.2773	63727.8203	75470.2031	42724.0781	28387.6797	35024.1719	28654.2715	44382.7539
2.535	NaN	35589.6484	39523.8945	46438.8711	39286.8672	33683.8516	59046.957	35682.2695	33543.8047	40102.4023	47741.8633	41576.6719	41587.0391	NaN	49603.8281	42727.0703	34958.5156	39106.3828	NaN	42927.3789	39397.3555	38414.25	NaN	51763	36059.8242	NaN	NaN	36322.4062	NaN	NaN	31767.4355	NaN	NaN	42108.3906	NaN	43514.8672	36604.3359	37657.0352	38662.8477	46432.2461	40458.2109	44329.6172	NaN	101483.6406	NaN	NaN	34222.2578	39344.1484	44192.6055	NaN	NaN	NaN	41371.3945	42846.9609	NaN	NaN	NaN	NaN	62533.207	NaN	36764.6523	37213.8984	44195.4141	NaN	38392.9531	NaN	NaN	48489.5234	38634.0781	NaN	53874.7617	64235.1836	NaN	46100.9375	NaN	NaN	35541.8594	NaN	NaN	89641.9062	NaN	NaN	52684.4297	NaN	38295.793	NaN	NaN	NaN	34711.5664	NaN	NaN	NaN	33268.8984	31691.1934	46957.6562	65442.7148	35422.2734	27605.418	34444.5547	NaN	36813.7812
2.6684	NaN	32427.2168	37032.1406	37189.7773	37620.3477	NaN	NaN	34305.9531	NaN	36315.5586	37445.5898	NaN	NaN	NaN	41603.0547	NaN	34388.5312	38003.4922	NaN	NaN	34860.8359	NaN	NaN	44599.8281	34534.4258	NaN	NaN	NaN	NaN	NaN	NaN	NaN	NaN	35766.375	NaN	37257.5547	NaN	35705.6953	36854.8594	36098.0938	39240.8906	39828.668	NaN	65726.375	NaN	NaN	NaN	37549.7383	41551.3047	NaN	NaN	NaN	34841.3164	38003.4727	NaN	NaN	NaN	NaN	97831.8125	NaN	NaN	34519.5195	NaN	NaN	NaN	NaN	NaN	38046.3789	36731.0391	NaN	41089.9531	46855	NaN	39051.1953	NaN	NaN	31405.2949	NaN	NaN	57538.6484	NaN	NaN	40568.0352	NaN	NaN	NaN	NaN	NaN	NaN	NaN	NaN	NaN	28679.9062	30145.2695	37760.8672	45783.3242	NaN	NaN	NaN	NaN	34169.0938
2.8019	NaN	NaN	NaN	NaN	NaN	NaN	NaN	NaN	NaN	34587.1875	NaN	NaN	NaN	NaN	36192.7852	NaN	34263.3438	35894.957	NaN	NaN	35749.1133	NaN	NaN	NaN	33207.8281	NaN	NaN	NaN	NaN	NaN	NaN	NaN	NaN	NaN	NaN	35412.6055	NaN	NaN	37848.1602	33405.4727	NaN	37028.8438	NaN	46389.6523	NaN	NaN	NaN	36180.7305	38736.5312	NaN	NaN	NaN	32756.1465	33367.3906	NaN	NaN	NaN	NaN	122732.5391	NaN	NaN	NaN	NaN	NaN	NaN	NaN	NaN	33721.2383	35335.3594	NaN	36857.2617	38761.5391	NaN	NaN	NaN	NaN	30639.7031	NaN	NaN	44039.6367	NaN	NaN	35307.9688	NaN	NaN	NaN	NaN	NaN	NaN	NaN	NaN	NaN	NaN	30040.2539	34688.8672	34924.9688	NaN	NaN	NaN	NaN	32517.6562
2.9353	NaN	NaN	NaN	NaN	NaN	NaN	NaN	NaN	NaN	34612.0391	NaN	NaN	NaN	NaN	NaN	NaN	NaN	NaN	NaN	NaN	NaN	NaN	NaN	NaN	NaN	NaN	NaN	NaN	NaN	NaN	NaN	NaN	NaN	NaN	NaN	NaN	NaN	NaN	NaN	33285.2891	NaN	NaN	NaN	40864.7148	NaN	NaN	NaN	35177.6523	34174.1836	NaN	NaN	NaN	NaN	33231.7891	NaN	NaN	NaN	NaN	100380.2578	NaN	NaN	NaN	NaN	NaN	NaN	NaN	NaN	NaN	NaN	NaN	NaN	36004.2031	NaN	NaN	NaN	NaN	NaN	NaN	NaN	NaN	NaN	NaN	35004.582	NaN	NaN	NaN	NaN	NaN	NaN	NaN	NaN	NaN	NaN	NaN	34112.293	31824.4609	NaN	NaN	NaN	NaN	NaN
3.0687	NaN	NaN	NaN	NaN	NaN	NaN	NaN	NaN	NaN	34813.7969	NaN	NaN	NaN	NaN	NaN	NaN	NaN	NaN	NaN	NaN	NaN	NaN	NaN	NaN	NaN	NaN	NaN	NaN	NaN	NaN	NaN	NaN	NaN	NaN	NaN	NaN	NaN	NaN	NaN	NaN	NaN	NaN	NaN	36335.8789	NaN	NaN	NaN	NaN	NaN	NaN	NaN	NaN	NaN	NaN	NaN	NaN	NaN	NaN	62251.8008	NaN	NaN	NaN	NaN	NaN	NaN	NaN	NaN	NaN	NaN	NaN	NaN	NaN	NaN	NaN	NaN	NaN	NaN	NaN	NaN	NaN	NaN	NaN	NaN	NaN	NaN	NaN	NaN	NaN	NaN	NaN	NaN	NaN	NaN	NaN	NaN	31127.6484	NaN	NaN	NaN	NaN	NaN
3.2021	NaN	NaN	NaN	NaN	NaN	NaN	NaN	NaN	NaN	NaN	NaN	NaN	NaN	NaN	NaN	NaN	NaN	NaN	NaN	NaN	NaN	NaN	NaN	NaN	NaN	NaN	NaN	NaN	NaN	NaN	NaN	NaN	NaN	NaN	NaN	NaN	NaN	NaN	NaN	NaN	NaN	NaN	NaN	NaN	NaN	NaN	NaN	NaN	NaN	NaN	NaN	NaN	NaN	NaN	NaN	NaN	NaN	NaN	44041.2305	NaN	NaN	NaN	NaN	NaN	NaN	NaN	NaN	NaN	NaN	NaN	NaN	NaN	NaN	NaN	NaN	NaN	NaN	NaN	NaN	NaN	NaN	NaN	NaN	NaN	NaN	NaN	NaN	NaN	NaN	NaN	NaN	NaN	NaN	NaN	NaN	NaN	NaN	NaN	NaN	NaN	NaN
3.3355	NaN	NaN	NaN	NaN	NaN	NaN	NaN	NaN	NaN	NaN	NaN	NaN	NaN	NaN	NaN	NaN	NaN	NaN	NaN	NaN	NaN	NaN	NaN	NaN	NaN	NaN	NaN	NaN	NaN	NaN	NaN	NaN	NaN	NaN	NaN	NaN	NaN	NaN	NaN	NaN	NaN	NaN	NaN	NaN	NaN	NaN	NaN	NaN	NaN	NaN	NaN	NaN	NaN	NaN	NaN	NaN	NaN	NaN	36050.7422	NaN	NaN	NaN	NaN	NaN	NaN	NaN	NaN	NaN	NaN	NaN	NaN	NaN	NaN	NaN	NaN	NaN	NaN	NaN	NaN	NaN	NaN	NaN	NaN	NaN	NaN	NaN	NaN	NaN	NaN	NaN	NaN	NaN	NaN	NaN	NaN	NaN	NaN	NaN	NaN	NaN	NaN
3.469	NaN	NaN	NaN	NaN	NaN	NaN	NaN	NaN	NaN	NaN	NaN	NaN	NaN	NaN	NaN	NaN	NaN	NaN	NaN	NaN	NaN	NaN	NaN	NaN	NaN	NaN	NaN	NaN	NaN	NaN	NaN	NaN	NaN	NaN	NaN	NaN	NaN	NaN	NaN	NaN	NaN	NaN	NaN	NaN	NaN	NaN	NaN	NaN	NaN	NaN	NaN	NaN	NaN	NaN	NaN	NaN	NaN	NaN	36346.8828	NaN	NaN	NaN	NaN	NaN	NaN	NaN	NaN	NaN	NaN	NaN	NaN	NaN	NaN	NaN	NaN	NaN	NaN	NaN	NaN	NaN	NaN	NaN	NaN	NaN	NaN	NaN	NaN	NaN	NaN	NaN	NaN	NaN	NaN	NaN	NaN	NaN	NaN	NaN	NaN	NaN	NaN
3.6024	NaN	NaN	NaN	NaN	NaN	NaN	NaN	NaN	NaN	NaN	NaN	NaN	NaN	NaN	NaN	NaN	NaN	NaN	NaN	NaN	NaN	NaN	NaN	NaN	NaN	NaN	NaN	NaN	NaN	NaN	NaN	NaN	NaN	NaN	NaN	NaN	NaN	NaN	NaN	NaN	NaN	NaN	NaN	NaN	NaN	NaN	NaN	NaN	NaN	NaN	NaN	NaN	NaN	NaN	NaN	NaN	NaN	NaN	NaN	NaN	NaN	NaN	NaN	NaN	NaN	NaN	NaN	NaN	NaN	NaN	NaN	NaN	NaN	NaN	NaN	NaN	NaN	NaN	NaN	NaN	NaN	NaN	NaN	NaN	NaN	NaN	NaN	NaN	NaN	NaN	NaN	NaN	NaN	NaN	NaN	NaN	NaN	NaN	NaN	NaN	NaN
3.7358	NaN	NaN	NaN	NaN	NaN	NaN	NaN	NaN	NaN	NaN	NaN	NaN	NaN	NaN	NaN	NaN	NaN	NaN	NaN	NaN	NaN	NaN	NaN	NaN	NaN	NaN	NaN	NaN	NaN	NaN	NaN	NaN	NaN	NaN	NaN	NaN	NaN	NaN	NaN	NaN	NaN	NaN	NaN	NaN	NaN	NaN	NaN	NaN	NaN	NaN	NaN	NaN	NaN	NaN	NaN	NaN	NaN	NaN	NaN	NaN	NaN	NaN	NaN	NaN	NaN	NaN	NaN	NaN	NaN	NaN	NaN	NaN	NaN	NaN	NaN	NaN	NaN	NaN	NaN	NaN	NaN	NaN	NaN	NaN	NaN	NaN	NaN	NaN	NaN	NaN	NaN	NaN	NaN	NaN	NaN	NaN	NaN	NaN	NaN	NaN	NaN
3.8692	NaN	NaN	NaN	NaN	NaN	NaN	NaN	NaN	NaN	NaN	NaN	NaN	NaN	NaN	NaN	NaN	NaN	NaN	NaN	NaN	NaN	NaN	NaN	NaN	NaN	NaN	NaN	NaN	NaN	NaN	NaN	NaN	NaN	NaN	NaN	NaN	NaN	NaN	NaN	NaN	NaN	NaN	NaN	NaN	NaN	NaN	NaN	NaN	NaN	NaN	NaN	NaN	NaN	NaN	NaN	NaN	NaN	NaN	NaN	NaN	NaN	NaN	NaN	NaN	NaN	NaN	NaN	NaN	NaN	NaN	NaN	NaN	NaN	NaN	NaN	NaN	NaN	NaN	NaN	NaN	NaN	NaN	NaN	NaN	NaN	NaN	NaN	NaN	NaN	NaN	NaN	NaN	NaN	NaN	NaN	NaN	NaN	NaN	NaN	NaN	NaN
4.0027	NaN	NaN	NaN	NaN	NaN	NaN	NaN	NaN	NaN	NaN	NaN	NaN	NaN	NaN	NaN	NaN	NaN	NaN	NaN	NaN	NaN	NaN	NaN	NaN	NaN	NaN	NaN	NaN	NaN	NaN	NaN	NaN	NaN	NaN	NaN	NaN	NaN	NaN	NaN	NaN	NaN	NaN	NaN	NaN	NaN	NaN	NaN	NaN	NaN	NaN	NaN	NaN	NaN	NaN	NaN	NaN	NaN	NaN	NaN	NaN	NaN	NaN	NaN	NaN	NaN	NaN	NaN	NaN	NaN	NaN	NaN	NaN	NaN	NaN	NaN	NaN	NaN	NaN	NaN	NaN	NaN	NaN	NaN	NaN	NaN	NaN	NaN	NaN	NaN	NaN	NaN	NaN	NaN	NaN	NaN	NaN	NaN	NaN	NaN	NaN	NaN
4.1361	NaN	NaN	NaN	NaN	NaN	NaN	NaN	NaN	NaN	NaN	NaN	NaN	NaN	NaN	NaN	NaN	NaN	NaN	NaN	NaN	NaN	NaN	NaN	NaN	NaN	NaN	NaN	NaN	NaN	NaN	NaN	NaN	NaN	NaN	NaN	NaN	NaN	NaN	NaN	NaN	NaN	NaN	NaN	NaN	NaN	NaN	NaN	NaN	NaN	NaN	NaN	NaN	NaN	NaN	NaN	NaN	NaN	NaN	NaN	NaN	NaN	NaN	NaN	NaN	NaN	NaN	NaN	NaN	NaN	NaN	NaN	NaN	NaN	NaN	NaN	NaN	NaN	NaN	NaN	NaN	NaN	NaN	NaN	NaN	NaN	NaN	NaN	NaN	NaN	NaN	NaN	NaN	NaN	NaN	NaN	NaN	NaN	NaN	NaN	NaN	NaN
4.2695	NaN	NaN	NaN	NaN	NaN	NaN	NaN	NaN	NaN	NaN	NaN	NaN	NaN	NaN	NaN	NaN	NaN	NaN	NaN	NaN	NaN	NaN	NaN	NaN	NaN	NaN	NaN	NaN	NaN	NaN	NaN	NaN	NaN	NaN	NaN	NaN	NaN	NaN	NaN	NaN	NaN	NaN	NaN	NaN	NaN	NaN	NaN	NaN	NaN	NaN	NaN	NaN	NaN	NaN	NaN	NaN	NaN	NaN	NaN	NaN	NaN	NaN	NaN	NaN	NaN	NaN	NaN	NaN	NaN	NaN	NaN	NaN	NaN	NaN	NaN	NaN	NaN	NaN	NaN	NaN	NaN	NaN	NaN	NaN	NaN	NaN	NaN	NaN	NaN	NaN	NaN	NaN	NaN	NaN	NaN	NaN	NaN	NaN	NaN	NaN	NaN
4.4029	NaN	NaN	NaN	NaN	NaN	NaN	NaN	NaN	NaN	NaN	NaN	NaN	NaN	NaN	NaN	NaN	NaN	NaN	NaN	NaN	NaN	NaN	NaN	NaN	NaN	NaN	NaN	NaN	NaN	NaN	NaN	NaN	NaN	NaN	NaN	NaN	NaN	NaN	NaN	NaN	NaN	NaN	NaN	NaN	NaN	NaN	NaN	NaN	NaN	NaN	NaN	NaN	NaN	NaN	NaN	NaN	NaN	NaN	NaN	NaN	NaN	NaN	NaN	NaN	NaN	NaN	NaN	NaN	NaN	NaN	NaN	NaN	NaN	NaN	NaN	NaN	NaN	NaN	NaN	NaN	NaN	NaN	NaN	NaN	NaN	NaN	NaN	NaN	NaN	NaN	NaN	NaN	NaN	NaN	NaN	NaN	NaN	NaN	NaN	NaN	NaN
4.5363	NaN	NaN	NaN	NaN	NaN	NaN	NaN	NaN	NaN	NaN	NaN	NaN	NaN	NaN	NaN	NaN	NaN	NaN	NaN	NaN	NaN	NaN	NaN	NaN	NaN	NaN	NaN	NaN	NaN	NaN	NaN	NaN	NaN	NaN	NaN	NaN	NaN	NaN	NaN	NaN	NaN	NaN	NaN	NaN	NaN	NaN	NaN	NaN	NaN	NaN	NaN	NaN	NaN	NaN	NaN	NaN	NaN	NaN	NaN	NaN	NaN	NaN	NaN	NaN	NaN	NaN	NaN	NaN	NaN	NaN	NaN	NaN	NaN	NaN	NaN	NaN	NaN	NaN	NaN	NaN	NaN	NaN	NaN	NaN	NaN	NaN	NaN	NaN	NaN	NaN	NaN	NaN	NaN	NaN	NaN	NaN	NaN	NaN	NaN	NaN	NaN
4.6698	NaN	NaN	NaN	NaN	NaN	NaN	NaN	NaN	NaN	NaN	NaN	NaN	NaN	NaN	NaN	NaN	NaN	NaN	NaN	NaN	NaN	NaN	NaN	NaN	NaN	NaN	NaN	NaN	NaN	NaN	NaN	NaN	NaN	NaN	NaN	NaN	NaN	NaN	NaN	NaN	NaN	NaN	NaN	NaN	NaN	NaN	NaN	NaN	NaN	NaN	NaN	NaN	NaN	NaN	NaN	NaN	NaN	NaN	NaN	NaN	NaN	NaN	NaN	NaN	NaN	NaN	NaN	NaN	NaN	NaN	NaN	NaN	NaN	NaN	NaN	NaN	NaN	NaN	NaN	NaN	NaN	NaN	NaN	NaN	NaN	NaN	NaN	NaN	NaN	NaN	NaN	NaN	NaN	NaN	NaN	NaN	NaN	NaN	NaN	NaN	NaN
4.8032	NaN	NaN	NaN	NaN	NaN	NaN	NaN	NaN	NaN	NaN	NaN	NaN	NaN	NaN	NaN	NaN	NaN	NaN	NaN	NaN	NaN	NaN	NaN	NaN	NaN	NaN	NaN	NaN	NaN	NaN	NaN	NaN	NaN	NaN	NaN	NaN	NaN	NaN	NaN	NaN	NaN	NaN	NaN	NaN	NaN	NaN	NaN	NaN	NaN	NaN	NaN	NaN	NaN	NaN	NaN	NaN	NaN	NaN	NaN	NaN	NaN	NaN	NaN	NaN	NaN	NaN	NaN	NaN	NaN	NaN	NaN	NaN	NaN	NaN	NaN	NaN	NaN	NaN	NaN	NaN	NaN	NaN	NaN	NaN	NaN	NaN	NaN	NaN	NaN	NaN	NaN	NaN	NaN	NaN	NaN	NaN	NaN	NaN	NaN	NaN	NaN
4.9366	NaN	NaN	NaN	NaN	NaN	NaN	NaN	NaN	NaN	NaN	NaN	NaN	NaN	NaN	NaN	NaN	NaN	NaN	NaN	NaN	NaN	NaN	NaN	NaN	NaN	NaN	NaN	NaN	NaN	NaN	NaN	NaN	NaN	NaN	NaN	NaN	NaN	NaN	NaN	NaN	NaN	NaN	NaN	NaN	NaN	NaN	NaN	NaN	NaN	NaN	NaN	NaN	NaN	NaN	NaN	NaN	NaN	NaN	NaN	NaN	NaN	NaN	NaN	NaN	NaN	NaN	NaN	NaN	NaN	NaN	NaN	NaN	NaN	NaN	NaN	NaN	NaN	NaN	NaN	NaN	NaN	NaN	NaN	NaN	NaN	NaN	NaN	NaN	NaN	NaN	NaN	NaN	NaN	NaN	NaN	NaN	NaN	NaN	NaN	NaN	NaN
5.07	NaN	NaN	NaN	NaN	NaN	NaN	NaN	NaN	NaN	NaN	NaN	NaN	NaN	NaN	NaN	NaN	NaN	NaN	NaN	NaN	NaN	NaN	NaN	NaN	NaN	NaN	NaN	NaN	NaN	NaN	NaN	NaN	NaN	NaN	NaN	NaN	NaN	NaN	NaN	NaN	NaN	NaN	NaN	NaN	NaN	NaN	NaN	NaN	NaN	NaN	NaN	NaN	NaN	NaN	NaN	NaN	NaN	NaN	NaN	NaN	NaN	NaN	NaN	NaN	NaN	NaN	NaN	NaN	NaN	NaN	NaN	NaN	NaN	NaN	NaN	NaN	NaN	NaN	NaN	NaN	NaN	NaN	NaN	NaN	NaN	NaN	NaN	NaN	NaN	NaN	NaN	NaN	NaN	NaN	NaN	NaN	NaN	NaN	NaN	NaN	NaN
5.2035	NaN	NaN	NaN	NaN	NaN	NaN	NaN	NaN	NaN	NaN	NaN	NaN	NaN	NaN	NaN	NaN	NaN	NaN	NaN	NaN	NaN	NaN	NaN	NaN	NaN	NaN	NaN	NaN	NaN	NaN	NaN	NaN	NaN	NaN	NaN	NaN	NaN	NaN	NaN	NaN	NaN	NaN	NaN	NaN	NaN	NaN	NaN	NaN	NaN	NaN	NaN	NaN	NaN	NaN	NaN	NaN	NaN	NaN	NaN	NaN	NaN	NaN	NaN	NaN	NaN	NaN	NaN	NaN	NaN	NaN	NaN	NaN	NaN	NaN	NaN	NaN	NaN	NaN	NaN	NaN	NaN	NaN	NaN	NaN	NaN	NaN	NaN	NaN	NaN	NaN	NaN	NaN	NaN	NaN	NaN	NaN	NaN	NaN	NaN	NaN	NaN
5.3369	NaN	NaN	NaN	NaN	NaN	NaN	NaN	NaN	NaN	NaN	NaN	NaN	NaN	NaN	NaN	NaN	NaN	NaN	NaN	NaN	NaN	NaN	NaN	NaN	NaN	NaN	NaN	NaN	NaN	NaN	NaN	NaN	NaN	NaN	NaN	NaN	NaN	NaN	NaN	NaN	NaN	NaN	NaN	NaN	NaN	NaN	NaN	NaN	NaN	NaN	NaN	NaN	NaN	NaN	NaN	NaN	NaN	NaN	NaN	NaN	NaN	NaN	NaN	NaN	NaN	NaN	NaN	NaN	NaN	NaN	NaN	NaN	NaN	NaN	NaN	NaN	NaN	NaN	NaN	NaN	NaN	NaN	NaN	NaN	NaN	NaN	NaN	NaN	NaN	NaN	NaN	NaN	NaN	NaN	NaN	NaN	NaN	NaN	NaN	NaN	NaN
5.4703	NaN	NaN	NaN	NaN	NaN	NaN	NaN	NaN	NaN	NaN	NaN	NaN	NaN	NaN	NaN	NaN	NaN	NaN	NaN	NaN	NaN	NaN	NaN	NaN	NaN	NaN	NaN	NaN	NaN	NaN	NaN	NaN	NaN	NaN	NaN	NaN	NaN	NaN	NaN	NaN	NaN	NaN	NaN	NaN	NaN	NaN	NaN	NaN	NaN	NaN	NaN	NaN	NaN	NaN	NaN	NaN	NaN	NaN	NaN	NaN	NaN	NaN	NaN	NaN	NaN	NaN	NaN	NaN	NaN	NaN	NaN	NaN	NaN	NaN	NaN	NaN	NaN	NaN	NaN	NaN	NaN	NaN	NaN	NaN	NaN	NaN	NaN	NaN	NaN	NaN	NaN	NaN	NaN	NaN	NaN	NaN	NaN	NaN	NaN	NaN	NaN
5.6037	NaN	NaN	NaN	NaN	NaN	NaN	NaN	NaN	NaN	NaN	NaN	NaN	NaN	NaN	NaN	NaN	NaN	NaN	NaN	NaN	NaN	NaN	NaN	NaN	NaN	NaN	NaN	NaN	NaN	NaN	NaN	NaN	NaN	NaN	NaN	NaN	NaN	NaN	NaN	NaN	NaN	NaN	NaN	NaN	NaN	NaN	NaN	NaN	NaN	NaN	NaN	NaN	NaN	NaN	NaN	NaN	NaN	NaN	NaN	NaN	NaN	NaN	NaN	NaN	NaN	NaN	NaN	NaN	NaN	NaN	NaN	NaN	NaN	NaN	NaN	NaN	NaN	NaN	NaN	NaN	NaN	NaN	NaN	NaN	NaN	NaN	NaN	NaN	NaN	NaN	NaN	NaN	NaN	NaN	NaN	NaN	NaN	NaN	NaN	NaN	NaN
5.7371	NaN	NaN	NaN	NaN	NaN	NaN	NaN	NaN	NaN	NaN	NaN	NaN	NaN	NaN	NaN	NaN	NaN	NaN	NaN	NaN	NaN	NaN	NaN	NaN	NaN	NaN	NaN	NaN	NaN	NaN	NaN	NaN	NaN	NaN	NaN	NaN	NaN	NaN	NaN	NaN	NaN	NaN	NaN	NaN	NaN	NaN	NaN	NaN	NaN	NaN	NaN	NaN	NaN	NaN	NaN	NaN	NaN	NaN	NaN	NaN	NaN	NaN	NaN	NaN	NaN	NaN	NaN	NaN	NaN	NaN	NaN	NaN	NaN	NaN	NaN	NaN	NaN	NaN	NaN	NaN	NaN	NaN	NaN	NaN	NaN	NaN	NaN	NaN	NaN	NaN	NaN	NaN	NaN	NaN	NaN	NaN	NaN	NaN	NaN	NaN	NaN
5.8706	NaN	NaN	NaN	NaN	NaN	NaN	NaN	NaN	NaN	NaN	NaN	NaN	NaN	NaN	NaN	NaN	NaN	NaN	NaN	NaN	NaN	NaN	NaN	NaN	NaN	NaN	NaN	NaN	NaN	NaN	NaN	NaN	NaN	NaN	NaN	NaN	NaN	NaN	NaN	NaN	NaN	NaN	NaN	NaN	NaN	NaN	NaN	NaN	NaN	NaN	NaN	NaN	NaN	NaN	NaN	NaN	NaN	NaN	NaN	NaN	NaN	NaN	NaN	NaN	NaN	NaN	NaN	NaN	NaN	NaN	NaN	NaN	NaN	NaN	NaN	NaN	NaN	NaN	NaN	NaN	NaN	NaN	NaN	NaN	NaN	NaN	NaN	NaN	NaN	NaN	NaN	NaN	NaN	NaN	NaN	NaN	NaN	NaN	NaN	NaN	NaN
