0.00000,12210.258
0.13342,13044.152
0.26684,14510.979
0.40027,17856.176
0.53369,20006.779
0.66711,19569.123
0.80053,17328.332
0.93395,17877.137
1.06737,17291.643
1.20080,16219.874
1.33422,16349.221
1.46764,15848.574
1.60106,15957.970
1.73448,16111.071
1.86791,15787.471
2.00133,15413.237
2.13475,13981.994
2.26817,13862.593
2.40159,13972.612
2.53502,13284.332
