x	Y_20180514_15338_c2_15_2g	Y_20180514_15338_c2_18_3g	Y_20180514_15338_c2_20_2g	Y_20180514_15338_c2_34_1g	Y_20180514_15338_c2_34_3g	Y_20180514_15338_c2_5_2g	Y_20180514_15338_c2_6_1g	Y_20180514_15338_c2_7_5g
0	10347.662	12146.189	8660.851	10776.315	12485.927	11309.267	12640.789	12620.992
0.1334	9798.988	11903.692	8900.458	11251.051	12819.947	12357.6	11658.26	15453.731
0.2668	9767.104	11732.946	8950.43	11516.155	12158.604	13296.271	11395.34	19060.312
0.4003	10208.084	11798.907	9332.393	12539.466	11447.522	13471.889	11046.677	21190.646
0.5337	11090.753	12576.322	9214.641	12835.394	10548.209	13132.726	11184.148	21109.809
0.6671	11878.153	15790.956	10308.046	14038.56	10750.635	13808.216	11140.321	19270.256
0.8005	14983.532	18426.314	11338.287	14979.085	10301.656	14139.252	11643.58	18805.854
0.934	18101.928	18634.779	12220.197	16559.375	11152.491	15032.292	12724.235	18489.406
1.0674	19333.805	18201.494	13000.939	18046.301	12639.237	15333.962	13451.229	18274.512
1.2008	19572.178	18889.207	15978.074	16636.631	14924.07	15332.013	15747.597	18036.107
1.3342	18119.807	18979.051	16170.29	16227.846	17851.543	15108.14	17913.648	17520.168
1.4676	16665.387	18560.582	16061.519	16447.014	20286.621	15106.579	18110.586	17143.418
1.6011	16399.502	19241.699	16038.852	17051.145	21695.436	14977.448	18001.129	15848.114
1.7345	17620.82	18853.445	16122.959	16421.826	22498.846	15215.746	19156.51	15626.406
1.8679	17526.121	18954.363	14481.763	16151.322	20728.604	16903.26	18549.947	15511.314
2.0013	17590.055	18466.184	14405.909	15266.752	19597.957	18527.547	18534.656	15440.389
2.1348	19999.822	19196.713	14005.745	15562.453	19013.652	17422.527	18026.592	14763.331
2.2682	21979.717	18241.965	14205.428	15440.938	19058.381	17779.801	16817.594	14880.6
2.4016	20925.006	18646.799	14631.72	14889.727	17061.934	16628.594	15962.395	14772.257
2.535	19724.641	15816.455	14649.674	14902.64	15761.525	15750.457	17493.992	12712.837
2.6684	18269.943	16201.096	13861.563	14483.516	15156.087	15013.011	15808.645	11846.294
2.8019	15936.637	14872.164	13569.948	15344.773	14638.418	14359.647	15985.405	12568.118
2.9353	15093.615	14670.434	13002.384	15180.754	NaN	14447.264	14725.84	12257.799
3.0687	14319.641	13474.417	12976.136	15188.818	NaN	12679.397	14521.081	11652.288
3.2021	14474.687	13682.051	13738.011	14272.629	NaN	12276.29	14557.61	10836.594
3.3356	14072.22	13758.622	12745.692	14161.047	NaN	12259.055	14746.374	NaN
3.469	14021.032	14002.882	12147.859	14006.348	NaN	11782.702	13922.992	NaN
3.6024	13146.738	14106.447	11917.121	13910.448	NaN	NaN	14830.834	NaN
3.7358	13063.82	13227.726	11001.743	13835.47	NaN	NaN	13109.539	NaN
3.8692	12216.144	13330.575	10877.229	14122.375	NaN	NaN	12401.741	NaN
4.0027	12086.378	13314.981	11024.347	13391.363	NaN	NaN	12671.503	NaN
4.1361	12097.017	12428.42	11010.025	13722.688	NaN	NaN	NaN	NaN
4.2695	12053.073	NaN	11023.027	12936.316	NaN	NaN	NaN	NaN
4.4029	NaN	NaN	10579.525	11929.451	NaN	NaN	NaN	NaN
4.5363	NaN	NaN	NaN	NaN	NaN	NaN	NaN	NaN
4.6698	NaN	NaN	NaN	NaN	NaN	NaN	NaN	NaN
4.8032	NaN	NaN	NaN	NaN	NaN	NaN	NaN	NaN
4.9366	NaN	NaN	NaN	NaN	NaN	NaN	NaN	NaN
5.07	NaN	NaN	NaN	NaN	NaN	NaN	NaN	NaN
5.2035	NaN	NaN	NaN	NaN	NaN	NaN	NaN	NaN
