X,Y
0.00000,11373.048
0.13342,12042.400
0.26684,14660.992
0.40027,17491.680
0.53369,18020.117
0.66711,17002.879
0.80053,16588.041
0.93395,14796.581
1.06737,15362.531
1.20080,14709.656
1.33422,14098.860
1.46764,14135.282
1.60106,14312.905
1.73448,14912.312
1.86791,15794.425
2.00133,15656.715
2.13475,15238.635
2.26817,14966.553
2.40159,14920.007
2.53502,14433.705
2.66844,14233.523
2.80186,13363.709
