x	Y_20180514_15100_10_4g	Y_20180514_15100_13_3g	Y_20180514_15100_14_2g	Y_20180514_15100_15_1g	Y_20180514_15100_17_1g	Y_20180514_15100_17_5g	Y_20180514_15100_19_1g	Y_20180514_15100_22_1g	Y_20180514_15100_25_3g	Y_20180514_15100_6_2g	Y_20180514_15100_6_3g	Y_20180514_15100_8_3g	Y_20180514_15100_8_5g
0	10353.762	10455.672	13553.046	14272.029	14564.637	13192.613	10216.469	10064.104	10351.921	14074.433	13418.521	11352.402	11882.932
0.1334	10426.589	10580.578	13430.306	14694.322	14347.626	14196.83	9965.059	10593.059	10768.807	14413.88	13070.042	10609.054	11325.716
0.2668	10585.054	10948.69	13499.297	15047.626	14565.397	14783.33	10152.424	10717.93	10905.616	14753.919	13411.133	10583.508	11210.989
0.4003	11549.322	11374.318	13309.564	16113.302	14386.396	15193.845	9917.437	11161.396	11502.662	14400.638	15174.398	11337.926	11562.627
0.5337	13420.967	11748.713	13205.758	15048.416	14267.261	14844.115	10308.744	11910.207	12033.745	15839.609	18719.486	12217.481	12601.168
0.6671	16173.942	12497.664	14047.955	16291.321	15871.928	16475.721	10487.239	13132.771	11233.612	17475.631	19415.02	13125.626	13534.353
0.8005	19289.432	14610.615	15098.656	17961.723	15296.64	18571.051	10643.575	16371.337	11076.213	20331.074	17851.545	14931.747	14953.413
0.934	19496.324	16671.898	17970.564	20633.602	17102.873	19681.039	10841.597	20230.51	11906.408	22679.953	17162.496	15129.319	18313.58
1.0674	18025.277	17101.449	21115.717	24851.451	20229.826	19547.207	11949.434	21278.357	13534.369	22807.922	18438.486	13979.161	19899.188
1.2008	17048.756	16721.197	22507.168	22624.824	21385.066	18656.434	14849.334	18558.824	15904.514	19399.486	17551.75	13744.538	19065.596
1.3342	16814.357	16444.598	21030.074	20586.418	19981.16	17510.555	18953.662	17104.176	19394.133	16891.807	17549.234	14717.046	18137.379
1.4676	17033.49	16249.108	19139.051	20510.41	18076.539	16713.336	20020.061	15842.601	21711.502	16268.864	19998.348	14416.595	17520.645
1.6011	16566.496	16466.891	18598.701	20169.457	17010.096	15954.466	21350.006	15779.286	18786.936	14848.196	19916.309	14672.799	16187.625
1.7345	16669.867	17465.766	17541.633	18602.379	15146.604	15108.427	25441.84	15600.087	15663.167	14152.81	17913.4	15517.451	15553.109
1.8679	16167.058	16744.91	17333.268	18253.025	14693.268	14462.773	27470.09	15509.617	15184.729	14291.436	16982.902	15581.94	14905.555
2.0013	16514.516	16689.326	18663.209	16552.566	14243.44	13315.795	25624.928	15578.47	14108.051	14453.508	15912.425	15079.957	14699.006
2.1348	15523.381	17322.123	17750.08	17977.914	13948.925	12864.706	23161.174	13759.893	14061.042	14119.227	15455.985	15558.39	14348.417
2.2682	14049.155	17672.795	17916.305	17104.381	13709.998	13475.701	22503.271	13096.98	13883.401	14428.977	15104.013	15200.438	13999.438
2.4016	14489.528	16897.229	16893.273	14381.656	13931.986	13411.421	22135.119	13304.853	14069.661	14171.729	14734.716	15211.004	13007.662
2.535	13967.093	16141.424	16076.062	13021.428	NaN	13083.886	20582.465	13845.544	14529.545	13948.133	NaN	15362.054	12844.096
2.6684	13265.092	15992.055	14855.522	12602.297	NaN	13075.788	18006.648	15227.119	NaN	13131.038	NaN	16465.539	12640.709
2.8019	13164.779	15360.913	14424.558	11927.635	NaN	12970.569	17429.283	15500.455	NaN	13327.199	NaN	15820.017	12348.809
2.9353	13065.645	15109.77	NaN	12319.383	NaN	12838.024	16896.162	14324.177	NaN	13564.837	NaN	15274.059	11684.306
3.0687	13987.317	14439.609	NaN	11555.201	NaN	NaN	16464.049	13441.906	NaN	14208.459	NaN	13297.141	12042.307
3.2021	13430.25	13611.569	NaN	10372.084	NaN	NaN	15102.442	13106.049	NaN	13822.57	NaN	12635.503	NaN
3.3356	NaN	NaN	NaN	10340.416	NaN	NaN	13952.607	13335.667	NaN	13458.197	NaN	12871.938	NaN
3.469	NaN	NaN	NaN	10763.441	NaN	NaN	14306.186	12918.546	NaN	13991.957	NaN	12811.691	NaN
3.6024	NaN	NaN	NaN	NaN	NaN	NaN	14291.431	12661.348	NaN	13606.178	NaN	12096.953	NaN
3.7358	NaN	NaN	NaN	NaN	NaN	NaN	14725.913	13424.487	NaN	NaN	NaN	11770.385	NaN
3.8692	NaN	NaN	NaN	NaN	NaN	NaN	14661.411	NaN	NaN	NaN	NaN	11660.859	NaN
4.0027	NaN	NaN	NaN	NaN	NaN	NaN	14094.635	NaN	NaN	NaN	NaN	11500.132	NaN
4.1361	NaN	NaN	NaN	NaN	NaN	NaN	13726.382	NaN	NaN	NaN	NaN	10885.177	NaN
4.2695	NaN	NaN	NaN	NaN	NaN	NaN	13944.078	NaN	NaN	NaN	NaN	10950.032	NaN
4.4029	NaN	NaN	NaN	NaN	NaN	NaN	13804.346	NaN	NaN	NaN	NaN	10477.988	NaN
4.5363	NaN	NaN	NaN	NaN	NaN	NaN	NaN	NaN	NaN	NaN	NaN	10088.792	NaN
4.6698	NaN	NaN	NaN	NaN	NaN	NaN	NaN	NaN	NaN	NaN	NaN	NaN	NaN
4.8032	NaN	NaN	NaN	NaN	NaN	NaN	NaN	NaN	NaN	NaN	NaN	NaN	NaN
4.9366	NaN	NaN	NaN	NaN	NaN	NaN	NaN	NaN	NaN	NaN	NaN	NaN	NaN
5.07	NaN	NaN	NaN	NaN	NaN	NaN	NaN	NaN	NaN	NaN	NaN	NaN	NaN
5.2035	NaN	NaN	NaN	NaN	NaN	NaN	NaN	NaN	NaN	NaN	NaN	NaN	NaN
5.3369	NaN	NaN	NaN	NaN	NaN	NaN	NaN	NaN	NaN	NaN	NaN	NaN	NaN
5.4703	NaN	NaN	NaN	NaN	NaN	NaN	NaN	NaN	NaN	NaN	NaN	NaN	NaN
5.6037	NaN	NaN	NaN	NaN	NaN	NaN	NaN	NaN	NaN	NaN	NaN	NaN	NaN
