X,Y
0.00000,12861.689
0.13342,12903.217
0.26684,13677.495
0.40027,15827.660
0.53369,19381.193
0.66711,19663.477
0.80053,19727.730
0.93395,17430.441
1.06737,16960.629
1.20080,15001.205
1.33422,14246.861
1.46764,13116.722
1.60106,13543.250
