0.00000,12117.498
0.13342,12412.418
0.26684,14182.606
0.40027,17237.605
0.53369,20420.887
0.66711,21946.869
0.80053,20983.025
0.93395,18891.578
1.06737,17785.631
1.20080,16981.137
1.33422,16576.590
1.46764,15153.302
1.60106,13680.412
1.73448,13314.628
1.86791,13136.864
2.00133,12243.488
2.13475,11696.435
2.26817,11209.607
