X,Y
0.00000,12570.167
0.13342,12369.444
0.26684,13399.959
0.40027,14692.687
0.53369,15387.588
0.66711,18359.297
0.80053,17573.473
0.93395,16548.773
1.06737,16791.650
1.20080,16854.932
1.33422,18228.164
1.46764,16478.727
1.60106,15536.210
1.73448,18907.438
1.86791,19537.969
2.00133,18269.652
2.13475,15054.021
2.26817,14102.690
2.40159,13412.671
2.53502,13273.820
2.66844,13106.879
2.80186,13277.012
2.93528,13271.762
3.06870,12620.685
3.20212,12421.688
3.33555,12192.422
3.46897,12851.778
