X,Y
0.00000,36135.273
0.13342,35615.836
0.26684,35035.848
0.40027,35360.508
0.53369,34301.750
0.66711,35626.059
0.80053,34933.820
0.93395,35696.027
1.06737,34884.711
1.20080,34766.992
1.33422,35030.844
1.46764,36042.125
1.60106,40098.746
1.73448,47252.801
1.86791,66511.422
2.00133,91934.078
2.13475,94597.461
2.26817,69135.609
2.40159,49981.242
2.53502,44856.297
