0.00000,38449.309
0.13342,37171.855
0.26684,36363.129
0.40027,39425.527
0.53369,38812.293
0.66711,38774.246
0.80053,39180.652
0.93395,38056.438
1.06737,39557.457
1.20080,38612.195
1.33422,35852.770
1.46764,36074.723
1.60106,39253.617
1.73448,38992.734
1.86791,39142.250
2.00133,39044.973
2.13475,40623.961
2.26817,41471.250
2.40159,41256.352
2.53502,43260.719
2.66844,44137.238
2.80186,49934.418
2.93528,60123.762
3.06870,84994.344
3.20212,143228.906
3.33555,202658.844
3.46897,192359.281
3.60239,129868.578
3.73581,78674.297
3.86923,55876.844
4.00266,47102.844
4.13608,43387.406
