X,Y
0.00000,31133.934
0.13342,33249.645
0.26684,32788.871
0.40027,32916.793
0.53369,33312.891
0.66711,31633.867
0.80053,30957.689
0.93395,31286.529
1.06737,31469.742
1.20080,31880.598
1.33422,33647.672
1.46764,34531.020
1.60106,33666.023
1.73448,33630.391
1.86791,34671.457
2.00133,37444.691
2.13475,47817.289
2.26817,63107.816
2.40159,68076.836
2.53502,57060.762
2.66844,42971.031
2.80186,40719.203
2.93528,34670.180
