0.00000,17231.625
0.13342,17384.162
0.26684,16932.887
0.40027,16288.027
0.53369,15982.510
0.66711,16180.662
0.80053,16818.584
0.93395,15723.196
1.06737,16321.809
1.20080,16351.812
1.33422,15803.369
1.46764,16063.363
1.60106,17043.150
1.73448,18597.160
1.86791,23244.684
2.00133,33783.902
2.13475,43104.207
2.26817,38220.738
2.40159,27073.590
2.53502,20059.074
