0.00000,37733.371
0.13342,39977.434
0.26684,39631.633
0.40027,38818.434
0.53369,38256.746
0.66711,39477.914
0.80053,40331.211
0.93395,40755.551
1.06737,40537.227
1.20080,41183.074
1.33422,41461.305
1.46764,42619.422
1.60106,47089.227
1.73448,64174.180
1.86791,104648.688
2.00133,146081.172
2.13475,131521.375
2.26817,84767.109
2.40159,58652.707
2.53502,49852.234
