x	Y_20180514_15323_1_11g	Y_20180514_15323_10_7g	Y_20180514_15323_11_5g	Y_20180514_15323_14_9g	Y_20180514_15323_15_10g	Y_20180514_15323_17_6g	Y_20180514_15323_19_10g	Y_20180514_15323_30_7g	Y_20180514_15323_30_9g	Y_20180514_15323_4_2g	Y_20180514_15323_7_8g
0	36728.5039	33379.918	28766.0352	28179.416	32356.9512	35182.9609	34249.2617	34368.4023	35231.957	32963.5625	34160.1328
0.1334	36472.1523	33392.4141	28250.8164	28530.5684	31637.7324	36933.2812	35147.2852	36026.1562	36016.3164	33306.1172	35055.8516
0.2668	36958.7266	32773.5781	29985.3418	28192.9395	30782.6621	35526.0156	34457.9336	34416.4297	36467.7969	34110.3164	34164.5898
0.4003	37083.0273	31716.7031	30010.3613	28652.3457	31912.4414	35987.6992	33895.1797	33729.0391	36846.543	33836.4766	33833.3828
0.5337	37090.9023	33298.1016	29359.6289	28346.4355	32088.8926	35213.625	34247.6602	34776.875	34994.5234	33934.2344	33922.7109
0.6671	36163.293	34404.4062	30971.7031	29450.1641	31726.9297	35984.5469	34231.0078	35477.3711	34868.9219	33790.8828	34974.543
0.8005	36114.8438	32268.2949	30293.4961	30894.0039	33674.4688	34447.1719	33456.6133	33791.3398	36347.4805	33831.4336	35117.4297
0.934	36931.4375	33826.0234	30504.2344	28711.3086	33436.4023	34542.1016	32620.6641	33701.9453	37814.8867	33770.6719	36155.5508
1.0674	36764.0391	34158.4492	30601.9453	28163.498	33260.3438	34047.5898	33526.8398	34389.043	37660.9844	33839.8008	36379.8828
1.2008	35115.9961	32562.8809	30468.7656	29468.8945	32887.0742	35113.3008	33297.9219	33723.2773	38232.5469	34571.0391	33320.7734
1.3342	36346.5156	33000.8867	31813.4648	29131.1172	31480.7988	36283.3867	34643.2266	34026.1641	39689.8828	34360.8867	32203.7598
1.4676	36387.1719	32954.207	33147.8867	28984.4648	32071.2109	37228.4883	35568.5391	34232.4727	39356.7695	33680.5234	33195.1445
1.6011	37113.332	32373.752	34427.8711	29476.668	31959.6797	39690.4922	36109.4453	36478.75	39208.2891	35406.9492	35341.0586
1.7345	41574.2422	32544.627	37857.6953	30387.0527	31703.5117	48923.1992	40876.1797	36356.8633	37883.3789	36467.0352	36351.9727
1.8679	53024.1328	34043.1172	48196.5078	32053.9863	33549.1367	64993.8711	50402.0859	37190.9961	38078.6172	36654.168	41701.9883
2.0013	80458.1094	36443.3438	63228.3242	36021.6445	34785.293	94800.2031	70830.6641	40051.1758	42286.9844	39008.7266	48373.0352
2.1347	113162.1406	40315.8086	63967.707	41155.5117	36856.2227	105090.3438	101871.6094	47026.3398	54174.5273	48164.8672	65736.4922
2.2682	107173.2812	53053.7344	47857.6797	57249.3828	43465.8906	78091.4766	106294.7109	61729.9023	75518.3594	66420.8672	102141.7656
2.4016	72568.7344	83349.625	38342.625	65770.5781	55860.1484	48888.5117	75058.6016	68817.8359	83049.6953	96873.0625	128124.3906
2.535	51378.2578	97911.2656	32691.7168	55184.8711	72613.3828	39800.9688	49890.3086	59670.8477	66132.8906	105205.0078	105384.9453
2.6684	43217.4883	77675.9766	31593.3516	44031.2891	69343.4844	37290.3984	41493.9219	45517.1914	50399.8359	78463.8438	62886.5938
2.8019	38761.2812	52080.0742	32159.2461	36846.4844	50954.5703	NaN	NaN	NaN	43934.5586	52261.3945	45446.4023
2.9353	NaN	40206.7734	NaN	NaN	NaN	NaN	NaN	NaN	38702.4727	41936.9141	40496.3047
3.0687	NaN	NaN	NaN	NaN	NaN	NaN	NaN	NaN	NaN	39914.5078	38420.5039
3.2021	NaN	NaN	NaN	NaN	NaN	NaN	NaN	NaN	NaN	NaN	NaN
3.3355	NaN	NaN	NaN	NaN	NaN	NaN	NaN	NaN	NaN	NaN	NaN
3.469	NaN	NaN	NaN	NaN	NaN	NaN	NaN	NaN	NaN	NaN	NaN
3.6024	NaN	NaN	NaN	NaN	NaN	NaN	NaN	NaN	NaN	NaN	NaN
3.7358	NaN	NaN	NaN	NaN	NaN	NaN	NaN	NaN	NaN	NaN	NaN
3.8692	NaN	NaN	NaN	NaN	NaN	NaN	NaN	NaN	NaN	NaN	NaN
4.0027	NaN	NaN	NaN	NaN	NaN	NaN	NaN	NaN	NaN	NaN	NaN
4.1361	NaN	NaN	NaN	NaN	NaN	NaN	NaN	NaN	NaN	NaN	NaN
4.2695	NaN	NaN	NaN	NaN	NaN	NaN	NaN	NaN	NaN	NaN	NaN
4.4029	NaN	NaN	NaN	NaN	NaN	NaN	NaN	NaN	NaN	NaN	NaN
4.5363	NaN	NaN	NaN	NaN	NaN	NaN	NaN	NaN	NaN	NaN	NaN
4.6698	NaN	NaN	NaN	NaN	NaN	NaN	NaN	NaN	NaN	NaN	NaN
4.8032	NaN	NaN	NaN	NaN	NaN	NaN	NaN	NaN	NaN	NaN	NaN
4.9366	NaN	NaN	NaN	NaN	NaN	NaN	NaN	NaN	NaN	NaN	NaN
5.07	NaN	NaN	NaN	NaN	NaN	NaN	NaN	NaN	NaN	NaN	NaN
5.2035	NaN	NaN	NaN	NaN	NaN	NaN	NaN	NaN	NaN	NaN	NaN
5.3369	NaN	NaN	NaN	NaN	NaN	NaN	NaN	NaN	NaN	NaN	NaN
5.4703	NaN	NaN	NaN	NaN	NaN	NaN	NaN	NaN	NaN	NaN	NaN
5.6037	NaN	NaN	NaN	NaN	NaN	NaN	NaN	NaN	NaN	NaN	NaN
5.7371	NaN	NaN	NaN	NaN	NaN	NaN	NaN	NaN	NaN	NaN	NaN
5.8706	NaN	NaN	NaN	NaN	NaN	NaN	NaN	NaN	NaN	NaN	NaN
6.004	NaN	NaN	NaN	NaN	NaN	NaN	NaN	NaN	NaN	NaN	NaN
6.1374	NaN	NaN	NaN	NaN	NaN	NaN	NaN	NaN	NaN	NaN	NaN
6.2708	NaN	NaN	NaN	NaN	NaN	NaN	NaN	NaN	NaN	NaN	NaN
6.4042	NaN	NaN	NaN	NaN	NaN	NaN	NaN	NaN	NaN	NaN	NaN
6.5377	NaN	NaN	NaN	NaN	NaN	NaN	NaN	NaN	NaN	NaN	NaN
6.6711	NaN	NaN	NaN	NaN	NaN	NaN	NaN	NaN	NaN	NaN	NaN
