0.0000	12180.7793
0.1334	12517.4053
0.2668	13046.1836
0.4003	14120.0361
0.5337	16472.7012
0.6671	18733.4863
0.8005	19088.7207
0.9340	17460.1348
1.0674	15545.7803
1.2008	14624.1592
1.3342	14365.4580
1.4676	14135.1426
1.6011	14025.2246
