0.00000,11107.728
0.13342,11412.069
0.26684,12972.036
0.40027,13613.062
0.53369,16984.037
0.66711,20489.480
0.80053,23312.168
0.93395,21684.018
1.06737,19755.555
1.20080,17290.256
1.33422,16877.078
1.46764,15902.578
1.60106,15346.534
1.73448,13030.593
1.86791,13839.262
2.00133,14658.479
2.13475,14879.544
2.26817,14135.254
2.40159,13585.764
2.53502,13257.776
2.66844,13591.259
2.80186,11987.291
2.93528,12054.434
3.06870,12004.935
3.20212,12789.083
