x	Y_20180514_15100b_1_4g	Y_20180514_15100b_10_13g	Y_20180514_15100b_12_16g	Y_20180514_15100b_12_3g	Y_20180514_15100b_12_5g	Y_20180514_15100b_12_7g	Y_20180514_15100b_13_1g	Y_20180514_15100b_13_6g	Y_20180514_15100b_14_3g	Y_20180514_15100b_14_9g	Y_20180514_15100b_15_7g	Y_20180514_15100b_16_13g	Y_20180514_15100b_16_15g	Y_20180514_15100b_17_22g	Y_20180514_15100b_18_11g	Y_20180514_15100b_18_1g	Y_20180514_15100b_19_1g	Y_20180514_15100b_20_3g	Y_20180514_15100b_20_4g	Y_20180514_15100b_20_8g	Y_20180514_15100b_22_10g	Y_20180514_15100b_22_12g	Y_20180514_15100b_22_4g	Y_20180514_15100b_23_2g	Y_20180514_15100b_24_5g	Y_20180514_15100b_25_8g	Y_20180514_15100b_4_11g	Y_20180514_15100b_5_3g	Y_20180514_15100b_9_18g	Y_20180514_15100b_9_19g	Y_20180514_15100b_9_5g	Y_20180514_15100b_9_9g
0	30265.9785	31557.5215	30678.5332	30264.1641	31731.1738	31901.5332	37243.2227	33441.543	36563.2109	28701.5	31226.4453	29436.5098	33697.5	30281.8008	29458.7617	29592.8926	33736.2148	32875.8711	34283.5938	36433.3086	33740.2422	32287.582	26545.1211	33081.3867	32312.7441	35037.6172	33286.4688	33586.582	28850.8262	27938.3164	30430.1465	33213.2109
0.1334	32605	30234.5352	31819.6504	28883.7891	30247.2852	31087.7754	39498.5312	34139.8633	36296.0625	29411.959	31222.6562	30234.8164	33792.3047	30160.3887	28676.4121	30214.2988	34048.1133	32192.168	33358.9609	36142.8125	34858.4375	33560.4688	27695.125	33969.6953	33843.5859	35864.5664	32685.9023	33684.3125	30582.8086	28496.5742	31477.1074	33537.3047
0.2668	33392.3867	31981.4082	30099.1934	29724.9551	29408.1602	32102.0469	37921.8789	31521.2461	34970.4219	31052.8496	31785.9805	29849.373	32840.6797	29495.9902	29895.4023	30193.8398	33742.0312	32437.543	33701.7188	34479.6484	34617.1094	32762.2305	27998.875	32685.666	31866.9707	36056.8945	32568.6172	32800.9805	30332.1523	28976.6895	32826.3047	35022.4531
0.4003	32452.3184	31876.1875	31219.8105	29433.8379	30112.7422	29985.5312	37481.9414	34560.3281	36136.543	31221.6953	31819.9258	30355.2012	34835.3164	30971.8242	29732.459	30129.2012	33418.3008	33239.6797	33877.6328	35052.6992	35347.7109	34663.5508	29277.0527	32851.9258	32924.5195	35718.3438	30764.459	32725.1816	27916.5176	29337.7129	32074.1758	33908.3984
0.5337	31210.3379	32472.5078	32125.8613	29194.2227	31317.8555	30720.9414	36362.6797	33906.7656	37069.2539	30322.1523	32569.7461	28455.9062	33455.0625	30989.334	31302.6836	29448.1855	33575.1758	32553.7051	34770.9141	35735.5039	36553.2773	34437.6016	29841.793	32633.3359	31385.543	36317.4531	30927.1641	33003.8711	28725.6035	30011.9688	32227.6641	33907.2891
0.6671	30670.1133	31877.5742	32484.3594	31449.7363	30820.2715	29704.1992	36790.9258	34281.4141	37733.668	31822.1641	32573.4707	29363.377	34516.5117	31968.8027	30558.5547	30526.8477	34381.3359	33478.1016	34302.4805	34219.5078	34154.8359	34203.7539	29447.6289	32888.2148	32984.4766	36961.4023	31697.6934	32822.1641	28555.5859	29519.457	31685.1797	34626.2031
0.8005	30537.8906	32994.9883	31927.9863	30436.4746	30570.7012	30700.875	35966.668	33487.3242	37122.5625	31028.5508	33897.2852	29374.1504	34897.6016	32618.2461	27883.6016	29747.957	35121.1211	32593.0781	33589.7188	35649.4062	33534.0938	35103.4766	28721.5684	33349.582	31720.6055	36375.7891	31812.6875	33969.7773	28907.0898	29813.1172	31831.2227	35795.7305
0.934	31422.3418	31714.8008	31460.6992	31422.6992	30770.7227	30151.3359	36768.1172	33229.8203	36157.3008	30959.8223	33174.25	30377	33863.1172	31975.7793	28590.0293	29955.748	34244	33737.3203	32182.002	33184.75	34065.4766	35334.293	29284.8652	33986.1055	32633.3105	35517.3867	31969.5664	34359.3711	29315.832	29913.7734	31447.4785	34670.3906
1.0674	31913.5605	32268.2812	31489.8926	31592.2578	33225.2266	30191.4082	36694.0547	32462.9766	34965.1953	31052.8926	32373.1719	29167.7148	32484.5625	32193.3516	29327.1152	30323.2598	35645.0898	33484.1719	33748.2812	34660.0586	35406.3828	34624.7266	29630.3906	32670.6719	32201.084	34584.6562	32683.0508	34157.332	29546.9043	30117.1035	32264.0918	35563.7656
1.2008	32485.627	32702.8457	32323.2578	29937.8281	31549.0039	29611.4258	36094.793	32529.7207	36022.2656	31407.8613	32334.8887	28269.4844	32929.4883	32470.8027	29501.5742	29193.0645	35528.2305	33041.0703	35548.6523	35107.4922	34828.9258	34033.1211	28401.2832	32033.4004	31674.6719	34907.0703	33073.1992	33570.4727	29266.9121	29880.0586	31150.4219	35582.5078
1.3342	31936.2539	32336.918	32155.1094	29549.7598	31838.6758	31291.6621	37636.1602	32402.209	35072.8555	29154.4004	32878.2031	28526.9219	33818.3711	32006.9766	29340.1445	29039.3965	35519.4023	31730.2207	35018.0625	33565.5664	35635.418	32832.1797	27589.0234	32860.0703	30605.1426	35314.3125	34329.6602	33554.3164	29627.4707	29135.8691	30410.9102	36757.1875
1.4676	30487.4883	32363.7852	30984.4805	31487.9785	31155.5469	31443.5664	36701.918	34223.5859	35287.7578	29170.7988	31295.7031	29459.8457	34864.9453	31622.3203	30740.1289	29146.5918	34001.207	34112.3281	33701.2305	34163.8672	34632.4922	33252.9062	29144.832	32777.375	31877.8594	36449.5781	34142.5508	33747.3984	28579.0488	31184.8887	31940.4375	37726.5078
1.6011	31750.1816	32854.7383	30490.8613	31559.3965	30553.707	31581.4297	36602.8789	34100.9922	35367.6133	27243.7891	32707.1504	28827.5	33868.1094	30967.0312	30471.4512	29694.4199	35846.2852	34151.2227	34927.2227	36692.8203	36219.4688	33884.3125	28208.7754	34117.0156	30655.582	35900.7031	31750.2324	32782.8242	28555.6289	29909.7871	32256.1094	36652.2891
1.7345	30798.041	33361.25	29565.1758	30005.2305	32349.2051	30600.7344	35824.1172	31759.4023	35953.8828	29206.4629	33247.543	29876.1777	33539.8008	31504.9668	29764.209	31126.9961	33890.0195	31903.7363	35751.3359	33843.8398	35372.0625	34351.9766	28400.8535	35719.8984	31625.623	36225.1094	31608.8398	31485.8887	27989.5	29437.5977	31170.5449	35989.0547
1.8679	32141.9219	33649.7422	30151.3652	30599.7969	32276.9766	30078.8848	34750.9727	33100.6523	37227.918	29011.6699	32776.6953	29147.2598	34107.1758	31215.6562	29531.9336	30558.7852	33618.0352	32977.1367	36638.3086	35285.1914	34538.4102	32551.0723	28117.6523	41364.4844	32058.2227	36381.8672	33367.4062	32489.1836	30033.3555	28542.834	30577.0039	35773.6094
2.0013	32667.6973	32666.5156	32925.5781	29853.8496	32390.3203	30340.6797	38302.4414	34755.168	38052.4258	28382.0625	31956.5996	29587.5117	33688.9023	32001.3496	30378.9434	30677.9902	31738.543	32320.5039	37985.0703	35927.1562	37730.2734	33067.3203	28347.6758	54842.6445	32513.5996	37566.0273	32175.5469	31259.7656	31388.9609	31007.3203	31261.5586	35629.168
2.1347	34276.4375	35710.8633	34579.6367	31086.6953	34092.3984	29160.3496	43721.0781	34407.8477	37005.9805	29740.0117	32718.4922	30851.7422	35154.4883	32959.2422	30390.3887	31237.5547	34230.1289	32625.4512	44234.4141	36697.3594	41417.2891	32886.4688	29218.3945	85136.5703	35382.4766	38232.957	32270.9805	32176.0547	31217.2012	31602.4668	33033.5781	33629.4531
2.2682	35684.3125	37254.9414	36658.4727	31683.0859	39026.7578	29451.2031	60032.3828	35779.668	40705.7266	29656.2148	33469.2305	30075.9961	36471.3984	34081.5898	31312.9395	32268.2637	33828.457	33676.4883	58809.2578	36210.8086	51613.3984	33614.957	29803.4355	113885.7969	42746.875	38804.9727	33601.5586	33651.6797	32124.6543	33755.7422	35114.25	35625.6797
2.4016	38874.332	36919.4297	44993.3359	36210.8555	50816.7383	31285.7715	101138.3203	33831.1836	49588.5742	31220.7988	36022.8047	30913.9414	41203.9102	38034.4805	33147.3086	30982.5664	34731.9062	34678.0742	93120.5781	38766.5938	73775.4375	35210.5859	29672.709	98698.2031	62462.168	42740.7656	34220.7422	35420.4531	34816.8555	39664.8945	38802.3945	36719.0508
2.535	44503.7422	44198.3555	57751.5742	43249.3945	71224.4453	32532.6875	146223.3594	34755.7891	67118.3828	35391.2617	41215.9141	32612.4199	51804.7656	50499.2422	37430.0508	31657.6172	36518.3477	36248.957	132171.4531	44273.6836	83552.6484	35594.3477	31838.0801	66916.625	98533.8125	51296.2344	34621.793	39618.6602	38195.8984	55516.6055	49475.0352	34587.0312
2.6684	58364.9805	61774.0078	72948.1406	57068.5234	79377.4922	36640.5977	139330.6094	35834.9805	86327.7188	44873.2773	55382.7617	38740.9766	68745.5391	79311.8984	48438.7695	34049.9375	40406.0156	40940.6328	118947.4141	57585.2969	70183.4688	41348.4531	40179.8203	48521.4688	120867.6562	69256.6953	34699.418	51241.2539	46228.6445	83874.375	69827.7031	36101.8359
2.8019	77532.375	78271.2109	67919.3906	92142.25	62058.1562	46248.6406	91707.3281	41495.6875	79447.5781	69863.6953	86374.6641	51313.9961	75203.3516	106387.8359	71900.6484	39902.3086	45881.6641	49196.4492	81046.3828	85039.3359	52222.4102	53788.0234	54629.4961	38794.6172	98796.9844	109736.7812	42643.1758	73932.6875	66817.8672	89293.3594	105412.6016	36679.9062
2.9353	75843.9297	69262.1484	50211.207	134923.4375	42495.1836	65159.1719	59843.5625	54021.293	56091.5469	89427.6406	116318.9375	61487.6523	56504.6016	88957.9219	99895.2578	54832.2344	66615.9766	76005.4844	55304.4883	99381.8359	NaN	76083.875	78068.7344	NaN	60888.5273	133639.5625	46055.3633	86096.1094	101879.4688	60397.7734	115186.6328	36722.0039
3.0687	52420.1289	51445.1836	38360.5391	131770.125	36723.5312	71071.2812	46845.4883	68635.0938	43286.5273	82909.0938	103450.7578	49794.5586	43411.6406	59285.8008	98504.6719	97398.4531	119079.5938	127869.2422	NaN	72177.0469	NaN	76336.9844	82454.3906	NaN	46659.5898	103459.2969	42541.9141	68564.125	110784.6641	42948.793	85836.4609	39439.2578
3.2021	41047.8633	40767.3711	33302.543	83247.8594	34179.0195	57593.207	43165.582	64516.418	39816.7695	57963.1094	64609.1953	39066.5352	NaN	44817.9102	63189.4336	139678.5156	163843.875	158625.4062	NaN	52884.5859	NaN	54953.4297	62989.582	NaN	38289.3711	64658.8672	37501.6797	48311.0469	73336.9766	NaN	55641.5273	43336.5
3.3355	37322.4453	37573.0898	32421.2324	47269.2734	34609.2461	43500.4961	39357.7969	50245.0703	38308.0078	40994.4922	44684.7422	33078.8594	NaN	37870.7812	43940	131381.125	136438.2812	123547.4688	NaN	43287.6055	NaN	42171.5859	44324.8086	NaN	34272.3125	47836.9492	36141.7734	39316.5703	50346.6602	NaN	42196.9609	53630.9258
3.469	33610.0234	NaN	NaN	35286.1562	NaN	36950.6211	39190.832	40845.375	41359.8711	35104.8984	36857.4023	31231.8418	NaN	38346.3945	36201.8398	82488.3828	77320.7578	76758.3594	NaN	39658.5469	NaN	40761.5352	33955.6758	NaN	33252.8203	40389.6523	34372.3867	36590.9102	40386.9883	NaN	38162.625	81538.8828
3.6024	32227.1016	NaN	NaN	32103.4551	NaN	35628.0469	39976.4336	39302.543	38288.8789	31976.9883	NaN	30863.0449	NaN	40864.1602	32348.2402	51430.7109	51490.2148	54126.5742	NaN	39269.7812	NaN	39730.8867	32659.5508	NaN	NaN	39298.3633	34544.6406	NaN	NaN	NaN	36005.9922	106344.1094
3.7358	33764.1875	NaN	NaN	29133.5039	NaN	34680.3672	NaN	35652.2227	NaN	30333.4648	NaN	NaN	NaN	NaN	31414.2188	40269.8672	42301.9883	42968.4492	NaN	40983.9609	NaN	NaN	32499.2109	NaN	NaN	37390.4297	NaN	NaN	NaN	NaN	32127.8828	91838.5
3.8692	39374.9336	NaN	NaN	29407.4355	NaN	34518.4688	NaN	34754.6484	NaN	30738.3848	NaN	NaN	NaN	NaN	NaN	34364.6172	NaN	39139.5938	NaN	NaN	NaN	NaN	NaN	NaN	NaN	35921.7656	NaN	NaN	NaN	NaN	NaN	62144.1523
4.0027	45481.3555	NaN	NaN	32018.5332	NaN	33586.9844	NaN	38032.5781	NaN	28834.4648	NaN	NaN	NaN	NaN	NaN	34652.5195	NaN	36934.8867	NaN	NaN	NaN	NaN	NaN	NaN	NaN	36390.5234	NaN	NaN	NaN	NaN	NaN	47134.8125
4.1361	NaN	NaN	NaN	NaN	NaN	31060.4434	NaN	35585.793	NaN	28900.3008	NaN	NaN	NaN	NaN	NaN	NaN	NaN	35657.5586	NaN	NaN	NaN	NaN	NaN	NaN	NaN	36517.0664	NaN	NaN	NaN	NaN	NaN	42007.7539
4.2695	NaN	NaN	NaN	NaN	NaN	NaN	NaN	NaN	NaN	NaN	NaN	NaN	NaN	NaN	NaN	NaN	NaN	NaN	NaN	NaN	NaN	NaN	NaN	NaN	NaN	NaN	NaN	NaN	NaN	NaN	NaN	41148.9453
4.4029	NaN	NaN	NaN	NaN	NaN	NaN	NaN	NaN	NaN	NaN	NaN	NaN	NaN	NaN	NaN	NaN	NaN	NaN	NaN	NaN	NaN	NaN	NaN	NaN	NaN	NaN	NaN	NaN	NaN	NaN	NaN	NaN
4.5363	NaN	NaN	NaN	NaN	NaN	NaN	NaN	NaN	NaN	NaN	NaN	NaN	NaN	NaN	NaN	NaN	NaN	NaN	NaN	NaN	NaN	NaN	NaN	NaN	NaN	NaN	NaN	NaN	NaN	NaN	NaN	NaN
4.6698	NaN	NaN	NaN	NaN	NaN	NaN	NaN	NaN	NaN	NaN	NaN	NaN	NaN	NaN	NaN	NaN	NaN	NaN	NaN	NaN	NaN	NaN	NaN	NaN	NaN	NaN	NaN	NaN	NaN	NaN	NaN	NaN
4.8032	NaN	NaN	NaN	NaN	NaN	NaN	NaN	NaN	NaN	NaN	NaN	NaN	NaN	NaN	NaN	NaN	NaN	NaN	NaN	NaN	NaN	NaN	NaN	NaN	NaN	NaN	NaN	NaN	NaN	NaN	NaN	NaN
4.9366	NaN	NaN	NaN	NaN	NaN	NaN	NaN	NaN	NaN	NaN	NaN	NaN	NaN	NaN	NaN	NaN	NaN	NaN	NaN	NaN	NaN	NaN	NaN	NaN	NaN	NaN	NaN	NaN	NaN	NaN	NaN	NaN
5.07	NaN	NaN	NaN	NaN	NaN	NaN	NaN	NaN	NaN	NaN	NaN	NaN	NaN	NaN	NaN	NaN	NaN	NaN	NaN	NaN	NaN	NaN	NaN	NaN	NaN	NaN	NaN	NaN	NaN	NaN	NaN	NaN
