0.00000,13698.386
0.13342,14382.062
0.26684,16033.790
0.40027,17495.551
0.53369,20385.172
0.66711,21122.205
0.80053,20603.094
0.93395,20319.619
1.06737,20087.312
1.20080,18400.982
1.33422,16106.353
1.46764,15136.113
1.60106,14420.750
1.73448,14136.783
1.86791,13970.721
