0.0000	33878.4570
0.1334	34057.7500
0.2668	34313.3828
0.4003	35683.2617
0.5337	34645.3711
0.6671	33856.5000
0.8005	33156.2070
0.9340	34855.4922
1.0674	36175.5703
1.2008	38513.2266
1.3342	43248.1055
1.4676	54496.3867
1.6011	82850.1328
1.7345	113070.8594
1.8679	103902.0469
2.0013	71531.0703
2.1347	48441.0430
2.2682	41034.7461
2.4016	37460.8867
2.5350	36104.8789
