x	Y_20180130_15100b_10_15g	Y_20180130_15100b_10_9g	Y_20180130_15100b_11_5g	Y_20180130_15100b_11_8g	Y_20180130_15100b_12_15g	Y_20180130_15100b_12_7g	Y_20180130_15100b_14_1g	Y_20180130_15100b_15_3g	Y_20180130_15100b_15_9g	Y_20180130_15100b_17_12g	Y_20180130_15100b_18_22g	Y_20180130_15100b_18_8g	Y_20180130_15100b_1_14g	Y_20180130_15100b_1_3g	Y_20180130_15100b_20_14g	Y_20180130_15100b_23_2g	Y_20180130_15100b_2_6g	Y_20180130_15100b_2_7g	Y_20180130_15100b_3_4g	Y_20180130_15100b_3_8g	Y_20180130_15100b_5_2g	Y_20180130_15100b_7_2g	Y_20180130_15100b_9_15g
0	10543.613	13610.086	13791.359	11823.888	10839.399	13594.301	12084.73	11962.223	12519.396	10423.028	10689.6	11211.15	9802.865	11879.908	13692.846	12937.297	12527.753	13056.931	11373.048	11481.893	12301.222	13150.885	10964.138
0.1334	10998.585	14153.475	14122.791	12289.417	11488.111	13742.506	12803.644	11940.078	12955.574	11725.771	11435.374	11413.561	10354.089	11346.784	13546.85	13470.185	13383.344	13279.23	12042.4	12069.052	13898.949	13154.745	12014.069
0.2668	12431.316	15583.188	14597.694	12993.562	13002.202	13767.591	13173.61	12827.633	13942.28	12160.466	13140.93	12979.671	10754.741	12784.89	13545.338	14209.24	13555.157	15224.454	14660.992	14054.699	14886.707	15023.775	13261.444
0.4003	13684.18	16417.91	14799.763	13642.189	14886.108	14929.798	13925.64	15793.524	16641.549	13214.681	15121.373	13973.48	12368.972	14680.475	13981.688	17387.686	15292.066	17797.715	17491.68	15624.583	16403.377	16612.84	14295.534
0.5337	16374.421	16938.473	17531.064	13598.013	14879.459	15919.286	15028.403	17943.502	16395.963	15300.21	19831.115	15453.794	14136.337	15061.023	17453.643	17277.59	16340.799	20566.637	18020.117	19964.08	16112.932	17698.312	17520.527
0.6671	15385.707	18016.324	20569.271	13324.634	15018.752	14575.399	14423.782	19633.295	16260.824	15030.386	22403.729	15279.476	14270.281	14857.924	21691.506	16033.087	16251.478	21660.258	17002.879	21117.012	14112.37	18167.818	16976.676
0.8005	15015.274	19542.25	22227.281	14533.836	14032.869	14121.47	13877.555	17452.875	15830.338	14253.334	20644.158	15358.825	13737.146	14108.26	21063.207	15964.157	15882.057	19846.701	16588.041	18438.898	14024.745	16908.521	15122.19
0.934	13639.062	20249.936	19986.941	14434.182	13808.695	14958.684	13630.87	16148.665	15714.801	14300.885	18060.428	15430.977	12590.226	14636.854	18419.891	16850.307	15463.346	18405.496	14796.581	16300.187	14140.579	16526.738	15788.261
1.0674	13912.173	18918.936	19421.475	15301.735	14221.082	15388.562	13112.087	15356.882	15358.593	13933.759	15629.625	15602.339	12310.293	13353.442	15978.639	16376.562	14897.138	16993.287	15362.531	16101.248	13247.886	15988.629	15983.949
1.2008	13946.208	18082.463	18297.342	14428.996	14164.463	14876.299	13592.239	14998.463	15918.638	13704.184	14580.962	14171.222	13172.085	12487.955	15956.742	16109.26	14576.675	16569.754	14709.656	15309.187	13591.685	16389.088	14717.19
1.3342	13306.937	19368.561	16955.09	14409.721	14173.992	15034.889	13796.397	14778.179	16295.024	14026.364	15697.39	14049.36	13373.076	12776.833	16458.904	15538.082	14618.595	16751.879	14098.86	15032.811	13520.768	14721.293	14868.727
1.4676	12997.911	21062.756	16840.748	13726.916	13334.019	15016.87	13646.442	13738.727	15862.076	13775.675	14876.758	13799.696	13022.933	12646.407	16392.648	15368.002	14578.336	17142.652	14135.282	13826.631	13791.285	14282.628	14332.56
1.6011	12770.326	20317.061	16487.215	13359.07	13352.922	14210.142	12814.073	14767.077	15062.224	13241.295	15897.54	14405.878	12334.212	13229.577	17023.822	15756.65	15255.825	16302.486	14312.905	14348.554	14271.892	14123.998	13782.799
1.7345	12496.293	19993.518	15469.824	12993.24	12883.9	14456.712	12369.498	13423.748	13663.402	13581.855	14481.812	15734.664	12399.344	13265.128	16515.574	15761.77	16208.22	16849.725	14912.312	14327.315	13038.912	14248.201	14102.301
1.8679	12368.655	19659.465	15220.279	13506.714	12667.528	13460.616	12379.34	13130.82	13336.833	13828.756	15842.185	16155.59	12550.842	14111.79	16125.552	14482.361	17247.762	16770.83	15794.425	13521.81	13218.94	14480.689	13872.182
2.0013	13377.911	18072.861	14593.827	13638.606	12459.669	13122.988	12028.805	13549.678	12600.927	14045.629	13991.32	16747.922	12360.521	14207.355	15586.982	14196.142	15877.109	16929.75	15656.715	12975.878	13565.729	14524.616	13857.002
2.1348	12688.02	15948.78	15573.12	13276.33	12374.816	13680.518	12241.381	13915.52	12721.064	13882.483	13938.867	17357.426	11199.857	13894.329	14219.052	13688.034	14002.662	15826.193	15238.635	13391.29	12185.223	13285.614	13147.315
2.2682	11885.433	14713.092	15052.656	12921.197	12891.504	12343.684	12614.858	14022.6	12532.233	13610.944	14232.153	16224.613	11486.893	13351.346	13758.671	13587.429	13735.437	14946.376	14966.553	13909.861	12250.416	12491.831	12564.695
2.4016	11634.647	13596.98	14183.273	13419.773	12851.31	12878.557	12041.764	13429.338	12290.58	12740.001	13557.858	15041.727	11120.48	12691.81	14800.629	14006.708	13942.933	14878.277	14920.007	13093.002	12290.768	12373.607	12368.932
2.535	11534.021	14041.902	13326.229	13988.731	12340.176	12099.847	12145.763	12480.84	12897.51	12858.946	14282.319	13393.979	11401.52	13106.279	14570.153	NaN	13112.698	13604.556	14433.705	12609.184	12052.021	12882.959	13560.224
2.6684	11423.775	13459.883	13014.491	13398.158	11910.938	12201.632	12796.553	12162.688	11958.519	13054.56	13011.419	12392.157	11475.765	12892.981	13808.674	NaN	NaN	12912.979	14233.523	12710.855	11412.515	11344.983	12892.143
2.8019	10911.88	12784.6	12808.807	12169.296	NaN	NaN	NaN	12103.679	NaN	12839.794	12935.474	12480.848	11254.552	NaN	12533.264	NaN	NaN	13953.714	13363.709	13612.048	NaN	NaN	NaN
2.9353	11253.533	12143.782	12396.405	12582.577	NaN	NaN	NaN	NaN	NaN	NaN	NaN	12688.024	11234.134	NaN	NaN	NaN	NaN	NaN	NaN	14195.879	NaN	NaN	NaN
3.0687	NaN	12207.972	12657.756	12509.411	NaN	NaN	NaN	NaN	NaN	NaN	NaN	NaN	11332.347	NaN	NaN	NaN	NaN	NaN	NaN	NaN	NaN	NaN	NaN
3.2021	NaN	12374.897	12808.516	NaN	NaN	NaN	NaN	NaN	NaN	NaN	NaN	NaN	NaN	NaN	NaN	NaN	NaN	NaN	NaN	NaN	NaN	NaN	NaN
3.3356	NaN	NaN	NaN	NaN	NaN	NaN	NaN	NaN	NaN	NaN	NaN	NaN	NaN	NaN	NaN	NaN	NaN	NaN	NaN	NaN	NaN	NaN	NaN
3.469	NaN	NaN	NaN	NaN	NaN	NaN	NaN	NaN	NaN	NaN	NaN	NaN	NaN	NaN	NaN	NaN	NaN	NaN	NaN	NaN	NaN	NaN	NaN
3.6024	NaN	NaN	NaN	NaN	NaN	NaN	NaN	NaN	NaN	NaN	NaN	NaN	NaN	NaN	NaN	NaN	NaN	NaN	NaN	NaN	NaN	NaN	NaN
3.7358	NaN	NaN	NaN	NaN	NaN	NaN	NaN	NaN	NaN	NaN	NaN	NaN	NaN	NaN	NaN	NaN	NaN	NaN	NaN	NaN	NaN	NaN	NaN
3.8692	NaN	NaN	NaN	NaN	NaN	NaN	NaN	NaN	NaN	NaN	NaN	NaN	NaN	NaN	NaN	NaN	NaN	NaN	NaN	NaN	NaN	NaN	NaN
4.0027	NaN	NaN	NaN	NaN	NaN	NaN	NaN	NaN	NaN	NaN	NaN	NaN	NaN	NaN	NaN	NaN	NaN	NaN	NaN	NaN	NaN	NaN	NaN
