0.00000,15656.446
0.13342,16084.623
0.26684,16001.625
0.40027,15633.750
0.53369,15879.685
0.66711,16019.752
0.80053,16253.110
0.93395,16222.823
1.06737,16003.759
1.20080,16085.718
1.33422,16586.523
1.46764,18750.818
1.60106,19505.500
1.73448,25472.713
1.86791,37978.508
2.00133,55081.387
2.13475,63099.203
2.26817,45811.887
2.40159,30245.797
2.53502,22247.600
