0.00000,12339.479
0.13342,13620.307
0.26684,15502.111
0.40027,18051.043
0.53369,20134.404
0.66711,21771.119
0.80053,24369.693
0.93395,21899.381
1.06737,19791.553
1.20080,17501.523
1.33422,15179.229
1.46764,14321.502
1.60106,13354.023
1.73448,12700.164
1.86791,12782.673
2.00133,12381.121
