0.0000	15566.2783
0.1334	15159.5225
0.2668	17009.2305
0.4003	21192.6895
0.5337	22121.1621
0.6671	18120.7754
0.8005	16784.0391
0.9340	15869.5117
1.0674	15899.7686
1.2008	15763.0342
1.3342	15654.0439
1.4676	14467.3193
1.6011	14892.3184
1.7345	15030.0674
1.8679	14554.0303
2.0013	13842.4023
2.1347	13447.7207
2.2682	13390.8271
2.4016	12904.7227
2.5350	13175.5391
