0.0000	32887.9258
0.1334	32891.0625
0.2668	33533.7422
0.4003	32210.4805
0.5337	30813.6934
0.6671	31797.3926
0.8005	31749.3809
0.9340	32380.1309
1.0674	32138.4941
1.2008	32763.9980
1.3342	33502.6797
1.4676	37030.1172
1.6011	46597.9023
1.7345	72616.5859
1.8679	115631.8203
2.0013	137684.7812
2.1347	100290.6016
2.2682	59919.3438
2.4016	43927.5312
2.5350	37462.5547
2.6684	35023.4727
2.8019	32038.2676
