x	Y_20180514_15338_c2_17_10g	Y_20180514_15338_c2_17_4g	Y_20180514_15338_c2_17_5g	Y_20180514_15338_c2_17_6g	Y_20180514_15338_c2_18_1g	Y_20180514_15338_c2_18_4g	Y_20180514_15338_c2_19_7g	Y_20180514_15338_c2_20_3g	Y_20180514_15338_c2_20_5g	Y_20180514_15338_c2_24_1g	Y_20180514_15338_c2_31_3g	Y_20180514_15338_c2_32_7g	Y_20180514_15338_c2_6_3g	Y_20180514_15338_c2_9_3g	Y_20180514_15338_c2_9_7g
0	9636.437	12677.197	9588.917	12980.113	10281.007	12075.32	12142.055	19730.527	13390.8	13273.936	9430.904	12323.451	10217.134	11135.354	11999.82
0.1334	10115.744	12497.173	9340.388	12816.807	10543.385	12414.859	12707.681	18195.045	13621.266	13835.814	9717.438	10768.391	10522.839	11050.06	12129.941
0.2668	10315.98	12077.704	9456.848	13925.407	10473.385	10750.241	12527.147	15899.147	14176.433	13894.251	9113.243	10346.352	11130.938	12374.892	12105.282
0.4003	11445.252	11252.756	9685.091	14064.59	11178.655	11175.144	13055.394	16976.088	13132.224	14285.523	9460.934	10731.533	12223.005	14274.597	11951.96
0.5337	12361.818	10777.523	9397.343	14913.23	11841.348	12589.316	13820.622	19019.34	13349.386	13835.591	10677.339	11306.079	13271.895	16869.336	13675.727
0.6671	14147.691	10250.721	10015.41	14624.007	11845.107	14382.876	13490.874	18044.023	12880.786	15150.142	10275.648	13129.927	13326.782	17498.268	17895.383
0.8005	16290.077	11196.259	10334.727	16050.64	12064.137	17238.781	13574.874	15380.63	13831.372	16647.398	11503.591	15801.071	13808.203	17286.867	22477.904
0.934	17698.146	12708.301	11159.423	15545.587	13460.91	19042.793	13146.788	14470.237	14293.105	19268.682	12262.22	16566.977	14811.108	18797.998	25615.906
1.0674	19209.588	14602.865	12690.25	15100.018	13975.332	18126.484	13342.442	14181.018	15125.312	22546.01	14984.501	17583.367	15405.883	17964.754	26126.285
1.2008	21495.057	16331.136	14150.413	16355.954	14465.76	17222.611	14889.954	14292.85	16183.64	22300.334	17225.211	16867.164	15786.67	17163.051	24181.494
1.3342	19092.172	18408.748	15652.677	16491.348	13757.368	15285.57	15489.46	14499.074	17887.805	20387.826	17493.283	16275.654	15266.304	16759.947	22645.551
1.4676	17566.377	17580.367	17340.643	17435.363	13197.237	14212.379	14694.312	13618.086	18447.205	18091.996	15146.868	15112.928	18070.318	16319.819	20457.139
1.6011	15982.29	17500.166	17593.262	17520.977	12926.313	15776.942	14230.535	13348.52	17128.721	17747.764	14576.8	15727.023	19179.609	16219.36	19213.465
1.7345	15021.628	17401.496	17954.203	18041.131	13051.886	16413.648	14389.81	13280.254	15906.322	17725.029	13978.765	15811.144	18840.113	16970.752	16709.102
1.8679	14119.124	17380.281	17957.881	19070.447	13136.911	16571.326	13142.065	12339.157	15022.456	17743.373	13848.521	16199.176	18936.471	15417.458	18435.543
2.0013	13998.569	18545.609	17793.59	18995.512	13072.204	17408.994	12970.384	12375.807	14510.443	16856.238	14004.029	15374.561	18713.775	15827.837	17946.113
2.1348	13647.485	19611.371	18567.391	17995.109	12863.993	17135.602	12463.005	12639.421	13937.048	16152.183	13939.048	16052.714	17957.77	14199.716	17370.633
2.2682	13153.462	19327.141	17303.676	16130.919	13417.601	16124.305	11708.331	12290.576	13574.87	15535.71	14057.249	15686.993	19026.414	14054.68	16712.666
2.4016	13187.737	19768.174	16901.137	15206.054	12975.938	15915.472	11924.079	11830.604	13017.579	15526.855	13722.779	15304.884	19013.973	14673.364	15166.969
2.535	12658.253	19040.199	16802.744	14503.247	NaN	16310.224	11289.858	11587.2	13037.918	15359.655	13259.713	15639.909	17928.123	13571.456	15960.611
2.6684	11802.225	20180.801	15748.703	14838.29	NaN	16249.748	11035.231	10899.46	12192.521	15075.349	13010.473	15186.484	17629.627	14147.756	15484.123
2.8019	11846.094	19484.131	15794.716	14436.771	NaN	15152.979	NaN	10608.704	NaN	14228.595	12406.085	14591.031	17219.408	14802.584	15356.739
2.9353	12177.364	19421.307	15200.065	14218.361	NaN	15539.16	NaN	11431.181	NaN	14675.931	12763.521	13334.003	16844.021	14005.094	15501.837
3.0687	12407.678	19247.02	14876.637	13811.48	NaN	15114.064	NaN	NaN	NaN	14231.812	11945.794	13375.643	15967.973	13714.037	15949.02
3.2021	11594.416	18148.484	14591.699	12995.849	NaN	NaN	NaN	NaN	NaN	13848.77	12317.889	13032.384	15546.269	14484.083	15424.095
3.3356	11356.079	16720.266	14003.353	NaN	NaN	NaN	NaN	NaN	NaN	13936.75	12324.869	12792.747	14862.13	14526.978	15976.25
3.469	11122.679	14072.705	13396.456	NaN	NaN	NaN	NaN	NaN	NaN	14117.572	11775.083	NaN	14870.515	13914.188	16812.676
3.6024	10793.122	13456.138	12241.202	NaN	NaN	NaN	NaN	NaN	NaN	14310.226	12379.115	NaN	15620.893	13641.64	16740.664
3.7358	9868.854	13426.385	11843.053	NaN	NaN	NaN	NaN	NaN	NaN	13887.673	NaN	NaN	NaN	12639.021	15091.007
3.8692	9229.587	12544.021	11352.437	NaN	NaN	NaN	NaN	NaN	NaN	NaN	NaN	NaN	NaN	NaN	14246.534
4.0027	9258.656	12589.813	11530.877	NaN	NaN	NaN	NaN	NaN	NaN	NaN	NaN	NaN	NaN	NaN	13521.001
4.1361	NaN	12999.511	10840.707	NaN	NaN	NaN	NaN	NaN	NaN	NaN	NaN	NaN	NaN	NaN	NaN
4.2695	NaN	12775.7	NaN	NaN	NaN	NaN	NaN	NaN	NaN	NaN	NaN	NaN	NaN	NaN	NaN
4.4029	NaN	12974.136	NaN	NaN	NaN	NaN	NaN	NaN	NaN	NaN	NaN	NaN	NaN	NaN	NaN
4.5363	NaN	12909.036	NaN	NaN	NaN	NaN	NaN	NaN	NaN	NaN	NaN	NaN	NaN	NaN	NaN
4.6698	NaN	14068.025	NaN	NaN	NaN	NaN	NaN	NaN	NaN	NaN	NaN	NaN	NaN	NaN	NaN
4.8032	NaN	NaN	NaN	NaN	NaN	NaN	NaN	NaN	NaN	NaN	NaN	NaN	NaN	NaN	NaN
4.9366	NaN	NaN	NaN	NaN	NaN	NaN	NaN	NaN	NaN	NaN	NaN	NaN	NaN	NaN	NaN
5.07	NaN	NaN	NaN	NaN	NaN	NaN	NaN	NaN	NaN	NaN	NaN	NaN	NaN	NaN	NaN
5.2035	NaN	NaN	NaN	NaN	NaN	NaN	NaN	NaN	NaN	NaN	NaN	NaN	NaN	NaN	NaN
