0.00000,32748.975
0.13342,32638.125
0.26684,32094.701
0.40027,34466.020
0.53369,34134.973
0.66711,33169.125
0.80053,33963.406
0.93395,38858.055
1.06737,53068.879
1.20080,74347.664
1.33422,82869.680
1.46764,60926.234
1.60106,46178.426
1.73448,40915.875
1.86791,35556.449
