X,Y
0.00000,13544.746
0.13342,13362.448
0.26684,13692.627
0.40027,17050.893
0.53369,21243.586
0.66711,23577.182
0.80053,21440.385
0.93395,18807.072
1.06737,17297.133
1.20080,15718.378
1.33422,14971.446
1.46764,14081.097
1.60106,13495.261
1.73448,13626.467
1.86791,14150.119
2.00133,14137.083
2.13475,14373.517
2.26817,13864.522
2.40159,12927.811
2.53502,12373.105
2.66844,12468.159
2.80186,12531.142
