X,Y
0.00000,36121.520
0.13342,35749.699
0.26684,35410.016
0.40027,34296.801
0.53369,34184.711
0.66711,34727.816
0.80053,34786.688
0.93395,34682.809
1.06737,36281.242
1.20080,35291.391
1.33422,36230.695
1.46764,36874.949
1.60106,35583.895
1.73448,36181.203
1.86791,38290.125
2.00133,38865.508
2.13475,41532.648
2.26817,47942.539
2.40159,71052.664
2.53502,115820.680
2.66844,153793.281
2.80186,129472.016
2.93528,84921.195
3.06870,60294.367
3.20212,48115.020
