0.00000,34719.395
0.13342,34067.891
0.26684,34488.082
0.40027,35130.375
0.53369,35220.887
0.66711,35387.688
0.80053,35096.422
0.93395,34728.312
1.06737,34607.211
1.20080,35670.668
1.33422,37483.145
1.46764,35156.473
1.60106,34593.430
1.73448,34447.316
1.86791,34423.461
2.00133,37028.738
2.13475,39487.582
2.26817,43877.988
2.40159,57409.488
2.53502,81166.523
2.66844,101383.422
2.80186,88584.750
2.93528,61350.480
3.06870,45822.781
