x	Y_20180130_15109_42_1g	Y_20180130_15109_42_2g	Y_20180130_15109_42_6g	Y_20180130_15109_43_5g
0	12961.698	11125.744	10891.725	12382.876
0.1334	15651.79	11214.301	11537.04	12559.526
0.2668	17081.098	12562.933	12375.304	13440.949
0.4003	16153.137	14096.618	15199.5	16401.596
0.5337	15389.218	14870.561	18328.83	20529.793
0.6671	14793.521	14589.459	21116.994	23283.373
0.8005	13705.801	14167.789	22707.459	22949.486
0.934	13838.874	13385.826	22921.83	20624.1
1.0674	13515.136	12231.19	22151.984	19077.695
1.2008	13906.904	12309.354	20677.904	19002.02
1.3342	13818.942	12339.074	19336.205	18792.178
1.4676	13692.815	12229.229	19058.447	20097.02
1.6011	14292.558	12831.432	17663.873	19098.359
1.7345	14544.987	12477.741	17085.258	18369.926
1.8679	14895.227	12901.189	15732.277	18129.41
2.0013	15287.734	13526.214	16109.431	17138.512
2.1348	13996.926	13871.963	16189.121	16846.588
2.2682	13833.503	14271.947	16019.767	16310.724
2.4016	15105.514	14017.6	14736.973	15954.334
2.535	14479.853	13998.42	14098.941	16311.497
2.6684	13484.774	13022.999	14304.503	16144.109
2.8019	12774.413	13113.515	14023.488	16097.427
2.9353	12274.591	12868.548	13906.962	14654.227
3.0687	NaN	12395.064	13083.528	13930.017
3.2021	NaN	12667.045	12273.098	12962.909
3.3356	NaN	NaN	12218.548	12544.541
3.469	NaN	NaN	12309.887	12733.651
3.6024	NaN	NaN	NaN	12993.44
3.7358	NaN	NaN	NaN	NaN
3.8692	NaN	NaN	NaN	NaN
4.0027	NaN	NaN	NaN	NaN
4.1361	NaN	NaN	NaN	NaN
4.2695	NaN	NaN	NaN	NaN
4.4029	NaN	NaN	NaN	NaN
4.5363	NaN	NaN	NaN	NaN
