0.00000,12474.838
0.13342,13719.850
0.26684,14377.240
0.40027,17686.729
0.53369,21446.539
0.66711,21230.914
0.80053,20791.523
0.93395,17853.430
1.06737,17433.930
1.20080,16761.152
1.33422,16826.738
1.46764,15214.323
1.60106,15715.721
1.73448,16032.693
1.86791,14708.474
2.00133,13773.987
2.13475,13456.264
2.26817,12581.302
2.40159,12029.982
2.53502,11997.683
2.66844,13121.811
2.80186,12923.888
