0.0000	30631.7891
0.1334	31131.5020
0.2668	30971.0312
0.4003	31698.5488
0.5337	30891.5332
0.6671	31531.2324
0.8005	31153.8164
0.9340	31830.8574
1.0674	36064.9297
1.2008	40250.5273
1.3342	51094.2461
1.4676	76204.1484
1.6011	108409.2969
1.7345	106137.8125
1.8679	71589.6328
2.0013	48699.4336
2.1347	39917.4648
2.2682	35901.6797
2.4016	34303.4688
