0.0000	30013.0410
0.1334	29159.9141
0.2668	29991.5703
0.4003	32338.3027
0.5337	31998.4941
0.6671	31400.4844
0.8005	32175.8105
0.9340	33559.4609
1.0674	32854.1250
1.2008	33428.3281
1.3342	32862.9297
1.4676	32777.7031
1.6011	34527.7500
1.7345	34049.2500
1.8679	34922.9531
2.0013	34863.8750
2.1347	39351.7578
2.2682	52657.4258
2.4016	73819.5547
2.5350	76411.3750
2.6684	59026.2930
2.8019	45843.1445
2.9353	38720.9102
3.0687	34953.5820
3.2021	34318.0547
3.3355	33008.0859
