0.0000	13227.0166
0.1334	13800.6875
0.2668	15958.9814
0.4003	20159.2246
0.5337	21166.8633
0.6671	18861.7949
0.8005	17935.1211
0.9340	20616.2285
1.0674	21693.1816
1.2008	19789.9082
1.3342	17250.2852
1.4676	16781.5625
1.6011	15303.4072
1.7345	14733.1484
1.8679	14274.0547
2.0013	13163.9922
2.1347	12880.4658
2.2682	12721.8740
2.4016	12156.5947
