0.00000,35210.801
0.13342,35794.145
0.26684,35084.852
0.40027,36052.863
0.53369,36721.113
0.66711,37292.008
0.80053,39511.680
0.93395,44954.934
1.06737,59560.414
1.20080,91533.961
1.33422,118739.898
1.46764,101031.391
1.60106,64477.379
1.73448,45600.789
1.86791,39368.609
