0.00000,34641.598
0.13342,33223.492
0.26684,32869.656
0.40027,34449.457
0.53369,34807.309
0.66711,34659.727
0.80053,33588.555
0.93395,36560.098
1.06737,37131.766
1.20080,36858.035
1.33422,37334.168
1.46764,35809.938
1.60106,35274.383
1.73448,36426.738
1.86791,37104.309
2.00133,39488.234
2.13475,45245.844
2.26817,63727.043
2.40159,90314.734
2.53502,92348.648
2.66844,75165.906
2.80186,61858.566
2.93528,52774.840
3.06870,43702.543
3.20212,39958.270
