x	Y_20180130_15109_14_11g	Y_20180130_15109_17_14g	Y_20180130_15109_17_15g	Y_20180130_15109_17_1g	Y_20180130_15109_17_9g
0	11541.3	13076.41	12231.611	14124.555	10651.925
0.1334	12092.12	12657.771	13404.864	13987.838	10724.782
0.2668	14110.982	12516.352	14306.214	15091.572	11424.923
0.4003	17514.926	13423.573	16571.07	16074.971	11981.107
0.5337	21301.076	14502.513	19729.055	18894.125	12802.105
0.6671	21191.996	17274.525	21483.537	24689.41	15078.646
0.8005	17542.836	20583.191	20623.875	29116.076	17804.154
0.934	16884.738	20292.25	20158.297	29539.693	17923.396
1.0674	15884.296	18253.764	19493.533	28447.736	19833.094
1.2008	14358.299	16790.059	17029.422	25979.207	19821.512
1.3342	13283.438	16512.746	17143.922	23821.826	18397.047
1.4676	13472.709	16046.745	17958.35	20879.75	17077.262
1.6011	13117.161	16507.631	18564.332	19223.393	18055.328
1.7345	12695.362	15555.284	19575.424	19088.801	18434.699
1.8679	11512.047	13214.979	18382.488	17140.406	16540.195
2.0013	12436.386	12786.252	16853.791	14488.122	16485.262
2.1348	12312.644	12999.034	15320.352	13059.37	16657.547
2.2682	12416.654	12932.73	13414.771	13336.261	16017.993
2.4016	11657.096	13467.624	12654.159	12882.242	14747.822
2.535	11473.152	13205.569	12398.073	12879.027	13747.98
2.6684	11772.436	12379.579	12891.824	12114.94	13187.635
2.8019	NaN	12395.396	NaN	12465.079	12508.249
2.9353	NaN	NaN	NaN	11839.396	12002.524
3.0687	NaN	NaN	NaN	NaN	12490.078
3.2021	NaN	NaN	NaN	NaN	12773.578
3.3356	NaN	NaN	NaN	NaN	NaN
3.469	NaN	NaN	NaN	NaN	NaN
3.6024	NaN	NaN	NaN	NaN	NaN
3.7358	NaN	NaN	NaN	NaN	NaN
3.8692	NaN	NaN	NaN	NaN	NaN
4.0027	NaN	NaN	NaN	NaN	NaN
4.1361	NaN	NaN	NaN	NaN	NaN
4.2695	NaN	NaN	NaN	NaN	NaN
4.4029	NaN	NaN	NaN	NaN	NaN
4.5363	NaN	NaN	NaN	NaN	NaN
4.6698	NaN	NaN	NaN	NaN	NaN
4.8032	NaN	NaN	NaN	NaN	NaN
4.9366	NaN	NaN	NaN	NaN	NaN
5.07	NaN	NaN	NaN	NaN	NaN
5.2035	NaN	NaN	NaN	NaN	NaN
