0.0000	16371.2861
0.1334	15243.6768
0.2668	15651.9404
0.4003	20052.0020
0.5337	23622.0703
0.6671	27863.4258
0.8005	25126.0996
0.9340	22119.8223
1.0674	21225.2285
1.2008	19254.8438
1.3342	18609.9648
1.4676	21042.7969
1.6011	21916.1055
1.7345	19390.4160
1.8679	17047.9941
2.0013	17770.5234
