x	Y_20180514_15338_c1_12_4g	Y_20180514_15338_c1_17_9g	Y_20180514_15338_c1_18_7g	Y_20180514_15338_c1_8_2g	Y_20180514_15338_c1_9_13g
0	12526.7275	11627.8037	12758.5996	11839.0283	11926.9814
0.1334	12222.1748	13606.6387	14754.4453	13727.5518	11325.4922
0.2668	13011.0713	17922.5059	18325.2012	14929.0283	11324.1797
0.4003	15786.125	25850.543	23718.6523	16110.0254	13077.2666
0.5337	20322.3945	30361.9668	26431.2617	18815.9551	14494.0713
0.6671	23272.4961	28281.6035	19762.9492	21440.6113	17753.418
0.8005	24155.8652	25508.4902	18383.2734	19184.4238	22926.1348
0.934	23145.9414	22672.3887	16923.1914	17289.9629	23539.7031
1.0674	20209.0352	20051.4258	16498.4336	15132.6699	18767.2266
1.2008	18156.6855	19120.5078	17003.1777	14390.5684	17757.916
1.3342	16332.7588	19997.752	18109.6211	14418.6143	17377.0859
1.4676	16181.46	19336.1387	17306.4531	14519.6592	18420.6855
1.6011	15975.7139	20003.3633	17690.3047	14346.708	18307.2617
1.7345	16507.1855	19717.5918	17298.3867	13892.6572	18546.8008
1.8679	16478.2461	19523.8945	17444.4512	13790.5059	19990.0273
2.0013	17613.2227	17901.9238	18785.7676	12217.4141	21054.5508
2.1347	18174.6328	16976.6406	18119.6172	12231.4746	19676.6992
2.2682	19113.8555	16461.334	16893.0156	12317.8496	18279.1641
2.4016	19898.7578	15604.168	16245.9883	13198.124	16090.543
2.535	20681.8262	14634.3613	15517.5986	14173.8643	15795.6201
2.6684	21239.8574	15707.001	16312.1484	13464.3721	16552.252
2.8019	19555.0059	16414.9648	15997.0176	14786.4336	16892.7305
2.9353	17271.8398	16886.4629	16007.5576	15016.4141	18025.0977
3.0687	15717.4697	16013.4502	15660.7773	14352.7217	18071.3652
3.2021	13928.2412	15027.7812	14554.8984	13498.3408	17294.5879
3.3355	13984.4521	13898.2939	13810.9785	12659.1152	16349.1855
3.469	13570.1475	13450.2812	13696.6416	12906.9775	14564.6416
3.6024	12064.8389	13492.0098	13369.6836	12268.8125	14175.1758
3.7358	11890.5742	NaN	13283.8271	NaN	14053.2021
3.8692	12068.2754	NaN	13215.1377	NaN	13345.1963
4.0027	13085.4082	NaN	NaN	NaN	13396.4189
4.1361	13754.1865	NaN	NaN	NaN	13560.377
4.2695	14541.0146	NaN	NaN	NaN	13019.6992
4.4029	NaN	NaN	NaN	NaN	NaN
4.5363	NaN	NaN	NaN	NaN	NaN
4.6698	NaN	NaN	NaN	NaN	NaN
4.8032	NaN	NaN	NaN	NaN	NaN
4.9366	NaN	NaN	NaN	NaN	NaN
5.07	NaN	NaN	NaN	NaN	NaN
5.2035	NaN	NaN	NaN	NaN	NaN
5.3369	NaN	NaN	NaN	NaN	NaN
5.4703	NaN	NaN	NaN	NaN	NaN
5.6037	NaN	NaN	NaN	NaN	NaN
5.7371	NaN	NaN	NaN	NaN	NaN
5.8706	NaN	NaN	NaN	NaN	NaN
