X,Y
0.00000,36549.637
0.13342,35215.621
0.26684,36948.059
0.40027,37209.750
0.53369,37097.742
0.66711,39629.676
0.80053,38446.168
0.93395,36982.188
1.06737,40517.062
1.20080,47732.586
1.33422,58810.973
1.46764,65861.922
1.60106,54491.547
1.73448,43179.168
