0.00000,36654.301
0.13342,37065.781
0.26684,35771.477
0.40027,36058.703
0.53369,35630.512
0.66711,36169.598
0.80053,35855.039
0.93395,37137.730
1.06737,34452.066
1.20080,35205.566
1.33422,36584.453
1.46764,40116.711
1.60106,48918.492
1.73448,69085.266
1.86791,87546.898
2.00133,77760.484
2.13475,56694.078
2.26817,45518.973
