0.00000,13157.723
0.13342,14696.663
0.26684,15939.602
0.40027,17498.812
0.53369,20653.971
0.66711,26420.203
0.80053,31386.738
0.93395,32086.652
1.06737,29963.002
1.20080,26375.576
1.33422,23792.648
1.46764,20746.559
1.60106,19638.920
1.73448,16766.578
1.86791,15542.543
2.00133,14836.916
2.13475,13960.250
2.26817,14447.992
2.40159,14933.979
2.53502,14698.883
2.66844,14537.934
