X,Y
0.00000,14136.266
0.13342,16560.820
0.26684,18757.488
0.40027,19004.842
0.53369,17254.160
0.66711,15151.617
0.80053,13688.657
0.93395,14080.363
1.06737,13615.837
1.20080,13320.645
1.33422,13424.152
1.46764,12539.966
1.60106,12720.938
1.73448,12239.674
1.86791,11253.914
