0.00000,17532.357
0.13342,21317.615
0.26684,28137.689
0.40027,27151.795
0.53369,24355.971
0.66711,20399.770
0.80053,17499.201
0.93395,15595.537
1.06737,14788.299
1.20080,14291.072
1.33422,13922.029
1.46764,14084.484
