0.0000	37153.9453
0.1334	37851.6719
0.2668	37697.3438
0.4003	38577.5586
0.5337	37544.5273
0.6671	43165.5430
0.8005	49773.2656
0.9340	74304.4922
1.0674	112292.1484
1.2008	108116.8047
1.3342	69546.5938
1.4676	50510.4961
1.6011	43037.6211
