0.00000,14695.107
0.13342,15469.158
0.26684,16389.402
0.40027,19241.930
0.53369,22451.852
0.66711,24418.936
0.80053,26298.980
0.93395,26255.186
1.06737,27319.881
1.20080,25248.705
1.33422,22606.094
1.46764,22123.383
1.60106,23584.277
1.73448,21208.023
1.86791,19672.488
2.00133,17758.098
2.13475,14743.110
2.26817,12798.923
