0.00000,39578.180
0.13342,38740.879
0.26684,40064.215
0.40027,39934.926
0.53369,40322.500
0.66711,40741.773
0.80053,40342.086
0.93395,40324.285
1.06737,40971.059
1.20080,42067.465
1.33422,42021.883
1.46764,43149.387
1.60106,49579.633
1.73448,67363.984
1.86791,105092.305
2.00133,130133.312
2.13475,103069.156
2.26817,65948.469
2.40159,53247.992
2.53502,47270.652
