0.00000,12818.887
0.13342,13834.323
0.26684,14186.751
0.40027,16276.234
0.53369,20812.002
0.66711,25458.766
0.80053,24810.529
0.93395,21137.572
1.06737,19787.490
1.20080,19315.109
1.33422,18980.375
1.46764,17814.123
1.60106,15727.433
1.73448,15200.163
1.86791,13729.180
2.00133,12841.224
2.13475,12431.881
2.26817,11822.997
2.40159,12951.184
