0.00000,15129.022
0.13342,15299.520
0.26684,15374.277
0.40027,14997.959
0.53369,15531.482
0.66711,15323.962
0.80053,15620.513
0.93395,15773.698
1.06737,15646.684
1.20080,15143.192
1.33422,16680.723
1.46764,15816.617
1.60106,15847.620
1.73448,15455.481
1.86791,15666.326
2.00133,15789.028
2.13475,15934.328
2.26817,16303.668
2.40159,17667.381
2.53502,20876.504
2.66844,28136.367
2.80186,43051.258
2.93528,47254.316
3.06870,38521.078
3.20212,24684.934
3.33555,19311.656
