x	Y_20180130_15109_14_11g	Y_20180130_15109_14_13g	Y_20180130_15109_14_1g	Y_20180130_15109_16_10g	Y_20180130_15109_16_12g	Y_20180130_15109_16_13g	Y_20180130_15109_16_2g	Y_20180130_15109_16_6g	Y_20180130_15109_17_11g	Y_20180130_15109_17_14g	Y_20180130_15109_17_15g	Y_20180130_15109_17_1g	Y_20180130_15109_17_21g	Y_20180130_15109_17_6g	Y_20180130_15109_17_9g
0	11541.3	13567.994	12125.979	11374.041	12164.066	11701.054	10752.493	12779.136	11814.17	13076.41	12231.611	14124.555	10838.36	10865.218	10651.925
0.1334	12092.12	13554.686	12154.438	12051.506	13151.111	12457.15	11928.934	13918.349	12129.583	12657.771	13404.864	13987.838	10872.643	12347.346	10724.782
0.2668	14110.982	14839.803	13411.634	13612.768	14177.038	14062.483	13236.353	15143.777	12893.069	12516.352	14306.214	15091.572	11495.66	12546.536	11424.923
0.4003	17514.926	16710.492	15548.414	15804.716	15757.57	15183.506	15148.743	18187.146	14170.726	13423.573	16571.07	16074.971	12922.997	14563.042	11981.107
0.5337	21301.076	19131.025	15974.537	18772.477	18265.307	17196.25	16743.807	20237.422	16806.484	14502.513	19729.055	18894.125	13868.54	15114.614	12802.105
0.6671	21191.996	18996.846	16992.537	20039.658	19250.473	16508.439	16094.907	19886.562	18349.777	17274.525	21483.537	24689.41	15429.42	15232.873	15078.646
0.8005	17542.836	18843.988	17126	18712.205	20193.1	16989.195	15357.898	18733.254	17376.553	20583.191	20623.875	29116.076	15469.156	14286.476	17804.154
0.934	16884.738	18573.67	17419.707	18819.215	19419.408	16944.709	15765.615	17002.949	16230.506	20292.25	20158.297	29539.693	15465.725	15158.021	17923.396
1.0674	15884.296	19650.805	16876.979	19119.535	17974.148	15835.158	15555.313	16823.064	15479.617	18253.764	19493.533	28447.736	15329.22	16204.646	19833.094
1.2008	14358.299	17410.467	16346.795	19364.477	17822.164	15986.558	14386.519	16594.229	14014.311	16790.059	17029.422	25979.207	15903.421	15656.624	19821.512
1.3342	13283.438	15893.812	15002.812	18062.883	16713.834	14833.956	14762.08	15614.345	13181.241	16512.746	17143.922	23821.826	14315.869	15539.708	18397.047
1.4676	13472.709	15037.359	15524.889	17664.01	15872.351	14803	14104.753	15859.651	14352.846	16046.745	17958.35	20879.75	14498.898	14285.647	17077.262
1.6011	13117.161	13417.359	15413.99	17169.26	16079.954	14129.377	14278.905	16127.172	14214.056	16507.631	18564.332	19223.393	14428.971	13295.121	18055.328
1.7345	12695.362	14136.551	15988.617	18016.457	16730.293	14136.512	15544.752	16332.917	14451.314	15555.284	19575.424	19088.801	15287.924	13500.919	18434.699
1.8679	11512.047	14481.864	16488.656	17126.928	17251.578	14286.066	15708.682	18515.375	13272.238	13214.979	18382.488	17140.406	15116.848	13939.131	16540.195
2.0013	12436.386	13913.877	16160.622	17112.895	17937.572	12899.598	15505.623	20548.354	12947.765	12786.252	16853.791	14488.122	16466.9	15120.996	16485.262
2.1348	12312.644	12880.222	16343.819	18916.613	16460.271	12917.625	17161.852	20967.863	12167.413	12999.034	15320.352	13059.37	16561.193	15465.39	16657.547
2.2682	12416.654	12261.83	15529.374	19390.428	14705.09	12194.043	18970.684	19071.859	11933.678	12932.73	13414.771	13336.261	16194.062	13646.974	16017.993
2.4016	11657.096	12720.81	14388.736	19565.785	13987.369	11877.915	16949.359	20211.145	10772.891	13467.624	12654.159	12882.242	15354.284	12676.969	14747.822
2.535	11473.152	12973.683	13800.384	17453.148	12490.673	11966.68	14585.926	21029.314	10924.622	13205.569	12398.073	12879.027	13670.635	12625.082	13747.98
2.6684	11772.436	13007.477	13549.504	15272.906	11636.616	11266.498	13860.224	17351.408	10258.896	12379.579	12891.824	12114.94	13161.356	12130.726	13187.635
2.8019	NaN	13103.054	13055.63	13527.17	11205.208	11085.85	NaN	13933.999	10887.1	12395.396	NaN	12465.079	12304.765	11742.287	12508.249
2.9353	NaN	NaN	13016.882	13213.821	10983.075	11047.338	NaN	13291.934	11149.803	NaN	NaN	11839.396	12180.368	12806.886	12002.524
3.0687	NaN	NaN	NaN	12745.425	11520.952	NaN	NaN	NaN	11299.779	NaN	NaN	NaN	12010.682	NaN	12490.078
3.2021	NaN	NaN	NaN	12657.033	NaN	NaN	NaN	NaN	10343.077	NaN	NaN	NaN	NaN	NaN	12773.578
3.3356	NaN	NaN	NaN	NaN	NaN	NaN	NaN	NaN	NaN	NaN	NaN	NaN	NaN	NaN	NaN
3.469	NaN	NaN	NaN	NaN	NaN	NaN	NaN	NaN	NaN	NaN	NaN	NaN	NaN	NaN	NaN
3.6024	NaN	NaN	NaN	NaN	NaN	NaN	NaN	NaN	NaN	NaN	NaN	NaN	NaN	NaN	NaN
3.7358	NaN	NaN	NaN	NaN	NaN	NaN	NaN	NaN	NaN	NaN	NaN	NaN	NaN	NaN	NaN
3.8692	NaN	NaN	NaN	NaN	NaN	NaN	NaN	NaN	NaN	NaN	NaN	NaN	NaN	NaN	NaN
4.0027	NaN	NaN	NaN	NaN	NaN	NaN	NaN	NaN	NaN	NaN	NaN	NaN	NaN	NaN	NaN
4.1361	NaN	NaN	NaN	NaN	NaN	NaN	NaN	NaN	NaN	NaN	NaN	NaN	NaN	NaN	NaN
4.2695	NaN	NaN	NaN	NaN	NaN	NaN	NaN	NaN	NaN	NaN	NaN	NaN	NaN	NaN	NaN
4.4029	NaN	NaN	NaN	NaN	NaN	NaN	NaN	NaN	NaN	NaN	NaN	NaN	NaN	NaN	NaN
4.5363	NaN	NaN	NaN	NaN	NaN	NaN	NaN	NaN	NaN	NaN	NaN	NaN	NaN	NaN	NaN
4.6698	NaN	NaN	NaN	NaN	NaN	NaN	NaN	NaN	NaN	NaN	NaN	NaN	NaN	NaN	NaN
4.8032	NaN	NaN	NaN	NaN	NaN	NaN	NaN	NaN	NaN	NaN	NaN	NaN	NaN	NaN	NaN
4.9366	NaN	NaN	NaN	NaN	NaN	NaN	NaN	NaN	NaN	NaN	NaN	NaN	NaN	NaN	NaN
5.07	NaN	NaN	NaN	NaN	NaN	NaN	NaN	NaN	NaN	NaN	NaN	NaN	NaN	NaN	NaN
5.2035	NaN	NaN	NaN	NaN	NaN	NaN	NaN	NaN	NaN	NaN	NaN	NaN	NaN	NaN	NaN
