X,Y
0.00000,16163.916
0.13342,16043.943
0.26684,16053.410
0.40027,16509.396
0.53369,16769.678
0.66711,19310.545
0.80053,23243.898
0.93395,32517.602
1.06737,44557.773
1.20080,42033.512
1.33422,27752.492
