x	Y_20180130_15109_10_10g_left	Y_20180130_15109_10_4g_left	Y_20180130_15109_12_8g	Y_20180130_15109_13_1g	Y_20180130_15109_15_15g	Y_20180130_15109_15_4g_left	Y_20180130_15109_16_1g_left	Y_20180130_15109_17_12g_left	Y_20180130_15109_21_10g	Y_20180130_15109_21_11g	Y_20180130_15109_22_14g	Y_20180130_15109_23_3g	Y_20180130_15109_24_2g	Y_20180130_15109_25_11g	Y_20180130_15109_25_1g	Y_20180130_15109_28_5g	Y_20180130_15109_29_1g	Y_20180130_15109_34_5g	Y_20180130_15109_35_3g	Y_20180130_15109_36_10g	Y_20180130_15109_36_7g	Y_20180130_15109_7_6g_left	Y_20180130_15109_42_10g	Y_20180130_15109_43_5g	Y_20180130_15109_1_2g_right	Y_20180130_15109_3_18g	Y_20180130_15109_5_11g	Y_20180130_15109_5_12g	Y_20180130_15109_5_15g	Y_20180130_15109_5_8g	Y_20180130_15109_6_11g	Y_20180130_15109_6_16g	Y_20180130_15109_6_2g_right	Y_20180130_15109_7_6g_right	Y_20180130_15109_14_4g_right	Y_20180130_15109_15_2g_right	Y_20180130_15109_16_3g_right
0	12178.447	14001.826	11252.858	10632.522	11637.535	11692.609	10589.338	9979.865	13048.138	11587.783	12329.133	13652.592	12478.438	10106.972	12481.462	12348.045	11789.442	10502.243	12665.51	10428.803	13219.929	11480.717	11698.317	12382.876	11228.579	13552.247	11736.607	12681.738	10718.707	10185.023	11738.807	14440	11991.277	13152.8	10761.01	13673.386	11812.108
0.1334	15077.451	14532.496	13131.575	11629.691	12804.845	12097.56	11057.068	11024.97	14681.043	11607.165	12960.117	13579.206	12925.943	10473.315	12730.61	12446.466	11845.455	11114.052	13706.174	10083.913	13968.688	12227.187	12533.84	12559.526	12670.24	13733.008	13274.597	14184.271	12531.167	10703.581	12964.855	14555.594	13378.298	12239.167	11383.427	14307.892	11785.321
0.2668	18868.262	15126.679	15839.571	12215.244	15274.07	13298.806	12192.044	11342.675	16398.836	13339.032	13260.714	14322.824	13065.097	10804.586	13527.793	13706.276	13544.458	12009.907	14827.462	10606.212	15593.136	13520.57	14346.629	13440.949	14087.743	14677.962	16506.088	16837.268	15091.675	12110.672	15219.626	15347.843	13737.487	14528.172	13010.417	17177.234	13398.122
0.4003	22242.512	17479.732	20071.555	13682.604	21901.648	15482.106	13906.334	13300.797	18488.041	16307.235	15473.908	16240.196	15322.618	12332.746	15202.529	15056.878	17043.799	14691.706	19020.707	12217.158	18332.963	16682.717	17027.801	16401.596	17712.572	16358.036	21687.316	23294.553	18707.248	15034.568	18126.365	18075.152	16674.307	16635.641	13150.159	21276.252	15131.088
0.5337	21348.225	20159.512	20594.738	16262.247	27454.227	18889.516	16142.448	18113.873	19290.396	18562.832	17445.484	17123.6	18673.25	14511.834	18617.283	14637.836	21244.02	15460.591	23579.863	15633.07	22055.064	21220.664	18682.746	20529.793	19722.688	18741.533	22324.699	26703.652	27219.639	17382.871	18604.836	22378.854	19397.15	22568.045	14663.312	25793.377	16926.475
0.6671	19638.658	23961.012	18123.338	19765.74	27594.189	20418.504	17264.652	24231.059	17592.455	18471.127	19881.582	16503.613	20913.947	19408.084	19398.033	14482.562	22855.406	15719.195	26392.135	19551.43	25632.471	22508.736	18877.047	23283.373	18744.383	20205.732	21479.047	27239.535	35140.109	19632.344	17265.395	24254.262	20882.527	22396.816	16747.873	26542.662	16975.57
0.8005	17733.844	26914.082	17628.373	24901.582	22665.535	20376.164	17006.697	23592.197	16156.27	17270.113	21567.436	16387.209	21235.014	21326.768	20629.893	14396.456	21970.984	15729.652	26322.459	22741.871	26451.227	20472.133	16984.344	22949.486	19762.814	19860.26	21408.812	24680.322	35810.953	19723.947	16795.268	21766.332	19841.629	18036.102	17804.422	23116.779	16787.453
0.934	17278.43	28437.865	17363.193	27248.156	19246.801	19721.396	16252.132	21695.975	15478.162	16397.283	19919.078	15674.024	19650.594	21069.35	21796.973	14787.431	19341.9	16605.389	25091.621	20917.432	24380.295	20599.277	16056.91	20624.1	18880.547	19841.479	20233.598	24107.492	33815.746	18701.271	17526.688	20969.918	17897.93	16676.15	16451.764	21186.461	16811.918
1.0674	17752.307	27497.559	17203.207	25763.854	18476.346	20085.393	17036.371	20203.039	16445.676	15890.746	19462.4	15416.318	17517.805	19912.236	21466.543	13807.156	17905.174	15575.232	23199.324	19693.766	24970.453	20542.197	16860.043	19077.695	19183.055	20068.195	19508.262	23015.789	31213.027	18781.598	16295.613	20762.047	16214.777	15956.804	15977.661	19865.797	17351.561
1.2008	16591.693	22168.396	17178.18	23565.078	19357.379	19154.385	17050.617	19637.336	15931.912	15107.802	19900.963	16001.685	15385.593	18870.312	21258.396	13276.001	16624.186	15026.009	22339.408	18063.734	24959.396	22238.184	17912.592	19002.02	19397.502	20561.863	19394.814	21457.197	27893.727	19059.805	15355.263	19636.84	15783.105	15603.882	15316.146	19231.758	16808.854
1.3342	16076.387	18961.361	17832.594	21377.832	20004.273	18785.609	16693.076	18452.258	15779.343	14063.392	17951.291	16519.244	14531.633	17075	22174.744	13095.916	16356.954	14229.264	22401.215	18727.34	24008.898	21417.219	18428.439	18792.178	18532.641	19262.561	17942.482	21725.91	25124.363	19431.838	15170.058	18131.449	15731.589	14717.309	14901.527	18145.504	15465.917
1.4676	16166.206	18944.309	18404.949	20666.533	20515.955	19775.576	16207.667	17079.016	16305.046	14971.13	18337.439	17298.859	15651.821	16317.271	21635.436	12317.579	14536.741	14634.033	21738.416	17504.883	21969.715	21052.732	17339.051	20097.02	18215.303	18420.568	18146.746	21800.881	21132.588	18319.227	14073.37	19126.641	17456.07	14303.398	15677.099	17732.234	14980.507
1.6011	15048.826	18759.521	17824.027	20042.471	19852.984	20636.758	15048.204	16890.49	15142.328	15985.535	18423.426	17078.232	15654.265	17295.74	22427.822	12913.514	13955.849	15055.763	22043.471	17507.922	20639.93	18807.631	15429.171	19098.359	19071.73	18834.65	18980.773	21111.4	18471.648	17725.785	13633.86	22875.777	16378.239	13893.353	15936.615	16011.754	15703.998
1.7345	14773.997	18074.48	16180.874	18576.479	19252.617	21214.684	14825.86	16483.891	15217.712	16215.494	17837.303	16930.842	15850.209	16342.631	22108.518	13547.927	14217.676	15180.536	21308.027	17821.885	21069.449	17598.111	15826.919	18369.926	19849.529	19330.07	18274.391	20443.297	17554.738	14887.883	13845.184	20436.99	17770.865	14830.961	16437.33	15031.179	14588.272
1.8679	14414.447	18956.91	16261.977	18397.93	17430.734	21379.434	15887.664	16067.817	16281.702	16084.897	18408.967	17188.545	15725.304	15241.533	22218.004	15381.888	15016.288	14139.906	18781.195	17656.582	20444.975	16386.078	16473.484	18129.41	20329.955	20763.74	17748.732	20595.773	14407.698	14020.902	13741.791	19082.691	18594.354	14532.509	15093.585	14549.713	14959.852
2.0013	14276.764	20153.107	16874.195	18995.127	15357.558	20270.184	16278.222	15983.015	14465.812	16744.445	17978.301	17602.193	15334.979	15129.391	20466.891	15658.29	16043.374	13633.057	17114.975	17904.328	21517.227	15356.939	16274.327	17138.512	17174.576	21957.037	17677.666	21191.66	14263.647	14413.513	14849.926	17933.246	18294.207	14959.838	13648.068	15039.954	14254.248
2.1348	13479.596	19903.072	17313.641	17593.328	13429.863	18863.381	15621.405	16751.25	14079.409	15845.781	18941.172	16286.646	15921.728	14976.104	21349.98	14040.345	17158.232	12831.765	16671.166	17747.609	21616.523	15720.891	16393.844	16846.588	16784.639	19883.137	16010.395	23190.779	14473.895	13467.497	14774.56	17036.516	16721.613	15492.56	12748.092	15416.573	14479.454
2.2682	14074.111	19438.072	17623.912	15707.259	12842.545	18583.057	15471.077	17458.238	12267.791	15509.618	18854.885	15804.839	16025.89	15766.355	19639.729	13455.263	19032.846	13263.152	16178.849	16700.881	24644.711	17461.104	15347.547	16310.724	15043.123	17630.738	16195.749	24661.725	14729.749	13742.927	14958.157	17173.875	17133.16	17055.246	13040.858	16050.553	16090.897
2.4016	13849.505	20489.041	16778.053	14390.784	12646.43	17918.902	15822.012	19415.961	11880.384	15113.266	19566.143	15413.174	17132.238	15571.501	18585.664	13895.753	19359.283	13922.848	15113.639	16165.928	25176.074	16569.096	16458.338	15954.334	15032.794	16288.987	15805.277	21975.441	15089.205	13637.652	15302.218	15684.626	17488.273	17160.145	13992.537	17646.055	15385.892
2.535	13545.357	19681.031	17197.119	14660.754	13593.741	16198.128	15894.981	19491.707	12188.825	16094.895	19756.023	14375.299	15759.743	16560.387	17839.516	13333.188	17495.688	13829.155	15363.827	15207.359	23128.426	15671.162	17371.793	16311.497	13996.876	16143.181	15312.086	19206.615	15458.659	14058.575	14737.674	15757.166	18883.311	15459.547	14315.826	18224.686	15589.786
2.6684	13690.097	20818.082	16423.375	14949.372	13192.364	15701.979	16319.978	19043.428	12008.742	14251.544	20134.705	14207.175	16007.67	17422.936	17103.137	13099.97	16782.297	14343.088	14832.817	15209.282	21061.443	15010.624	17877.4	16144.109	14271.938	17014.48	14037.362	18301.389	15161.138	12918.946	14163.658	17402.08	17829.504	14135.881	13748.819	18631.949	15700.675
2.8019	14248.585	17541.188	15138.565	15034.361	13563.546	14535.634	17137.096	16722.975	11380.803	13679.267	18887.348	14907.38	16532.756	16244.884	16634.359	12914.932	15680.668	15714.438	15229.604	15783.542	20060.965	14061.947	16493.104	16097.427	13627.973	15765.98	13205.004	17077.633	14236.432	13006.155	13372.633	19545.477	17344.689	12819.906	13574.796	17786.756	15097.251
2.9353	13642.229	16111.048	14173.302	15426.863	14909.348	14460.126	16645.768	15127.374	11637.946	14074.387	17397.771	13342.007	15903.284	14541.453	17394.57	12846.425	16158.45	16587.793	15029.519	16510.674	19567.955	13177.174	15730.841	14654.227	12930.933	14286.34	12906.995	14382.57	13540.71	12970.013	13157.043	20812.148	14973.253	12440.434	13898.527	16360.413	14097.547
3.0687	13271.779	15745.999	12705.992	15249.768	14654.486	13469.902	14780.749	14234.163	11396.926	12771.43	14757.679	12728.021	16273.888	13407.965	16987.867	12003.249	15510.397	16558.988	14763.236	16358.011	20615.572	12799.257	15254.798	13930.017	12943.878	13221.054	13177.898	13260.784	13363.808	12627.976	13378.009	18889.883	14194.389	12186.638	13145.86	14705.938	13450.047
3.2021	13497.978	15678.462	12052.896	14210.142	14603.166	12909.307	14152.635	13439.749	11830.102	12868.179	14191	13346.818	16009.212	12749.07	16716.449	12198.773	13625.151	16586.961	13843.361	14892.297	19233.197	12253.346	14827.224	12962.909	12618.281	13198.777	14074.612	12742.059	13230.835	11713.113	13883.241	15115.024	14646.222	12667.902	12758.307	13004.465	12189.099
3.3356	12498.28	13993.299	11499.724	12831.946	13996.493	12386.161	13458.637	12476.553	NaN	12076.159	14281.522	12540.52	14740.646	12323.176	15094.211	12120.368	13184.41	15043.757	13041.257	14050.988	18141.566	12509.374	13501.155	12544.541	12688.175	13814.686	13157.735	12105.845	12668.991	11684.368	13752.345	14288.442	13118.575	12702.509	12330.574	12708.232	12051.825
3.469	12104.589	13382.454	11421.128	12792.735	14267.212	11364.253	12168.187	12489.79	NaN	12615.433	13919.274	12558.079	13615.002	12477.961	14584.096	NaN	13194.386	14347.259	12806.924	13011.046	15391.335	13077.57	13709.336	12733.651	12681.941	13388.482	12545.07	11647.435	12273.675	11868.321	NaN	13634.714	NaN	NaN	11933.669	12688.775	11403.108
3.6024	12386.593	12876.42	11521.761	12768.445	13876.989	12030.734	12039.034	13655.773	NaN	NaN	14023.409	NaN	12702.02	11494.685	12692.122	NaN	13085.406	14125.404	13468.144	12486.784	14160.072	12827.98	12641.881	12993.44	NaN	12729.614	NaN	12077.986	11832.926	NaN	NaN	13609.274	NaN	NaN	11963.709	NaN	11415.456
3.7358	12705.844	13279.744	11400.847	12525.04	NaN	12527.885	12495.366	12124.132	NaN	NaN	14004.411	NaN	12258.596	11795.833	12573.448	NaN	NaN	NaN	12638.269	12800.807	13478.571	12359.509	13119.994	NaN	NaN	12946.129	NaN	12490.604	NaN	NaN	NaN	13706.348	NaN	NaN	12130.498	NaN	NaN
3.8692	NaN	12327.755	NaN	12195.573	NaN	12886.135	NaN	12507.741	NaN	NaN	13959.006	NaN	13428.198	12550.553	13289.862	NaN	NaN	NaN	12875.461	12286.631	13977.899	NaN	12606.819	NaN	NaN	NaN	NaN	NaN	NaN	NaN	NaN	NaN	NaN	NaN	12359.258	NaN	NaN
4.0027	NaN	11955.252	NaN	NaN	NaN	12643.681	NaN	NaN	NaN	NaN	13405.611	NaN	NaN	NaN	12979.165	NaN	NaN	NaN	NaN	NaN	12940.773	NaN	NaN	NaN	NaN	NaN	NaN	NaN	NaN	NaN	NaN	NaN	NaN	NaN	NaN	NaN	NaN
4.1361	NaN	NaN	NaN	NaN	NaN	NaN	NaN	NaN	NaN	NaN	13734.224	NaN	NaN	NaN	12868.56	NaN	NaN	NaN	NaN	NaN	NaN	NaN	NaN	NaN	NaN	NaN	NaN	NaN	NaN	NaN	NaN	NaN	NaN	NaN	NaN	NaN	NaN
4.2695	NaN	NaN	NaN	NaN	NaN	NaN	NaN	NaN	NaN	NaN	NaN	NaN	NaN	NaN	NaN	NaN	NaN	NaN	NaN	NaN	NaN	NaN	NaN	NaN	NaN	NaN	NaN	NaN	NaN	NaN	NaN	NaN	NaN	NaN	NaN	NaN	NaN
4.4029	NaN	NaN	NaN	NaN	NaN	NaN	NaN	NaN	NaN	NaN	NaN	NaN	NaN	NaN	NaN	NaN	NaN	NaN	NaN	NaN	NaN	NaN	NaN	NaN	NaN	NaN	NaN	NaN	NaN	NaN	NaN	NaN	NaN	NaN	NaN	NaN	NaN
4.5363	NaN	NaN	NaN	NaN	NaN	NaN	NaN	NaN	NaN	NaN	NaN	NaN	NaN	NaN	NaN	NaN	NaN	NaN	NaN	NaN	NaN	NaN	NaN	NaN	NaN	NaN	NaN	NaN	NaN	NaN	NaN	NaN	NaN	NaN	NaN	NaN	NaN
4.6698	NaN	NaN	NaN	NaN	NaN	NaN	NaN	NaN	NaN	NaN	NaN	NaN	NaN	NaN	NaN	NaN	NaN	NaN	NaN	NaN	NaN	NaN	NaN	NaN	NaN	NaN	NaN	NaN	NaN	NaN	NaN	NaN	NaN	NaN	NaN	NaN	NaN
4.8032	NaN	NaN	NaN	NaN	NaN	NaN	NaN	NaN	NaN	NaN	NaN	NaN	NaN	NaN	NaN	NaN	NaN	NaN	NaN	NaN	NaN	NaN	NaN	NaN	NaN	NaN	NaN	NaN	NaN	NaN	NaN	NaN	NaN	NaN	NaN	NaN	NaN
4.9366	NaN	NaN	NaN	NaN	NaN	NaN	NaN	NaN	NaN	NaN	NaN	NaN	NaN	NaN	NaN	NaN	NaN	NaN	NaN	NaN	NaN	NaN	NaN	NaN	NaN	NaN	NaN	NaN	NaN	NaN	NaN	NaN	NaN	NaN	NaN	NaN	NaN
5.07	NaN	NaN	NaN	NaN	NaN	NaN	NaN	NaN	NaN	NaN	NaN	NaN	NaN	NaN	NaN	NaN	NaN	NaN	NaN	NaN	NaN	NaN	NaN	NaN	NaN	NaN	NaN	NaN	NaN	NaN	NaN	NaN	NaN	NaN	NaN	NaN	NaN
5.2035	NaN	NaN	NaN	NaN	NaN	NaN	NaN	NaN	NaN	NaN	NaN	NaN	NaN	NaN	NaN	NaN	NaN	NaN	NaN	NaN	NaN	NaN	NaN	NaN	NaN	NaN	NaN	NaN	NaN	NaN	NaN	NaN	NaN	NaN	NaN	NaN	NaN
5.3369	NaN	NaN	NaN	NaN	NaN	NaN	NaN	NaN	NaN	NaN	NaN	NaN	NaN	NaN	NaN	NaN	NaN	NaN	NaN	NaN	NaN	NaN	NaN	NaN	NaN	NaN	NaN	NaN	NaN	NaN	NaN	NaN	NaN	NaN	NaN	NaN	NaN
5.4703	NaN	NaN	NaN	NaN	NaN	NaN	NaN	NaN	NaN	NaN	NaN	NaN	NaN	NaN	NaN	NaN	NaN	NaN	NaN	NaN	NaN	NaN	NaN	NaN	NaN	NaN	NaN	NaN	NaN	NaN	NaN	NaN	NaN	NaN	NaN	NaN	NaN
5.6037	NaN	NaN	NaN	NaN	NaN	NaN	NaN	NaN	NaN	NaN	NaN	NaN	NaN	NaN	NaN	NaN	NaN	NaN	NaN	NaN	NaN	NaN	NaN	NaN	NaN	NaN	NaN	NaN	NaN	NaN	NaN	NaN	NaN	NaN	NaN	NaN	NaN
5.7371	NaN	NaN	NaN	NaN	NaN	NaN	NaN	NaN	NaN	NaN	NaN	NaN	NaN	NaN	NaN	NaN	NaN	NaN	NaN	NaN	NaN	NaN	NaN	NaN	NaN	NaN	NaN	NaN	NaN	NaN	NaN	NaN	NaN	NaN	NaN	NaN	NaN
