X,Y
0.00000,15138.610
0.13342,15133.627
0.26684,18295.559
0.40027,20346.062
0.53369,19853.006
0.66711,18910.523
0.80053,15916.771
0.93395,14353.086
1.06737,14477.961
1.20080,15043.538
1.33422,16382.716
1.46764,17240.609
1.60106,18323.434
1.73448,21634.111
1.86791,21339.412
2.00133,19487.416
2.13475,17249.367
2.26817,16060.225
2.40159,14633.580
2.53502,13067.192
2.66844,13425.006
2.80186,12965.315
2.93528,12607.587
