X,Y
0.00000,11160.550
0.13342,11995.914
0.26684,14202.448
0.40027,16477.463
0.53369,19069.428
0.66711,17899.393
0.80053,17371.986
0.93395,16436.242
1.06737,15570.937
1.20080,14920.211
1.33422,12643.256
1.46764,11440.133
1.60106,10895.868
1.73448,10668.544
1.86791,10360.822
