0.0000	16137.9209
0.1334	15442.0908
0.2668	15357.3369
0.4003	16020.2393
0.5337	19576.0137
0.6671	24531.0156
0.8005	25667.3359
0.9340	22231.6406
1.0674	19343.1758
1.2008	19047.8320
1.3342	15571.8271
1.4676	14914.2266
1.6011	15131.9033
1.7345	14283.6709
