0.00000,39411.742
0.13342,40438.332
0.26684,39663.957
0.40027,39118.914
0.53369,38725.391
0.66711,38687.176
0.80053,40875.520
0.93395,40512.582
1.06737,42105.215
1.20080,40092.418
1.33422,40012.531
1.46764,43919.031
1.60106,49282.152
1.73448,63682.797
1.86791,92153.555
2.00133,118957.539
2.13475,100263.898
2.26817,63324.504
2.40159,48971.348
