0.00000,12936.641
0.13342,13416.290
0.26684,14772.430
0.40027,17611.367
0.53369,19453.207
0.66711,19244.883
0.80053,19493.795
0.93395,19324.242
1.06737,19767.922
1.20080,20627.996
1.33422,21765.645
1.46764,22206.309
1.60106,21970.221
1.73448,21951.361
1.86791,22964.238
2.00133,21228.277
2.13475,21084.021
2.26817,21152.109
2.40159,21420.428
2.53502,21309.559
2.66844,17926.270
2.80186,15729.479
2.93528,14150.236
3.06870,13496.091
3.20212,12828.321
3.33555,12578.612
