X,Y
0.00000,43783.801
0.13342,42377.789
0.26684,41935.500
0.40027,43013.672
0.53369,44519.367
0.66711,44620.844
0.80053,44937.516
0.93395,42272.887
1.06737,43586.688
1.20080,44886.070
1.33422,42732.703
1.46764,42331.852
1.60106,41875.297
1.73448,41536.363
1.86791,41689.750
2.00133,42692.457
2.13475,41707.043
2.26817,40744.559
2.40159,43389.301
2.53502,48657.328
2.66844,54779.254
2.80186,73701.969
2.93528,119112.492
3.06870,137392.469
3.20212,100765.562
3.33555,61398.371
3.46897,49005.992
3.60239,44538.023
3.73581,41050.094
