0.00000,11535.166
0.13342,12265.503
0.26684,12676.932
0.40027,12999.165
0.53369,15295.061
0.66711,16888.102
0.80053,19025.160
0.93395,18076.740
1.06737,17411.945
1.20080,16884.094
1.33422,16268.901
1.46764,15240.894
1.60106,13779.679
1.73448,14022.071
1.86791,13668.187
2.00133,13720.879
2.13475,14407.504
2.26817,14581.909
2.40159,13254.140
2.53502,12780.069
2.66844,12715.312
