0.0000	15428.1289
0.1334	15128.8594
0.2668	18369.6562
0.4003	19343.0664
0.5337	23519.0430
0.6671	27069.1621
0.8005	25233.3516
0.9340	21421.8691
1.0674	18623.5000
1.2008	15991.2383
1.3342	14737.0654
1.4676	14709.0469
1.6011	14542.7236
1.7345	16814.6406
1.8679	19852.1348
2.0013	21790.9688
2.1347	22111.5703
2.2682	18747.4316
2.4016	15655.0967
2.5350	14841.0527
2.6684	13820.2744
2.8019	12647.9756
2.9353	11713.8701
3.0687	11721.4893
