0.0000	33736.2148
0.1334	34048.1133
0.2668	33742.0312
0.4003	33418.3008
0.5337	33575.1758
0.6671	34381.3359
0.8005	35121.1211
0.9340	34244.0000
1.0674	35645.0898
1.2008	35528.2305
1.3342	35519.4023
1.4676	34001.2070
1.6011	35846.2852
1.7345	33890.0195
1.8679	33618.0352
2.0013	31738.5430
2.1347	34230.1289
2.2682	33828.4570
2.4016	34731.9062
2.5350	36518.3477
2.6684	40406.0156
2.8019	45881.6641
2.9353	66615.9766
3.0687	119079.5938
3.2021	163843.8750
3.3355	136438.2812
3.4690	77320.7578
3.6024	51490.2148
3.7358	42301.9883
