0.00000,38454.992
0.13342,37992.723
0.26684,37270.559
0.40027,38571.555
0.53369,37765.410
0.66711,36125.859
0.80053,37998.559
0.93395,39906.098
1.06737,42084.215
1.20080,52875.512
1.33422,79311.547
1.46764,112496.125
1.60106,107820.531
1.73448,77479.508
1.86791,51600.723
