0.0000	33435.9180
0.1334	35161.8086
0.2668	33593.9453
0.4003	33286.0078
0.5337	34192.7969
0.6671	33578.8750
0.8005	31326.9531
0.9340	31917.2051
1.0674	31430.5430
1.2008	31577.4473
1.3342	33768.6172
1.4676	36965.3086
1.6011	41563.5273
1.7345	58666.4492
1.8679	91509.1328
2.0013	104422.7656
2.1347	81736.3750
2.2682	54769.5664
