X,Y
0.00000,13639.165
0.13342,14061.968
0.26684,15995.396
0.40027,19264.078
0.53369,18476.488
0.66711,17081.596
0.80053,16297.079
0.93395,16089.078
1.06737,15169.758
1.20080,15155.503
1.33422,14314.274
1.46764,14865.395
1.60106,14605.208
1.73448,13288.777
1.86791,12692.640
