x	Y_20180514_15338_c2_1_15g	Y_20180514_15338_c2_23_11g	Y_20180514_15338_c2_30_6g
0	10608.04	8750.2051	14189.6025
0.1334	10894.6182	9341.1084	16319.6221
0.2668	14000.8594	10109.2939	21211.0098
0.4003	20223.877	11150.3418	27367.1035
0.5337	33022.3906	13324.5039	28591.4336
0.6671	36952.7031	15703.043	27312.6211
0.8005	32684.8203	16047.79	22977.1758
0.934	27215.9883	15553.3662	20457.3145
1.0674	24302.3965	14631.8564	19496.293
1.2008	21435.125	15092.2734	19695.9863
1.3342	20860.6074	14506.6201	18450.0352
1.4676	20768.041	14749.167	17527.9609
1.6011	20861.6895	14495.8545	16182.4561
1.7345	20179.0918	14616.3887	16318.3154
1.8679	18635.3008	14640.0479	16151.3047
2.0013	18508.0352	14258.0449	16874.3555
2.1347	19672.3691	13920.7451	16857.0039
2.2682	20410.0352	14523.6123	16475.4375
2.4016	21602.2812	14362.0732	17413.3984
2.535	21043.7031	13652.8994	17600.6113
2.6684	21114.6895	13648.8887	17833.1758
2.8019	20456.1543	13868.0127	15922.4756
2.9353	21337.6172	14337.1338	15712.4971
3.0687	23771.7285	14063.8174	16001.0391
3.2021	21959.5996	13673.5439	18255.3164
3.3355	18312.3184	14732.4424	20389.1191
3.469	18310.0156	14819.0498	19466.4258
3.6024	17157.5762	14434.8545	15946.1465
3.7358	16841.7305	13223.8975	14461.998
3.8692	15967.5098	13058.5693	13397.6045
4.0027	16284.1543	12389.5977	12890.6582
4.1361	16550.3379	11743.457	12730.4619
4.2695	15687.8779	12156.583	12703.791
4.4029	16438.2891	12058.1455	NaN
4.5363	NaN	NaN	NaN
4.6698	NaN	NaN	NaN
4.8032	NaN	NaN	NaN
4.9366	NaN	NaN	NaN
5.07	NaN	NaN	NaN
5.2035	NaN	NaN	NaN
5.3369	NaN	NaN	NaN
5.4703	NaN	NaN	NaN
5.6037	NaN	NaN	NaN
5.7371	NaN	NaN	NaN
5.8706	NaN	NaN	NaN
