0.00000,33765.711
0.13342,35550.207
0.26684,35434.848
0.40027,33319.145
0.53369,35735.422
0.66711,35005.875
0.80053,36244.262
0.93395,36459.312
1.06737,37058.855
1.20080,37352.406
1.33422,37906.859
1.46764,38248.051
1.60106,36996.355
1.73448,36898.395
1.86791,36584.035
2.00133,38325.715
2.13475,37590.004
2.26817,38323.723
2.40159,36678.785
2.53502,37418.629
2.66844,37880.930
2.80186,38271.566
2.93528,40668.668
3.06870,43448.543
3.20212,47149.984
3.33555,56665.215
3.46897,82026.859
3.60239,134758.828
3.73581,184406.969
3.86923,179334.844
4.00266,128168.406
4.13608,84991.469
4.26950,58345.051
4.40292,45124.508
