X,Y
0.00000,39976.113
0.13342,39538.105
0.26684,37700.391
0.40027,38556.855
0.53369,37875.617
0.66711,37603.098
0.80053,37026.391
0.93395,37630.781
1.06737,36846.816
1.20080,38143.914
1.33422,40761.219
1.46764,45447.504
1.60106,56709.555
1.73448,82094.594
1.86791,109526.398
2.00133,95318.906
2.13475,61166.367
2.26817,45572.391
2.40159,41325.547
