x	Y_20180514_15100b_16_10g
0	33229.211
0.1334	33789.461
0.2668	33286.184
0.4003	31861.586
0.5337	33148.016
0.6671	33301.445
0.8005	32628.414
0.934	32307.088
1.0674	32467.373
1.2008	32740.066
1.3342	32696.455
1.4676	31504.379
1.6011	32707.363
1.7345	33891.859
1.8679	34220.562
2.0013	33965.883
2.1348	35291.195
2.2682	34819.289
2.4016	34330.203
2.535	33944.32
2.6684	34547.027
2.8019	34194.168
2.9353	34025.672
3.0687	35510.41
3.2021	37014.703
3.3356	42909.07
3.469	58076.664
3.6024	69732.703
3.7358	60976.23
3.8692	46884.434
4.0027	39061.184
4.1361	35315.062
4.2695	35423.793
4.4029	NaN
4.5363	NaN
4.6698	NaN
