X,Y
0.00000,14166.854
0.13342,13862.402
0.26684,14642.128
0.40027,17098.926
0.53369,18710.494
0.66711,17058.531
0.80053,17054.230
0.93395,16105.608
1.06737,16363.376
1.20080,16928.836
1.33422,16757.566
1.46764,19208.354
1.60106,17867.424
1.73448,15845.173
1.86791,14450.555
2.00133,13227.135
2.13475,13546.316
2.26817,13030.593
2.40159,12898.886
2.53502,12978.533
2.66844,12778.033
2.80186,13120.312
