0.0000	13231.4473
0.1334	12916.9766
0.2668	14355.8379
0.4003	17651.8730
0.5337	20377.1914
0.6671	20020.0098
0.8005	20156.4805
0.9340	20658.5059
1.0674	22283.7109
1.2008	23308.5859
1.3342	21498.1309
1.4676	18276.4883
1.6011	15540.7275
1.7345	14753.6357
1.8679	14260.6504
2.0013	13915.0234
