x	Y_20180514_15338_c2_1_6g	Y_20180514_15338_c2_1_7g	Y_20180514_15338_c2_12_3g	Y_20180514_15338_c2_12_4g	Y_20180514_15338_c2_13_5g	Y_20180514_15338_c2_13_6g	Y_20180514_15338_c2_14_3g	Y_20180514_15338_c2_15_1g	Y_20180514_15338_c2_16_6g	Y_20180514_15338_c2_17_1g	Y_20180514_15338_c2_17_2g	Y_20180514_15338_c2_18_2g	Y_20180514_15338_c2_19_2g	Y_20180514_15338_c2_19_4g	Y_20180514_15338_c2_20_4g	Y_20180514_15338_c2_21_2g	Y_20180514_15338_c2_21_3g	Y_20180514_15338_c2_23_11g	Y_20180514_15338_c2_23_1g	Y_20180514_15338_c2_23_4g	Y_20180514_15338_c2_23_5g	Y_20180514_15338_c2_23_7g	Y_20180514_15338_c2_23_8g	Y_20180514_15338_c2_26_1g	Y_20180514_15338_c2_27_2g	Y_20180514_15338_c2_27_3g	Y_20180514_15338_c2_27_5g	Y_20180514_15338_c2_27_7g	Y_20180514_15338_c2_29_1g	Y_20180514_15338_c2_29_2g	Y_20180514_15338_c2_3_1g	Y_20180514_15338_c2_3_3g	Y_20180514_15338_c2_31_1g	Y_20180514_15338_c2_32_1g	Y_20180514_15338_c2_33_3g	Y_20180514_15338_c2_33_5g	Y_20180514_15338_c2_34_6g	Y_20180514_15338_c2_34_8g	Y_20180514_15338_c2_35_1g	Y_20180514_15338_c2_35_6g	Y_20180514_15338_c2_4_3g	Y_20180514_15338_c2_4_4g	Y_20180514_15338_c2_5_3g	Y_20180514_15338_c2_5_4g	Y_20180514_15338_c2_7_1g	Y_20180514_15338_c2_7_2g	Y_20180514_15338_c2_9_6g
0	32110.23	33263.359	33832.949	31156.738	32545.207	30432.139	29498.385	31148.578	30532.131	28533.164	30729.051	30622.082	31935.047	29509.283	29166.346	31791.451	33876.945	31143.578	34971.172	34653.348	32934.594	31718.35	30248.094	29178.484	31862.916	32468.377	34640.816	30483.736	31791.736	31427.74	39731.102	31849.232	30295.15	29272.801	32161.805	34541.875	34115.785	30223.043	35631.738	35488.754	28760.357	31299.793	29523.66	31873.678	33594.055	32877.055	32851.512
0.1334	32914.336	33389.496	33448.621	30911.236	33396.445	30359.518	29083.568	30871.166	33649.398	29506.67	30488.955	30744.689	34533.504	28694.078	30128.957	32024.592	33286.066	28871.953	33499.574	33328.41	32703.482	32391.686	31368.727	31328.453	31680.896	33932.652	33428.863	30566.467	30943.545	31447.127	39914.113	30876.594	31004.492	29392.531	32355.625	33748.285	33499.812	29742.154	34962.121	34539.246	28748.334	33026.535	28805.717	31885.336	32631.844	33632.734	33487.41
0.2668	33525.016	32393.332	33987.312	31092.279	31505.953	31731.326	30054.922	33072.535	32546.412	29275.701	32252.283	30908.742	33709.812	28400.713	28055.504	33010.055	32176.439	29026.092	33270.781	32733.895	31624.068	32534.479	31795.973	30365.24	31202.365	33409.422	34255.516	31250.844	31369.051	30701.357	38027.27	32075.379	31572.029	30041.6	31220.602	33626.371	30873.961	30449.766	35432.074	33385.969	31154.881	32272.633	28318.904	31506.402	32911.516	33594.766	32895.672
0.4003	33187.777	31149.396	33101.195	31685.262	32714.178	32312.215	31421.951	33120.367	32958.844	29072.205	32371.137	31807.406	34066.027	28553.094	27182.361	32520.596	31193.729	30022.604	35121.309	30883.529	31517.742	31518.074	31525.492	29602.582	30808.805	33754.945	33885.738	31761.793	31366.061	30584.348	36934.754	32001.918	31822.629	30280.414	32775.055	34678.02	31218.68	31043.434	35425.836	33457.762	30932.324	33921.613	28265.971	31438.719	32236.879	34087.531	33350.531
0.5337	33163.23	32740.6	34174.945	31367.902	33944.008	32789.02	29093.043	32513.814	33123.609	28678.1	33600.379	32332.365	34479.438	29724.326	27616.092	33335.406	32881.016	29466.123	35057.656	32952.781	31866.971	33410.078	30907.201	28353.713	31701.891	31988.025	32273.775	31938.789	29983.471	29784.152	35648.004	31382.236	31714.836	29538.246	31587.705	34732.871	31201.623	32477.096	35560.035	34026.082	30191.303	32901.395	27884.334	31948.318	34012.125	34865.605	34831.586
0.6671	32513.617	31693.607	32692.594	30838.258	33535.195	32108.174	31964.73	32427.627	33393.953	29766.238	32276.555	31449.59	35162.883	29351.531	27810.053	33535.723	32373.688	29567.287	35703.988	31215.047	33052.602	32953.734	32119.48	29499.545	31935.723	32498.312	33354.82	32156.078	30756.979	29662.457	34746.625	33076.68	32389.459	30081.52	32959.203	33706.566	30986.938	32498.848	36726.117	32994.348	30592.475	34262.055	28937.557	31188.537	33170.418	33366.809	32051.404
0.8005	33448.266	32780.961	33268.746	31951.018	33151.594	33693.684	31446.652	32069.869	33729.711	29655.182	32619.295	31697.596	34075.488	28805.084	29456.35	33359.129	33456.484	30010.377	34434.504	31042.756	34254.129	34194.043	33289.152	30785.83	33579.051	32157.814	32811.172	32353.016	30785.18	29054.93	36420.082	31919.904	32678.455	30775.885	33172.023	36111.352	32824.309	32162.258	37224.047	33742.855	31240.121	33504.137	30451.17	32194.674	32166.672	32233.604	33468.465
0.934	32543.562	32725.023	33865.102	31719.127	34128.855	32660.863	30714.863	32585.738	33256.047	30184.738	32965.855	31242.25	34860.078	27854.02	29045.309	31975.172	32567.195	31550.717	33255.293	32302.465	32957.602	33892.309	33210.473	31885.654	34020.445	31958.404	33417.285	30975.217	31509.498	30302.436	35391.258	30829.102	31542.654	31151.982	31896.02	38592.441	31753.209	31586.684	36166.25	33412.332	30230.666	33101.406	30449.189	32812.824	31983.828	33150.418	34446.543
1.0674	35154.129	33552.418	36134.047	33032.418	36973.586	33263.266	31589.734	31437.066	33921.82	31483.965	31547.42	30442.426	36163.531	28770.053	29719.955	34643.547	33258.516	32046.961	35542.961	32308.822	33355.715	32561.307	32906.809	30840.238	32944.652	33316.652	32703.943	31505.861	33631.93	31137.695	35308.957	30097.678	32366.086	30122.744	33599.277	47385.453	32745.492	31441.369	36781.324	36093.664	32412.359	31891.971	32859.984	32766.006	33922.691	34530.391	32923.902
1.2008	34298.102	32956.016	37184.438	33319.191	41830.828	32819.68	32134.555	33083.57	33012.277	30917.957	32001.279	31914.74	35508.5	27943.652	29994.646	35100.992	32527.166	33471.793	35951.117	32251.254	33230.754	32888.41	31814.848	31619.871	34587.359	33349.555	32606.994	32731.201	33604.406	29358.41	34266.418	31167.123	30666.016	30891.061	34066.633	55006.906	31806.396	31807.715	36293.551	34965.688	32801.715	33589.438	42047.688	34601.645	33865.266	33477	34172.492
1.3342	34435.195	33144.398	41007.766	33757.02	47792.355	32877.094	31556.535	34671.543	33520.375	29867.396	32807.316	31921.986	36650.629	28601.008	32222.629	34252.715	33223.066	32037.371	34187.867	31714.91	33429.59	31792.342	34167.562	29762.465	36385.855	32268.215	31912.223	36813.012	33030.898	30901.322	35423.715	31893.828	31693.432	31814.461	32852.211	48056.016	32286.584	33450.012	35624.199	34418.461	32350.059	34954.305	51455.375	33094.758	34511.586	34086.711	33232.52
1.4676	34216.812	33024.355	43757.816	34485.598	46714.219	31354.859	34613.602	35415.445	32933.758	30820.559	38908.738	31301.617	38681.852	30100.547	36198.352	34537.789	33152.695	31712.26	36044	32449.803	33641.559	32507.129	32506.463	31355.441	36586.371	34246.078	33445.984	41765.684	33992.059	32004.678	35572.961	33902.816	33929.668	31977.814	33216.266	38558.863	32513.76	39245.492	37645.816	35276.344	35718.602	34232.148	54073.93	33488.852	34969.438	34543.059	33314.465
1.6011	35794.066	37091.223	55294.004	35616.27	40145.664	31842.91	40303.789	35213.562	32863.168	30561.447	46468.086	31187.855	40406.387	28260.885	47355.027	35041.414	36816.738	32143.846	35077.766	30885.6	33959.141	32953.047	34506.504	33012.785	35711.93	38589.414	35007.801	49779.316	35796.32	32839.598	35617.961	35354.078	33677.652	31581.744	34700.961	34535.512	31461.479	47080.258	38417.133	35074.156	40930.156	36282.043	44158.199	32960.117	35615.191	34494.391	33933.055
1.7345	38589.992	41495.055	62996.594	35912.066	36845.078	33784.859	49512.484	35510.645	33889.52	32126.291	51833.926	31870.246	39632.125	29329.08	50895.965	34104.734	42036.191	34394.953	35413.797	31761.459	35258.922	34173.098	36523.348	35039.043	38864.82	47106.137	36331.477	45522.379	36379.586	34639.047	37206.547	41765.719	37682.617	31476.406	35646.961	NaN	32792.352	50066.301	38221.121	36087.543	52502.137	37225.18	34828.25	34012.738	35870.133	35879.266	36615.57
1.8679	42716.293	49788.75	55733.039	35851.629	33826.383	33785.445	50126.98	37320.879	33020.02	35252.527	45903.855	31702.5	37547.84	30329.166	43797.578	35165.812	51676.387	37854.82	36049.215	32869.941	38324.746	33877.035	43016	36910.332	48888.473	47294.25	37127.359	37835.34	40179.566	37947.195	41911.172	54104.844	44293.055	31272.17	39439.723	NaN	34805.562	41763.039	38658.09	35873.875	80668.445	36636.941	32107.297	34565.965	35996.113	39059.023	41950.199
2.0013	50577.254	55069.301	41529.344	34000.762	NaN	35125.938	42062.402	38633.777	32425.213	42843.961	38184.426	31742.676	37283.367	33039.863	34629.012	34675.613	58826.035	45378.715	40538.484	35466.469	42501.848	32644.756	58300.699	44615.723	65543.828	40546.828	38490.844	34193.094	51177.098	43415.492	47440.004	65327.746	55968.473	31880.613	51993.316	NaN	39039.297	34471.629	42493.934	37102.426	100602.688	35822.789	31381.908	37663.902	37027.812	46454.199	41206.996
2.1348	51019.797	48238.938	37483.93	34129.055	NaN	40412.363	34873.457	42651.598	32713.506	60886.965	34143.023	31496.719	35812.641	38318.02	31531.592	35308.441	49065.473	53746.105	45837.055	39156.648	59297.484	33889.984	76347.312	60785.488	73813.5	38737.059	43147.613	32101.91	74378.883	45849.027	61538.301	63825.266	61569.977	31726.471	68376.086	NaN	47334.254	31957.203	52748.738	40292.504	85853.234	34995.039	30616.35	46281.598	42164.559	58207.789	38261.285
2.2682	44656.043	39160.652	35934.172	34959.938	NaN	50731.074	33370.844	55261.176	32500.846	66300.07	32811.715	33549.867	36909.707	47647.297	NaN	37729.285	40604.688	53633.402	59940.598	46719.516	76695.398	34833.746	67293.688	72296.039	57193.012	36023.938	51471.902	NaN	91424.984	42049.027	63706.844	46510.957	51723.906	33484.625	73328.211	NaN	55168.406	31486.699	63272.711	51763.809	55920.988	39777.719	NaN	56331.047	51486.719	63800.422	34995.086
2.4016	38989.445	36606.789	35062.715	37049.855	NaN	68638.016	32849.016	65965.703	35437.492	54052.277	36889.074	36317.789	37142.738	48810.035	NaN	44430.52	35890.586	44185.414	63820.699	45734.375	74395.117	41128.191	52183.914	61498.5	44017.398	37432.676	57706.188	NaN	74311.039	36534.707	48522.699	39352.988	39551.707	36754.641	57198.703	NaN	51745.508	32173.15	53945.598	63501.156	41480.883	44426.715	NaN	54327.969	55840.457	54259.207	33686.359
2.535	37399.02	33668.898	33856.246	37461.441	NaN	70915.07	32900.129	59364.195	41947.543	42766.383	NaN	45887.855	38134.18	38220.461	NaN	56433.746	33749.559	36315.957	60506.539	43310.629	55529.281	47805.078	41250.672	44192.82	37574.707	37731.391	55906.055	NaN	50642.121	34340.098	41375.094	38543.82	36190.66	43561.941	43372.688	NaN	41183.387	NaN	42452.414	60630.637	34478.488	53787	NaN	45100.723	47156.152	41136.43	32967.113
2.6684	35156.449	32182.131	34697.98	42490.816	NaN	55181.613	NaN	49682.848	49008.859	35895.113	NaN	53741.082	45304.871	31823.822	NaN	59719.41	34266.902	33044.77	47180.547	37401.805	44947.109	55025.57	35758.305	39221.941	36539.637	NaN	48608.391	NaN	38423.426	35241.488	36597.012	42911.008	34942.977	51324.73	37941.48	NaN	35634.148	NaN	36751.805	47395.27	31644.445	54318.102	NaN	39335.938	40484.883	37936.355	32643.193
2.8019	34532.633	35571.438	NaN	51999.887	NaN	37474.625	NaN	48196.723	50117.789	32483.381	NaN	50790.746	58890.945	30318.348	NaN	50980.59	37624.906	32093.766	39813.648	34228.348	37916.871	46317.863	35083.074	36124.047	35422.16	NaN	51769.266	NaN	33681.246	NaN	36732.789	NaN	34480.809	48200.73	36032.887	NaN	34819.102	NaN	34476.574	41513.477	32140.404	46666.25	NaN	37037.941	35386.766	36150.754	32498.713
2.9353	NaN	34578.391	NaN	66189.242	NaN	33760.578	NaN	54671.969	42511.258	30410.059	NaN	41024.91	58127.355	29654.459	NaN	40891.133	39097.605	32110.336	38403.281	NaN	NaN	36756.738	33486.855	34828.148	NaN	NaN	54907.887	NaN	33243.352	NaN	37865.23	NaN	38288.434	41307.68	35166.469	NaN	35952.738	NaN	35551.707	38269.168	NaN	38934.453	NaN	37207.426	33994.727	34217.805	NaN
3.0687	NaN	NaN	NaN	65907.672	NaN	33377.277	NaN	82621.141	36499.25	30822.736	NaN	35567.473	48259.598	29151.84	NaN	37347.008	NaN	32589.504	36379.805	NaN	NaN	34986.469	NaN	33471.938	NaN	NaN	NaN	NaN	32209.322	NaN	NaN	NaN	NaN	38502.328	35715.848	NaN	34243.289	NaN	36218.305	38757.887	NaN	35320.418	NaN	NaN	NaN	32216.201	NaN
3.2021	NaN	NaN	NaN	53019.43	NaN	29923.562	NaN	NaN	35060.629	30977.088	NaN	34315.617	40723.758	27569.666	NaN	37197.48	NaN	34504.094	35702.664	NaN	NaN	NaN	NaN	NaN	NaN	NaN	NaN	NaN	32708.652	NaN	NaN	NaN	NaN	36998.668	35824.184	NaN	NaN	NaN	34256.941	NaN	NaN	35690.469	NaN	NaN	NaN	31332.752	NaN
3.3356	NaN	NaN	NaN	41123.82	NaN	30343.477	NaN	NaN	33105.309	32592.992	NaN	35099.434	37211.547	NaN	NaN	36863.344	NaN	NaN	36053.754	NaN	NaN	NaN	NaN	NaN	NaN	NaN	NaN	NaN	NaN	NaN	NaN	NaN	NaN	NaN	34704.719	NaN	NaN	NaN	33550.523	NaN	NaN	34994.008	NaN	NaN	NaN	NaN	NaN
3.469	NaN	NaN	NaN	38051.734	NaN	30185.383	NaN	NaN	NaN	32548.369	NaN	NaN	37426.871	NaN	NaN	NaN	NaN	NaN	35296.281	NaN	NaN	NaN	NaN	NaN	NaN	NaN	NaN	NaN	NaN	NaN	NaN	NaN	NaN	NaN	34304.25	NaN	NaN	NaN	NaN	NaN	NaN	35078.977	NaN	NaN	NaN	NaN	NaN
3.6024	NaN	NaN	NaN	36965.793	NaN	30067.025	NaN	NaN	NaN	33644.328	NaN	NaN	36359.293	NaN	NaN	NaN	NaN	NaN	35791.621	NaN	NaN	NaN	NaN	NaN	NaN	NaN	NaN	NaN	NaN	NaN	NaN	NaN	NaN	NaN	32650.584	NaN	NaN	NaN	NaN	NaN	NaN	NaN	NaN	NaN	NaN	NaN	NaN
3.7358	NaN	NaN	NaN	36914.664	NaN	NaN	NaN	NaN	NaN	NaN	NaN	NaN	35333.051	NaN	NaN	NaN	NaN	NaN	34016.805	NaN	NaN	NaN	NaN	NaN	NaN	NaN	NaN	NaN	NaN	NaN	NaN	NaN	NaN	NaN	NaN	NaN	NaN	NaN	NaN	NaN	NaN	NaN	NaN	NaN	NaN	NaN	NaN
3.8692	NaN	NaN	NaN	34453.676	NaN	NaN	NaN	NaN	NaN	NaN	NaN	NaN	NaN	NaN	NaN	NaN	NaN	NaN	34354.102	NaN	NaN	NaN	NaN	NaN	NaN	NaN	NaN	NaN	NaN	NaN	NaN	NaN	NaN	NaN	NaN	NaN	NaN	NaN	NaN	NaN	NaN	NaN	NaN	NaN	NaN	NaN	NaN
4.0027	NaN	NaN	NaN	33967.398	NaN	NaN	NaN	NaN	NaN	NaN	NaN	NaN	NaN	NaN	NaN	NaN	NaN	NaN	NaN	NaN	NaN	NaN	NaN	NaN	NaN	NaN	NaN	NaN	NaN	NaN	NaN	NaN	NaN	NaN	NaN	NaN	NaN	NaN	NaN	NaN	NaN	NaN	NaN	NaN	NaN	NaN	NaN
4.1361	NaN	NaN	NaN	32762.867	NaN	NaN	NaN	NaN	NaN	NaN	NaN	NaN	NaN	NaN	NaN	NaN	NaN	NaN	NaN	NaN	NaN	NaN	NaN	NaN	NaN	NaN	NaN	NaN	NaN	NaN	NaN	NaN	NaN	NaN	NaN	NaN	NaN	NaN	NaN	NaN	NaN	NaN	NaN	NaN	NaN	NaN	NaN
4.2695	NaN	NaN	NaN	NaN	NaN	NaN	NaN	NaN	NaN	NaN	NaN	NaN	NaN	NaN	NaN	NaN	NaN	NaN	NaN	NaN	NaN	NaN	NaN	NaN	NaN	NaN	NaN	NaN	NaN	NaN	NaN	NaN	NaN	NaN	NaN	NaN	NaN	NaN	NaN	NaN	NaN	NaN	NaN	NaN	NaN	NaN	NaN
4.4029	NaN	NaN	NaN	NaN	NaN	NaN	NaN	NaN	NaN	NaN	NaN	NaN	NaN	NaN	NaN	NaN	NaN	NaN	NaN	NaN	NaN	NaN	NaN	NaN	NaN	NaN	NaN	NaN	NaN	NaN	NaN	NaN	NaN	NaN	NaN	NaN	NaN	NaN	NaN	NaN	NaN	NaN	NaN	NaN	NaN	NaN	NaN
4.5363	NaN	NaN	NaN	NaN	NaN	NaN	NaN	NaN	NaN	NaN	NaN	NaN	NaN	NaN	NaN	NaN	NaN	NaN	NaN	NaN	NaN	NaN	NaN	NaN	NaN	NaN	NaN	NaN	NaN	NaN	NaN	NaN	NaN	NaN	NaN	NaN	NaN	NaN	NaN	NaN	NaN	NaN	NaN	NaN	NaN	NaN	NaN
4.6698	NaN	NaN	NaN	NaN	NaN	NaN	NaN	NaN	NaN	NaN	NaN	NaN	NaN	NaN	NaN	NaN	NaN	NaN	NaN	NaN	NaN	NaN	NaN	NaN	NaN	NaN	NaN	NaN	NaN	NaN	NaN	NaN	NaN	NaN	NaN	NaN	NaN	NaN	NaN	NaN	NaN	NaN	NaN	NaN	NaN	NaN	NaN
4.8032	NaN	NaN	NaN	NaN	NaN	NaN	NaN	NaN	NaN	NaN	NaN	NaN	NaN	NaN	NaN	NaN	NaN	NaN	NaN	NaN	NaN	NaN	NaN	NaN	NaN	NaN	NaN	NaN	NaN	NaN	NaN	NaN	NaN	NaN	NaN	NaN	NaN	NaN	NaN	NaN	NaN	NaN	NaN	NaN	NaN	NaN	NaN
4.9366	NaN	NaN	NaN	NaN	NaN	NaN	NaN	NaN	NaN	NaN	NaN	NaN	NaN	NaN	NaN	NaN	NaN	NaN	NaN	NaN	NaN	NaN	NaN	NaN	NaN	NaN	NaN	NaN	NaN	NaN	NaN	NaN	NaN	NaN	NaN	NaN	NaN	NaN	NaN	NaN	NaN	NaN	NaN	NaN	NaN	NaN	NaN
5.07	NaN	NaN	NaN	NaN	NaN	NaN	NaN	NaN	NaN	NaN	NaN	NaN	NaN	NaN	NaN	NaN	NaN	NaN	NaN	NaN	NaN	NaN	NaN	NaN	NaN	NaN	NaN	NaN	NaN	NaN	NaN	NaN	NaN	NaN	NaN	NaN	NaN	NaN	NaN	NaN	NaN	NaN	NaN	NaN	NaN	NaN	NaN
5.2035	NaN	NaN	NaN	NaN	NaN	NaN	NaN	NaN	NaN	NaN	NaN	NaN	NaN	NaN	NaN	NaN	NaN	NaN	NaN	NaN	NaN	NaN	NaN	NaN	NaN	NaN	NaN	NaN	NaN	NaN	NaN	NaN	NaN	NaN	NaN	NaN	NaN	NaN	NaN	NaN	NaN	NaN	NaN	NaN	NaN	NaN	NaN
