x	Y_20180514_15338_c1_1_6g	Y_20180514_15338_c1_10_12g	Y_20180514_15338_c1_10_4g	Y_20180514_15338_c1_10_6g	Y_20180514_15338_c1_11_6g	Y_20180514_15338_c1_13_5g	Y_20180514_15338_c1_15_2g	Y_20180514_15338_c1_15_3g	Y_20180514_15338_c1_16_1g	Y_20180514_15338_c1_16_8g	Y_20180514_15338_c1_18_11g	Y_20180514_15338_c1_6_2g	Y_20180514_15338_c1_7_8g	Y_20180514_15338_c1_8_9g	Y_20180514_15338_c1_9_12g	Y_20180514_15338_c1_9_7g
0	35265.6641	27982.1367	30569.7559	34323.1992	31713.8477	33484.8281	32957.7812	34988.3711	31721.2832	32609.9277	33883.3008	33198.5391	29255.623	31791.9004	30027.7656	32114.8516
0.1334	35260.6289	28728.0684	31045.6699	34524.1641	30014.1484	34346.3906	31663.5605	33282.8828	32642.7969	34390.2148	32768.1875	32664.2422	29254.3457	31860.9434	30229.6504	30802.1914
0.2668	34239.6641	29511.5312	30302.2285	32982.5039	31349.6973	34216.2891	34497.0938	34840.3281	32030.7402	35168.1289	33437.2539	31618.666	30524.6367	31762.7734	30403.2148	32014.6172
0.4003	33818.4922	29471.1348	30506.7441	36839.7695	31603.6895	34794.1523	32373.1992	34170.7227	30670.2988	32645.0098	33644.9766	32756.0547	28823.8828	32649.3438	30837.791	31524.9453
0.5337	33214.2695	29506.9551	31758.2461	33880.082	30861.9395	34628.1406	31938.2969	32736.2754	31022.2441	32482.5723	34804.3008	32954.1055	29377.4551	32565.3652	31248.3984	31715.5879
0.6671	32821.9297	29699.2012	32399.6816	34980.8633	30296.8496	35420.7188	31598.9863	33413.0312	31403.8066	33270.3711	32418.8652	32823.0977	27753.3164	32617.4922	30409.0996	33792.3867
0.8005	32733.7617	30528.623	32473.6973	34258.2891	31245.4004	34837.3125	31688.2969	32634.834	32033.0312	34249.6719	33871.4062	33164.4531	29485.3867	31994.1348	29157.5664	33924.832
0.934	33614.9297	29872.2402	32083.2988	33710.9336	29719.0176	33294.5703	32000.5723	32025.2148	31162.9141	32658.541	34248.7656	32623.3965	27524.668	31993.6895	29296.5078	32364.7852
1.0674	32879.4688	31258.6797	32666.3984	33342.2773	31979.7598	34237.9453	31338.6211	31473.918	30770.0078	32665.3125	34246.0156	32033.793	28647.7969	32297.25	30502.0449	33057.0508
1.2008	32381.5137	30533.1309	31989.1152	33562.7148	31858.2891	34212.0156	30752.2715	31618.6445	31089.9336	31709.0508	34589.2266	34728.1016	29214.7852	31461.8672	31140.7324	32394.9492
1.3342	33717.8594	29943.5918	32166.0352	33517.7734	31311.2363	33718.1719	31775.6152	33072.4609	32627.8086	31690.668	33869.4258	36030.9531	28363.7031	33180.3555	29857.8262	31411.6309
1.4676	34642.5781	30419.0527	32042.6738	33083.3711	31193.4551	35366.7188	30860.0254	33712.7578	31669.6914	33246.9453	36766.1055	41066.5586	28654.293	32381.7734	30530.6582	33287.5625
1.6011	35852.0391	31739.207	32163.7578	33956.8555	30692.5977	34307.5625	33641.0078	32667.2402	32221.4336	34948.4609	39671.7305	51657.1523	28088.959	33967.4375	31387.6328	32447.3203
1.7345	38912.168	30514.2305	32737.9414	33513.0664	30993.6074	34132.5938	32767.6348	35115.1836	32584.8418	38096.2188	43066.4688	59281.8477	30332.8008	35750.5664	31208.3379	35145.0234
1.8679	42082.7031	30692.3535	34657.2031	32834.6094	33832.8984	36137.1289	33386.8398	39431.3867	33009.875	38962.1719	58326.4336	54186.5195	31918.7969	41865.5977	30678.207	37364.1914
2.0013	54723.8789	29952.8711	36385.2188	34759.0703	38572.8281	39382.832	38056.6367	44646.4336	35296.7031	46333.8125	86883.3281	42059.5352	36057.7734	52127.0742	31260.9082	44153.6445
2.1347	91389.2188	28789.752	41532.7109	35964.1992	51400.8555	43398.2773	43466.8945	64873.2422	42075.7852	65443.8789	108784.3359	36641.2266	49672.5312	64819.0234	33024.2891	67532.7812
2.2682	126712.6953	29773.3086	58511.543	36932.582	65462.2266	58846.4023	63320.6367	93834.625	63529.0859	105219.8594	84255.9453	NaN	65165.9961	59478.7578	35671.0039	121318.8125
2.4016	119445.3906	29814.0645	91968.1094	47281.0039	64275.7031	91221.7891	92789.625	99259.8359	104460.6328	159373.0312	54961.4609	NaN	62629.2812	43997.9062	43686.2578	156768.2031
2.535	81484.4219	30985.8672	109051.0703	59978.0781	49171.1836	124880.625	97467.3984	73954.2188	116677.7188	160780.5312	41963.7227	NaN	45547.0547	35021.1445	56247.3594	136567.9531
2.6684	53931.7344	30749.0977	85565.0078	91078.6484	NaN	103192.2266	69421.4766	49468.2969	86763.0625	110689.5625	38687.25	NaN	36656.4531	34595.25	60242.0508	83262.0625
2.8019	43512.4102	31932.7402	53426.7461	109385.0703	NaN	67457.1406	48822.6641	39516.8398	56772.7656	71867.7812	NaN	NaN	32404.6172	NaN	51059.1562	54807.3555
2.9353	37956.8203	34687.0898	39770.8281	78982.2812	NaN	49453.9102	40682.8281	NaN	39176.8867	NaN	NaN	NaN	29986.207	NaN	40277.25	44514.6211
3.0687	NaN	41425.0742	NaN	53785.4648	NaN	42066.7305	36370.3945	NaN	34795.4766	NaN	NaN	NaN	NaN	NaN	34860.0195	NaN
3.2021	NaN	57248.2148	NaN	NaN	NaN	NaN	34477.0273	NaN	33751.4609	NaN	NaN	NaN	NaN	NaN	33534.2305	NaN
3.3355	NaN	69122.7578	NaN	NaN	NaN	NaN	NaN	NaN	NaN	NaN	NaN	NaN	NaN	NaN	NaN	NaN
3.469	NaN	63038.2695	NaN	NaN	NaN	NaN	NaN	NaN	NaN	NaN	NaN	NaN	NaN	NaN	NaN	NaN
3.6024	NaN	45255.0078	NaN	NaN	NaN	NaN	NaN	NaN	NaN	NaN	NaN	NaN	NaN	NaN	NaN	NaN
3.7358	NaN	37085.8945	NaN	NaN	NaN	NaN	NaN	NaN	NaN	NaN	NaN	NaN	NaN	NaN	NaN	NaN
3.8692	NaN	33622.6836	NaN	NaN	NaN	NaN	NaN	NaN	NaN	NaN	NaN	NaN	NaN	NaN	NaN	NaN
4.0027	NaN	32134.5488	NaN	NaN	NaN	NaN	NaN	NaN	NaN	NaN	NaN	NaN	NaN	NaN	NaN	NaN
4.1361	NaN	NaN	NaN	NaN	NaN	NaN	NaN	NaN	NaN	NaN	NaN	NaN	NaN	NaN	NaN	NaN
4.2695	NaN	NaN	NaN	NaN	NaN	NaN	NaN	NaN	NaN	NaN	NaN	NaN	NaN	NaN	NaN	NaN
4.4029	NaN	NaN	NaN	NaN	NaN	NaN	NaN	NaN	NaN	NaN	NaN	NaN	NaN	NaN	NaN	NaN
4.5363	NaN	NaN	NaN	NaN	NaN	NaN	NaN	NaN	NaN	NaN	NaN	NaN	NaN	NaN	NaN	NaN
4.6698	NaN	NaN	NaN	NaN	NaN	NaN	NaN	NaN	NaN	NaN	NaN	NaN	NaN	NaN	NaN	NaN
4.8032	NaN	NaN	NaN	NaN	NaN	NaN	NaN	NaN	NaN	NaN	NaN	NaN	NaN	NaN	NaN	NaN
4.9366	NaN	NaN	NaN	NaN	NaN	NaN	NaN	NaN	NaN	NaN	NaN	NaN	NaN	NaN	NaN	NaN
5.07	NaN	NaN	NaN	NaN	NaN	NaN	NaN	NaN	NaN	NaN	NaN	NaN	NaN	NaN	NaN	NaN
5.2035	NaN	NaN	NaN	NaN	NaN	NaN	NaN	NaN	NaN	NaN	NaN	NaN	NaN	NaN	NaN	NaN
5.3369	NaN	NaN	NaN	NaN	NaN	NaN	NaN	NaN	NaN	NaN	NaN	NaN	NaN	NaN	NaN	NaN
5.4703	NaN	NaN	NaN	NaN	NaN	NaN	NaN	NaN	NaN	NaN	NaN	NaN	NaN	NaN	NaN	NaN
5.6037	NaN	NaN	NaN	NaN	NaN	NaN	NaN	NaN	NaN	NaN	NaN	NaN	NaN	NaN	NaN	NaN
5.7371	NaN	NaN	NaN	NaN	NaN	NaN	NaN	NaN	NaN	NaN	NaN	NaN	NaN	NaN	NaN	NaN
5.8706	NaN	NaN	NaN	NaN	NaN	NaN	NaN	NaN	NaN	NaN	NaN	NaN	NaN	NaN	NaN	NaN
