X,Y
0.00000,34562.875
0.13342,34808.832
0.26684,35477.383
0.40027,37622.918
0.53369,39426.180
0.66711,43264.418
0.80053,52883.102
0.93395,69303.641
1.06737,99003.773
1.20080,103956.180
1.33422,74202.992
1.46764,50865.051
1.60106,40398.281
