x	Y_20180130_15109_1_7g	Y_20180130_15109_10_7g	Y_20180130_15109_11_2g	Y_20180130_15109_11_4g	Y_20180130_15109_11_6g	Y_20180130_15109_12_15g	Y_20180130_15109_13_4g	Y_20180130_15109_13_7g	Y_20180130_15109_14_11g	Y_20180130_15109_14_1g	Y_20180130_15109_14_3g	Y_20180130_15109_14_4g	Y_20180130_15109_15_10g	Y_20180130_15109_15_12g	Y_20180130_15109_15_3g	Y_20180130_15109_16_5g	Y_20180130_15109_16_6g	Y_20180130_15109_17_10g	Y_20180130_15109_17_2g	Y_20180130_15109_17_8g	Y_20180130_15109_18_1g	Y_20180130_15109_18_7g	Y_20180130_15109_19_11g	Y_20180130_15109_19_12g	Y_20180130_15109_19_13g	Y_20180130_15109_19_3g	Y_20180130_15109_19_8g	Y_20180130_15109_2_1g	Y_20180130_15109_2_2g	Y_20180130_15109_21_2g	Y_20180130_15109_21_9g	Y_20180130_15109_22_11g	Y_20180130_15109_22_15g	Y_20180130_15109_22_1g	Y_20180130_15109_22_7g	Y_20180130_15109_23_2g	Y_20180130_15109_23_4g	Y_20180130_15109_23_5g	Y_20180130_15109_23_6g	Y_20180130_15109_24_4g	Y_20180130_15109_25_12g	Y_20180130_15109_25_3g	Y_20180130_15109_25_4g	Y_20180130_15109_25_6g	Y_20180130_15109_26_10g	Y_20180130_15109_26_7g	Y_20180130_15109_26_9g	Y_20180130_15109_27_1g	Y_20180130_15109_27_2g	Y_20180130_15109_27_3g	Y_20180130_15109_28_4g	Y_20180130_15109_28_7g	Y_20180130_15109_3_4g	Y_20180130_15109_30_3g	Y_20180130_15109_31_3g	Y_20180130_15109_31_4g	Y_20180130_15109_31_5g	Y_20180130_15109_31_6g	Y_20180130_15109_32_1g	Y_20180130_15109_32_5g	Y_20180130_15109_33_1g	Y_20180130_15109_33_2g	Y_20180130_15109_33_4g	Y_20180130_15109_33_5g	Y_20180130_15109_34_6g	Y_20180130_15109_34_7g	Y_20180130_15109_35_6g	Y_20180130_15109_35_9g	Y_20180130_15109_36_5g	Y_20180130_15109_36_6g	Y_20180130_15109_37_5g	Y_20180130_15109_37_7g	Y_20180130_15109_37_9g	Y_20180130_15109_38_3g	Y_20180130_15109_38_4g	Y_20180130_15109_38_6g	Y_20180130_15109_39_4g	Y_20180130_15109_4_4g	Y_20180130_15109_40_7g	Y_20180130_15109_41_4g	Y_20180130_15109_41_6g	Y_20180130_15109_5_2g	Y_20180130_15109_5_4g	Y_20180130_15109_6_3g	Y_20180130_15109_6_4g	Y_20180130_15109_7_10g	Y_20180130_15109_7_11g	Y_20180130_15109_7_3g	Y_20180130_15109_7_4g	Y_20180130_15109_7_9g	Y_20180130_15109_8_1g	Y_20180130_15109_8_4g	Y_20180130_15109_8_8g	Y_20180130_15109_8_9g	Y_20180130_15109_9_4g	Y_20180130_15109_9_7g
0	14096.976	10719.372	11583.631	12166.149	13835.064	11982.867	13459.095	12286.979	12218.76	12753.948	11188.69	11802.141	13894.138	13183.434	11207.811	12124.462	12210.258	11129.918	12426.751	12316.907	9717.621	12908.636	13157.114	12544.57	12326.911	12374.187	14198.802	11042.527	12774.537	11511.696	12127.296	12447.586	11448.2	13863.861	12913.083	12400.243	12737	13485.111	13548.881	13580.179	11624.918	13527.98	13169.5	14210.421	12344.84	12555.908	11735.911	15536.615	12172.76	15148.066	13096.098	13637.255	10289.229	11902.663	14424.867	12976.912	14346.274	14276.646	13404.228	12980.907	12302.341	12593.5	12947.788	14225.906	12375.102	13665.756	11620.519	11079.194	13266.408	11615.112	12609.81	12474.838	10845.766	13040.144	12761.542	11764.2	13140	10407.913	10430.09	13171.451	10700.18	11313.525	12090.731	12920.498	12585.649	12578.314	13762.152	13267.698	11391.752	14520.786	12890.592	13181.081	12825.649	12826.099	12527.2	14471.528
0.1334	13355.054	11888.179	13126.512	12441.386	15916.25	12171.318	14406.306	12545.316	12598.579	12579.659	11362.39	11676.201	13737.023	13596.517	12054.297	13114.829	13044.152	11512.379	13367.181	13426.727	10369.539	13622.938	13656.539	14810.979	13173.278	12681.15	13942.053	11610.518	13301.392	11952.416	12251.72	12614.963	11779.881	14313.291	12661.432	12666.337	12333.24	14892.778	16189.648	13420.424	12386.59	13981.29	13068.029	17953.525	12901.286	12702.153	12032.446	17017.305	13014.475	16349.343	13589.506	13997.142	10754.084	11807.08	14778.069	14483.855	13539.658	15209.051	14597.757	12794.686	13252.495	13822.747	13211.791	15158.841	13179.159	13519.302	12396.812	11518.785	14154.082	11941.173	13060.78	13719.85	11258.768	12615.911	12742.099	12592.023	13175.966	10344.635	11189.779	13155.551	10779.186	11803.661	12390.375	13321.02	12893.961	12248.358	13687.802	13764.084	12702.39	14538.186	13499.297	14526.148	13041.293	13728.319	13982.081	14605.319
0.2668	14710.788	12786.822	15929.289	13671.818	17058.494	13837.209	16849.805	13596.484	13882.832	13858.752	13055.188	12783.011	14019.56	13887.188	12834.319	14875.413	14510.979	12289.685	13725.353	14981.582	10813.975	13811.29	14846.447	15772.841	14876.383	13474.15	15146.112	12904.898	13705.159	13507.902	12649.587	13253.396	12491.599	14280.055	15196.092	12844.413	15394.258	15339.905	18489.496	13220.118	13388.979	15836.166	14865.185	20654.938	14995.299	13332.459	13615.798	19549.373	15063.427	16821.734	16469.346	15394.149	11575.744	12646.187	17059.396	15932.352	14534.372	15898.881	16726.521	12946.262	13619.428	14948.375	14621.069	15505.728	14780.563	16049.751	13993.09	12257.66	14855.562	12913.858	13880.499	14377.24	13283.104	14978.871	13640.233	13498.774	13774.894	10409.732	11667.081	14134.431	11650.988	12273.521	13157.655	15709.919	14167.163	13065.604	14289.5	15124.852	13198.149	14959.076	13800.97	15766.502	16180.632	15971.952	15997.007	14966.118
0.4003	15837.085	14828.201	20616.08	16292.529	21855.154	16247.433	19496.912	13753.505	16425.938	16015.069	15560.06	14984.55	15192.673	15971.509	13297.451	16664.811	17856.176	13094.977	15547.741	18249.658	10940.577	15045.267	17243.9	18893.486	17104.471	14580.11	17280.57	14250.382	15727.412	15136.066	13841.626	14394.488	14193.03	15237.728	19138.627	14454.151	17813.719	15471.413	20451.881	15766.506	14427.892	18305.82	16644.168	23502.377	18430.018	16006.527	15759.457	22835.559	16751.305	18071.029	18254.432	17932.684	13131.233	13707.075	19897.076	22329.463	18320.434	20385.83	19297.949	14248.718	14170.506	17161.178	17224.727	17380.463	19560.621	18828.156	15013.187	13436.604	18682.627	14556.248	17159.107	17686.729	15147.587	18082.963	15124.267	15763.786	17161.215	12305.896	15097.926	15431.401	13611.898	14270.864	15331.881	17800.156	16236.561	14731.769	16629.627	15665.103	16037.255	18036.035	14102.493	18310.127	19346.895	20180.432	17783.465	18249.838
0.5337	20643.74	18696.627	21822.812	18876.016	27379.551	20973.953	20628.453	15765.089	18964.777	19756.531	17680.725	17514.34	19163.174	19655.236	13508.194	18828.336	20006.779	14863.061	18769.143	19061.035	13201.345	17000.582	20455.17	21459.568	20359.955	17340.072	20416.703	15423.976	17642.48	17136.547	16104.244	15606.881	17586.086	16731.873	20387.543	14920.056	23094.033	18938.693	20003.641	17582.422	14224.926	19151.309	20476.188	22441.545	18242.322	19930.703	19470.906	22006.818	16602.365	21060.195	18772.758	20437.389	16846.393	14970.551	22047.291	25664.35	24049.09	26352.842	24614.035	16988.574	17500.121	18631.795	22244.752	20934.344	25452.268	22307.674	15907.456	16686.814	23315.02	17356.568	21777.113	21446.539	17795.814	20095.973	16801.41	20252.031	21950.637	14455.637	17483.832	17194.26	16787.66	18544.186	21038.748	21444.988	16761.707	15550.456	21060.295	15314.456	18463.924	22085.043	15517.435	22587.297	19400.055	21897.047	24280.779	23844.771
0.6671	25994.736	21037.613	19658.793	20843.992	27211.123	23491.885	20428.039	19195.828	19021.832	25565.242	18897.598	16022.013	21923.59	20977.244	12419.812	17902.441	19569.123	18380.523	21330.047	18347.396	15933.141	18611.053	24134.508	20408.004	21406.994	21561.941	25625.736	18216.625	19667.133	17189.441	17385.18	19021.242	21689.281	17363.939	18963.826	16088.213	21634.932	23974.059	18151.812	17182.574	13855.17	18011.971	28547.916	21829.049	18540.893	20678.559	20781.059	20433.557	16395.096	24823.467	18916.059	22227.85	19215.506	16589.385	22489.277	26900.307	27875.051	33115.109	28338.188	19590.318	20254.471	18370.945	26378.801	21168.691	23913.193	22552.787	16235.385	21168.422	29350.682	20111.949	22289.316	21230.914	18634.262	19364.797	17623.443	25762.24	23747.037	18213.816	22965.066	19728.576	19111.416	23093.025	27543.885	22731.826	17368.766	16906.619	22397.297	15744.839	19198.408	23816.822	18299.152	25937.365	18980.572	23112.234	29686.562	25818.34
0.8005	27587.781	19935.959	17100.994	21643.615	26579.205	22604.027	18840	19957.936	17701.312	26051.406	20523.93	15491.869	22455.277	19835.07	12574.501	17978.725	17328.332	20007.545	21487.838	17212.691	17669.215	17369.43	23823.854	18503.385	21635.951	22789.537	28910.939	18114.908	19677.084	16689.721	16977.027	24399.393	22269.541	18675.82	16905.086	17272.217	23206.348	25930.416	17024.969	16677.898	13807.587	16697.379	31222.201	23047.941	16717.227	19968.254	19314.057	17638.457	18267.092	26415.314	18731.215	23355.947	18643.498	17275.074	21335.143	24467.438	26628.668	35005.152	27736.881	20659.816	22431.035	17520.533	28258.891	20716.104	22523.18	22290.51	17144.643	23297.121	31800.277	21951.488	20908.348	20791.523	18051.365	18270.188	17335.893	27678.617	23438.768	23580.721	22509.059	22485.695	19523.637	27312.234	29067.744	20370.047	16927.402	19060.826	22824.836	14114.583	20632.102	22878.049	21335.842	25495.268	19497.166	22255.109	28801.762	23950.652
0.934	27135.943	17546.152	16733.088	21947.707	22805.104	18353.162	18064.855	19013.623	16693.174	26183.303	18683.891	15596.189	23649.436	19177.252	12293.923	16614.455	17877.137	20609.621	19643.959	15742.527	17694.629	17376.348	22306.066	20319.002	22878.471	22063.402	26024.814	19683.311	18397.174	15710.077	16561.48	24179.482	21771.451	17359.812	15387.766	17207.535	24030.242	25166.754	17220.086	15768.021	14328.812	16665.18	28436.715	23672.646	15030.319	20270.818	19007.408	17337.533	18007.074	24945.463	18398.223	23914.348	17785.844	18311.924	20248.145	21565.303	23821.23	34328.516	23243.648	18989.5	21977.238	16750.398	25890.771	19780.328	20493.258	21559.65	17516.359	22296.715	31674.949	21122.24	18959.625	17853.43	17596.758	15941.711	18096.699	25143.727	24085.422	24978.527	21809.041	23761.645	20376.807	26313.893	27492.635	20565.436	16682.336	19789.205	21781.191	14285.959	20809.99	20201.783	21354.609	22791.291	18252.326	22489.672	23876.416	23415.99
1.0674	24184.934	16337.842	15496.404	21242.791	23787.406	19487.604	17753.033	20009.574	16337.273	25169.512	18530.211	15633.239	24382.584	18161.986	12400.67	15879.638	17291.643	19365.906	17661.482	15330.924	15983.711	17054.852	20973.445	21769.291	23593.066	19668.688	21931.334	19369.484	16971.012	14643.685	17344.652	21264.824	21330.73	17257.438	14126.662	16489.947	23191.209	25134.328	16649.189	15796.475	15567.741	15293.895	27570.898	25808.477	14694.675	20975.262	19826.594	18254.527	16765.043	23118.842	17320.01	22108.521	17968.498	17821.293	20449.652	19834.287	23479.498	32170.252	20470.865	18101.424	20433.875	16052.308	23980.033	19356.832	17989.928	22489.574	17100.488	21505.541	29435.625	19793.895	17594.109	17433.93	17725.295	16052.439	18028.307	20674.312	22305.811	24188.645	20734.229	24067.207	20948.215	22689.469	24228.785	19243.287	16133.585	20632.91	21802.449	14540.93	21185.707	20586.727	20445.533	22369.504	18708.281	22718.713	20753.139	22926.443
1.2008	21189.105	15392.415	15998.003	21235.854	22036.416	18081.006	18197.551	19138.59	16211.73	23100.26	15614.061	16705.225	24736.637	18243.494	12966.335	16177.897	16219.874	19375.451	16535.432	15548.055	15584.979	16631.559	22929.916	19642.779	21171.771	18860.334	21092.559	20705.371	16355.441	15143.751	16339.169	18064.084	19673.432	16922.539	14621.427	15380.153	22110.48	22856.305	15355.095	16782.279	14594.78	14148.125	25168.582	25728.146	14830.261	22247.883	20969.184	17952.654	15822.107	21923.881	15915.496	19017.592	17821.791	18310.906	20025.334	19833.785	22985.424	29087.814	17179.68	16091.81	19772.506	15998.051	23495.92	18609.059	17852.059	21778.387	17375.252	21217.275	25736.137	19530.65	17561.906	16761.152	17308.516	15488.221	16962.732	20180.818	21169.109	24554.855	20692.928	22638.367	20083.318	22077.396	22358.127	20388.615	15855.703	19751.596	19748.908	14599.306	21326.521	20119.527	20198.674	21165.873	18100.578	21315.912	20096.662	22318.285
1.3342	20114.918	15751.26	16185.807	19789.176	20516.979	16249.913	17965.965	18119.258	15810.418	22524.707	15207.872	19801.395	25097.473	17289.545	13206.699	16343.539	16349.221	18237.555	16561.285	15877.925	15622.376	16332.71	23057.41	17130.482	18150.77	19384.574	20330.812	20016.512	15742.936	14670.339	16943.68	17433.072	19347.266	19415.326	13786.701	15896.694	21133.078	22145.381	14367.3	16805.121	14857.913	14281.062	22642.564	22913.35	15457.763	22909.578	20574.92	17281.188	15018.251	21112.523	15346.21	16734.188	16485.766	17821.992	19021.016	19980.07	22138.244	25258.131	15253.774	16026.933	17378.133	14679.507	22967.439	17121.572	17479.723	20381.434	16871.545	20226.395	23841.559	17939.418	18217.814	16826.738	17634.422	15188.013	17026.318	20576.117	20239.854	24152.934	21564.715	20777.473	20056.725	22091.266	20732.682	21807.27	14987.41	17311.447	18090.758	13666.841	19730.037	20698.115	18396.93	18694.178	18214.986	20474.299	19355.822	21597.293
1.4676	18863.008	15995.475	14899.039	19056.057	20574.176	16202.441	15960.819	16998.867	15165.459	22005.133	15564.959	20912.117	23495.586	16450.23	12878.052	16397.787	15848.574	18296.303	16367.141	15544.962	14804.504	15414.489	22900.422	15588.026	16261.327	18803.719	19112.271	20241.031	15887.917	14200.305	19497.812	17062.4	19358.1	21236.344	14553.931	17154.354	19241.131	21733.793	14552.637	18569.43	13781.479	14337.401	20883.873	19940.064	15535.506	23449.457	19185.203	17385.553	14270.395	22525.785	14187.27	16176.003	15663.688	18542.754	17311.162	20379.205	20636.506	25526.803	16017.104	15698.456	16978.193	14983.523	21385.82	17085.5	17134.934	18553.229	15751.685	20433.227	23317.672	16488.152	17823.496	15214.323	19144.676	15448.676	16530.867	21300.609	16637.041	22727.656	21011.678	19491.469	19599.598	21977.629	19714.887	21095.348	15679.281	16014.198	17119.219	14338.381	18902.469	20659.012	16766.162	18882.68	16152.646	20380.408	17061.752	20210.82
1.6011	18262.184	15724.58	14431.98	18236.215	18376.637	17136.605	15563.228	15841.065	14085.609	20824.881	14602.236	20781.406	23850.137	15567.888	12685.965	17032.602	15957.97	18137.945	16588.551	15250.123	14954.507	14851.235	20423.314	14906.458	16035.372	20498.83	18098.934	20043.555	17177.998	14877.814	23823.49	17873.861	19226.631	20817.496	14520.279	17346.715	17934.861	18823.404	15619.772	20289.574	13454.409	14128.818	20511.002	16248.474	15926.297	23040.234	18539.242	16514.729	14367.205	24717.869	14893.574	15984.359	15857.119	18011.398	15636.394	19739.221	19787.365	23573.482	16952.502	15497.284	15925.536	15408.297	20666.045	18249.865	16978.781	17250.922	14689.967	18805.5	21410.24	16910.48	17334.982	15715.721	18966.961	15757.948	15903.568	20158.594	18525.092	21617.516	19270.232	20259.654	17761.527	22072.922	19138.924	18912.289	15539.56	14923.761	15689.574	15557.828	18805.449	19147.791	17146.658	18552.531	16003.517	20339.902	16092.812	18192.943
1.7345	17034.564	15467.352	14211.522	18391.844	14978.246	15500.68	15082.107	15612.715	12571.681	20629.164	14694.558	18841.605	24126.723	16157.958	11896.314	16841.895	16111.071	17504.441	15460.462	15742.286	14303.681	14241.602	21203.74	15203.284	14766.926	18922.66	17040.902	19505.055	17294.164	13879.072	27046.643	19243.158	18343.428	18752.598	14294.736	16292.543	19282.352	17549.848	16958.557	20308.867	13021.956	14867.726	21305.723	13981.649	16844.277	21064.924	18141.961	15597.028	14674.162	24881.445	14476.254	15424.456	15187.647	19680.113	14650.146	20405.746	17422.824	22479.352	17876.926	15171.092	15348.376	14216.593	19546.986	20160.092	17366.039	16930.479	14394.307	18991.9	19032.871	18858.824	17782.941	16032.693	19889.1	16454.029	15801.746	19116.719	17692.631	20228.312	18153.836	21159.916	17991.74	22168.756	17579.924	16255.038	14860.672	13754.691	14669.356	16451.012	19218.086	18619.021	17999.539	19361.844	16425.297	19404.578	17313.373	17486.791
1.8679	15696.432	15095.256	14528.349	17895.25	14194.81	15699.073	14039.053	14149.362	12282.751	21540.662	14095.001	17809.918	20083.498	15767.719	12046.125	15916.037	15787.471	16497.287	15257.534	15065.812	14084.102	14464.107	20689.445	15587.541	14138.998	18014.801	17361.234	19467.76	16418.006	13513.39	26392.445	20635.537	17067.824	15296.463	13121.586	16175.931	20290.928	17874.947	16907.242	21691.047	12361.646	15026.422	22369.713	12719.846	17424.113	20456.111	17460.67	14293.816	12714.944	21164.115	14906.633	15052.146	14347.689	19306.545	14576.454	19194.145	15965.215	19766.166	17017.562	15186.537	15360.445	14486.596	19800.932	18476.844	15283.094	16771.447	14753.224	18647.932	17797.572	19115.658	17805.922	14708.474	19799.588	16192.626	16984.787	18741.863	17442.354	19525.779	18367.738	21396.416	16928.91	21223.559	16453.145	15544.224	14734.548	14547.3	14283.534	15665.823	17656.4	16418.242	18461.119	18751.266	17155.092	18815.119	21062.98	16269.577
2.0013	14571.426	15833.185	12784.128	16584.438	12183.81	14627.604	12462.601	13438.654	11956.843	21543.469	14844.789	15843.948	19353.363	14248.362	12368.703	14905.668	15413.237	16425.162	14820.584	14182.041	13991.828	13579.787	17878.533	16261.816	13485.134	16921.771	16763.287	18659.082	15342.296	12547.787	22027.451	18964.492	16001.551	13473.568	12227.777	17524.238	20232.252	16575.457	15747.502	22845.082	11637.657	14699.513	19819.938	11024.483	14432.934	17329.371	17807.557	13152.852	11663.787	18580.746	14544.799	15132.934	13669.237	18813.24	12897.143	16271.2	16546.834	16626.303	15771.678	15201.33	16212.53	15839.298	18558.949	16561.625	15154.734	15952.054	14471.339	16819.582	18117.936	18221.172	19525.609	13773.987	18586.053	15642.483	15971.335	17814.711	17230.48	18583.766	19728.15	19651.232	16192.763	20124.412	14873.155	14192.268	14240.604	14672.023	13357.822	15245.989	17651.51	15932.49	17658.92	18271.262	17044.688	18561.061	19940.348	15038.188
2.1348	14729.797	15889.466	12541.519	14717.761	11623.9	13254.174	12110.275	13738.562	12069.721	19682.102	14764.889	13578.731	19371.467	14327.298	11692.874	14018.256	13981.994	15568.245	13594.883	14467.261	13479.772	13095.445	15839.847	14240.663	14478.781	15437.468	17478.961	17348.092	15284.913	11613.035	19043.008	17659.199	15493.605	12939.419	11835.082	19301.953	17352.875	15979.946	14717.522	24028.895	11513.347	14440.202	17544.527	10998.576	13786.457	15377.556	16577.566	12225.361	12068.553	15829.157	16454.578	14753.731	13163.812	17383.621	12548.062	13697.448	14749.045	15048.849	14691.909	14413.246	16146.527	14384.602	15982.334	15299.974	14776.361	14199.452	12673.717	15118.337	17654.607	17217.375	19050.418	13456.264	17276.727	16271.259	14562.883	19326.432	15129.776	17073.725	18725.896	18579.143	17035.342	19339.98	14283.43	12862.197	13377.94	14683.168	12929.951	15152.718	17296.146	15332.112	16431.711	17579.223	15827.345	16193.801	18302.621	14648.458
2.2682	14081.89	15333.154	12724.454	13844.185	12038.567	13939.29	12586.54	13335.747	12921.791	17264.752	14019.284	12358.667	19201.99	14483.944	12591.886	13487.533	13862.593	16733.158	13418.352	14602.05	12357.044	12285.834	14135.896	12844.474	12894.167	14360.537	16549.311	17395.805	14589.105	11524.918	16098.841	16228.432	14398.847	13273.965	11459.909	20615.678	14474.521	14985.918	13545.491	19508.645	11095.497	14083.424	17815.965	11221.587	12169.555	13232.554	15300.617	12467.403	11980.232	14630.524	17681.891	14757.056	13113.715	15245.988	12265.25	12978.267	13419.919	13809.806	14503.529	14109.263	14381.65	12898.458	14833.667	14864.067	12863.272	13243.717	12027.153	14150.174	16625.658	16228.03	17429.584	12581.302	15940.602	17022.85	14403.634	19122.887	14362.871	15045.637	18349.195	16928.16	19306.031	16217.84	13626.926	12191.253	12117.499	14242.253	13196.274	14321.483	15649.202	13881.175	15666.305	15396.26	14752.694	13599.229	15595.2	14307.276
2.4016	14694.557	14892.594	12441.129	12711.449	11881.153	13125.289	12712.433	13823.714	11712.771	15558.34	14016.276	11453.615	18032.881	14066.677	12889.176	13495.761	13972.612	15943.337	13396.479	14031.509	12758.104	12524.271	13184.673	12166.905	12708.315	14012.474	16427.248	17422.277	14669.735	11789.491	15095.561	15408.333	13331.415	13326.363	11402.047	18288.822	12682.775	13726.208	12305.285	16501.043	11262.46	13318.122	17768.486	11246.095	12210.851	12093.555	13922.334	12015.507	12401.072	13194.419	16451.92	13931.349	11955.189	14415.044	11888.489	12652.018	13129.59	12645.494	14126.339	13776.211	14083.265	12342.86	13615.438	14090.054	12685.651	13085.023	11626.404	13515.415	14942.065	15597.737	15573.067	12029.982	14126.193	14951.761	13639.194	17245.271	12562.676	13081.869	17276.26	16481.229	20824.908	16088.483	14488.059	12276.743	11312.23	14062.523	12959.173	13825.622	15146.573	13058.281	15487.741	12976.253	14735.252	12678.734	13378.947	12659.629
2.535	14308.008	14315.337	12707.607	12392.406	11906.966	12802.947	12453.47	13394.396	11429.788	13446.581	12661.721	NaN	17344.828	13425.909	12081.139	13645.529	13284.332	15787.804	13121.844	14945.753	12614.662	13101.16	13456.854	11688.56	12939.17	13735.453	16529.809	15818.584	13605.966	11460.519	14019.382	15235.475	13101.467	14716.567	11183.109	15665.47	11508.405	13296.018	11447.03	14482.041	11255.843	12166.23	18017.602	11099.48	12089.185	11830.769	13325.153	12902.627	12027.764	13321.14	15217.634	12827.789	12418.037	13674.164	11064.659	12157.9	12752.679	12467.132	13344.343	13308.547	13470.847	11280.279	12806.408	13162.259	12346.389	12444.031	11700.525	12995.733	14181.208	15259.821	15328.912	11997.683	13371.858	13007.817	13268.888	16506.213	12769.843	12259.479	15535.563	16004.134	21734.898	14442.507	14852.309	12041.951	11195.113	14206.559	12462.169	13356.593	14180.192	12001.603	15382.168	13453.812	14129.584	12585.484	13642.595	11839.866
2.6684	12852.952	13878.471	NaN	12377.455	12154.6	13085.911	11114.312	13114.621	11401.474	13052.546	12161.609	NaN	17074.912	13554.729	11530.441	NaN	NaN	14816.597	12526.249	14425.527	12223.697	12990.811	NaN	12068.134	12999.437	12249.224	15333.187	14271.877	13355.549	11717.661	12775.923	14426.028	12128.805	NaN	11792.848	14101.186	12187.653	12816.544	12024.454	13735.446	11420.747	11639.471	18094.914	11868.696	11481.733	12014.772	13294.709	11617.121	NaN	13514.28	13432.444	13034.251	11654.121	13603.925	11373.298	12246.353	12731.921	12136.524	13678.024	13489.922	11550.702	12175.929	12479.973	12712.308	12126.805	11921.004	11459.173	12478.111	13383.172	16350.688	14125.723	13121.811	12740.197	12755.844	13227.88	14714.732	12412.77	11430.966	13321.257	13974.417	21643.551	13492.787	15039.837	11466.662	11434.007	14567.292	11965.036	NaN	13197.497	12229.684	15302.213	12310.108	13490.37	12932.425	13101.693	11986.726
2.8019	12656.976	13094.89	NaN	11615.735	NaN	13603.672	12035.709	12226.71	NaN	12460.846	12250.017	NaN	16590.443	12202.827	NaN	NaN	NaN	13474.847	12479.54	13493.185	11531.521	NaN	NaN	NaN	12681.749	13699.507	14261.713	12853.801	13327.247	NaN	12556.499	13817.103	11140.242	NaN	11416.419	13535.54	11971.147	12167.399	NaN	13216.205	NaN	11816.123	16243.288	NaN	11555.944	12400.479	13158.021	NaN	NaN	13063.205	12921.178	12679.103	11948.136	13621.711	11381.166	12639.256	12620.892	12021.474	12748.582	13190.786	11356.055	NaN	12851.55	12696.158	11455.55	11605.072	11752.943	12555.717	13096.361	15925.761	13801.979	12923.888	13025.717	NaN	13562.588	13646.861	NaN	11055.496	12212.601	13019.555	18741.602	13932.14	14104.973	11875.886	11494.171	14819.504	11896.114	NaN	12104.777	12262.913	13665.126	11865.631	12948.399	12511.551	13540.614	11912.321
2.9353	12202.842	12797.49	NaN	11351.086	NaN	12805.585	NaN	NaN	NaN	12215.276	13042.617	NaN	16373.692	11355.691	NaN	NaN	NaN	13277.925	11839.829	13489.605	11189.499	NaN	NaN	NaN	12928.33	14255.84	13335.801	12214.002	12894.696	NaN	NaN	13254.918	11120.452	NaN	11610.453	13767.839	NaN	NaN	NaN	13661.303	NaN	NaN	14413.837	NaN	11374.536	12275.478	12365.32	NaN	NaN	13427.021	12485.355	12484.214	NaN	13011.704	11490.312	12456.356	12640.896	11931.421	13161.924	13027.276	11360.95	NaN	13077.458	NaN	10913.328	11088.763	11588.648	12016.147	12590.645	15243.729	13660.095	NaN	13290.826	NaN	13907.554	14442.172	NaN	10873.661	11903.554	13056.163	16606.617	13652.927	12736.747	NaN	10890.4	14125.899	12061.256	NaN	11471.535	NaN	12390.444	NaN	12963.01	12681.204	NaN	NaN
3.0687	12721.602	NaN	NaN	11381.724	NaN	NaN	NaN	NaN	NaN	NaN	13130.485	NaN	17693.643	11869.825	NaN	NaN	NaN	13353.801	11959.976	NaN	11494.92	NaN	NaN	NaN	12915.717	13233.865	13467.112	11834.75	12682.619	NaN	NaN	13191.32	11586.787	NaN	NaN	13818.778	NaN	NaN	NaN	NaN	NaN	NaN	12890.294	NaN	NaN	NaN	11858.777	NaN	NaN	12900.503	NaN	NaN	NaN	NaN	11513.698	NaN	12786.457	12547.163	NaN	13108.652	11538.937	NaN	NaN	NaN	NaN	11857.603	NaN	12072.504	NaN	15010.654	NaN	NaN	12703.844	NaN	13396.11	13545.27	NaN	10604.868	11867.434	13299.057	14484.387	13590.166	13007.188	NaN	10696.153	12565.928	12440.311	NaN	11366.013	NaN	12525.089	NaN	12667.182	NaN	NaN	NaN
3.2021	NaN	NaN	NaN	11967.899	NaN	NaN	NaN	NaN	NaN	NaN	NaN	NaN	16152.935	12594.875	NaN	NaN	NaN	NaN	NaN	NaN	11364.251	NaN	NaN	NaN	12367.992	NaN	NaN	12554.236	12667.868	NaN	NaN	13201.206	11867.141	NaN	NaN	NaN	NaN	NaN	NaN	NaN	NaN	NaN	14762.618	NaN	NaN	NaN	NaN	NaN	NaN	NaN	NaN	NaN	NaN	NaN	NaN	NaN	NaN	13020.938	NaN	12539.886	11703.282	NaN	NaN	NaN	NaN	11493.472	NaN	NaN	NaN	13714.418	NaN	NaN	NaN	NaN	NaN	13174.672	NaN	11766.979	NaN	NaN	13290.146	13783.795	NaN	NaN	NaN	12357.563	11951.613	NaN	11442.541	NaN	NaN	NaN	NaN	NaN	NaN	NaN
3.3356	NaN	NaN	NaN	11108.821	NaN	NaN	NaN	NaN	NaN	NaN	NaN	NaN	14684.178	NaN	NaN	NaN	NaN	NaN	NaN	NaN	11374.509	NaN	NaN	NaN	12304.293	NaN	NaN	13067.684	NaN	NaN	NaN	NaN	NaN	NaN	NaN	NaN	NaN	NaN	NaN	NaN	NaN	NaN	NaN	NaN	NaN	NaN	NaN	NaN	NaN	NaN	NaN	NaN	NaN	NaN	NaN	NaN	NaN	NaN	NaN	NaN	NaN	NaN	NaN	NaN	NaN	11368.854	NaN	NaN	NaN	NaN	NaN	NaN	NaN	NaN	NaN	12991.836	NaN	11573.007	NaN	NaN	12881.468	NaN	NaN	NaN	NaN	12253.948	12048.007	NaN	11104.872	NaN	NaN	NaN	NaN	NaN	NaN	NaN
3.469	NaN	NaN	NaN	NaN	NaN	NaN	NaN	NaN	NaN	NaN	NaN	NaN	13205.401	NaN	NaN	NaN	NaN	NaN	NaN	NaN	NaN	NaN	NaN	NaN	NaN	NaN	NaN	NaN	NaN	NaN	NaN	NaN	NaN	NaN	NaN	NaN	NaN	NaN	NaN	NaN	NaN	NaN	NaN	NaN	NaN	NaN	NaN	NaN	NaN	NaN	NaN	NaN	NaN	NaN	NaN	NaN	NaN	NaN	NaN	NaN	NaN	NaN	NaN	NaN	NaN	NaN	NaN	NaN	NaN	NaN	NaN	NaN	NaN	NaN	NaN	NaN	NaN	NaN	NaN	NaN	13483.101	NaN	NaN	NaN	NaN	12078.771	12180.117	NaN	11135.404	NaN	NaN	NaN	NaN	NaN	NaN	NaN
3.6024	NaN	NaN	NaN	NaN	NaN	NaN	NaN	NaN	NaN	NaN	NaN	NaN	11871.016	NaN	NaN	NaN	NaN	NaN	NaN	NaN	NaN	NaN	NaN	NaN	NaN	NaN	NaN	NaN	NaN	NaN	NaN	NaN	NaN	NaN	NaN	NaN	NaN	NaN	NaN	NaN	NaN	NaN	NaN	NaN	NaN	NaN	NaN	NaN	NaN	NaN	NaN	NaN	NaN	NaN	NaN	NaN	NaN	NaN	NaN	NaN	NaN	NaN	NaN	NaN	NaN	NaN	NaN	NaN	NaN	NaN	NaN	NaN	NaN	NaN	NaN	NaN	NaN	NaN	NaN	NaN	13752.186	NaN	NaN	NaN	NaN	12166.357	NaN	NaN	NaN	NaN	NaN	NaN	NaN	NaN	NaN	NaN
3.7358	NaN	NaN	NaN	NaN	NaN	NaN	NaN	NaN	NaN	NaN	NaN	NaN	12305.855	NaN	NaN	NaN	NaN	NaN	NaN	NaN	NaN	NaN	NaN	NaN	NaN	NaN	NaN	NaN	NaN	NaN	NaN	NaN	NaN	NaN	NaN	NaN	NaN	NaN	NaN	NaN	NaN	NaN	NaN	NaN	NaN	NaN	NaN	NaN	NaN	NaN	NaN	NaN	NaN	NaN	NaN	NaN	NaN	NaN	NaN	NaN	NaN	NaN	NaN	NaN	NaN	NaN	NaN	NaN	NaN	NaN	NaN	NaN	NaN	NaN	NaN	NaN	NaN	NaN	NaN	NaN	13697.693	NaN	NaN	NaN	NaN	NaN	NaN	NaN	NaN	NaN	NaN	NaN	NaN	NaN	NaN	NaN
3.8692	NaN	NaN	NaN	NaN	NaN	NaN	NaN	NaN	NaN	NaN	NaN	NaN	12559.07	NaN	NaN	NaN	NaN	NaN	NaN	NaN	NaN	NaN	NaN	NaN	NaN	NaN	NaN	NaN	NaN	NaN	NaN	NaN	NaN	NaN	NaN	NaN	NaN	NaN	NaN	NaN	NaN	NaN	NaN	NaN	NaN	NaN	NaN	NaN	NaN	NaN	NaN	NaN	NaN	NaN	NaN	NaN	NaN	NaN	NaN	NaN	NaN	NaN	NaN	NaN	NaN	NaN	NaN	NaN	NaN	NaN	NaN	NaN	NaN	NaN	NaN	NaN	NaN	NaN	NaN	NaN	NaN	NaN	NaN	NaN	NaN	NaN	NaN	NaN	NaN	NaN	NaN	NaN	NaN	NaN	NaN	NaN
4.0027	NaN	NaN	NaN	NaN	NaN	NaN	NaN	NaN	NaN	NaN	NaN	NaN	NaN	NaN	NaN	NaN	NaN	NaN	NaN	NaN	NaN	NaN	NaN	NaN	NaN	NaN	NaN	NaN	NaN	NaN	NaN	NaN	NaN	NaN	NaN	NaN	NaN	NaN	NaN	NaN	NaN	NaN	NaN	NaN	NaN	NaN	NaN	NaN	NaN	NaN	NaN	NaN	NaN	NaN	NaN	NaN	NaN	NaN	NaN	NaN	NaN	NaN	NaN	NaN	NaN	NaN	NaN	NaN	NaN	NaN	NaN	NaN	NaN	NaN	NaN	NaN	NaN	NaN	NaN	NaN	NaN	NaN	NaN	NaN	NaN	NaN	NaN	NaN	NaN	NaN	NaN	NaN	NaN	NaN	NaN	NaN
4.1361	NaN	NaN	NaN	NaN	NaN	NaN	NaN	NaN	NaN	NaN	NaN	NaN	NaN	NaN	NaN	NaN	NaN	NaN	NaN	NaN	NaN	NaN	NaN	NaN	NaN	NaN	NaN	NaN	NaN	NaN	NaN	NaN	NaN	NaN	NaN	NaN	NaN	NaN	NaN	NaN	NaN	NaN	NaN	NaN	NaN	NaN	NaN	NaN	NaN	NaN	NaN	NaN	NaN	NaN	NaN	NaN	NaN	NaN	NaN	NaN	NaN	NaN	NaN	NaN	NaN	NaN	NaN	NaN	NaN	NaN	NaN	NaN	NaN	NaN	NaN	NaN	NaN	NaN	NaN	NaN	NaN	NaN	NaN	NaN	NaN	NaN	NaN	NaN	NaN	NaN	NaN	NaN	NaN	NaN	NaN	NaN
4.2695	NaN	NaN	NaN	NaN	NaN	NaN	NaN	NaN	NaN	NaN	NaN	NaN	NaN	NaN	NaN	NaN	NaN	NaN	NaN	NaN	NaN	NaN	NaN	NaN	NaN	NaN	NaN	NaN	NaN	NaN	NaN	NaN	NaN	NaN	NaN	NaN	NaN	NaN	NaN	NaN	NaN	NaN	NaN	NaN	NaN	NaN	NaN	NaN	NaN	NaN	NaN	NaN	NaN	NaN	NaN	NaN	NaN	NaN	NaN	NaN	NaN	NaN	NaN	NaN	NaN	NaN	NaN	NaN	NaN	NaN	NaN	NaN	NaN	NaN	NaN	NaN	NaN	NaN	NaN	NaN	NaN	NaN	NaN	NaN	NaN	NaN	NaN	NaN	NaN	NaN	NaN	NaN	NaN	NaN	NaN	NaN
4.4029	NaN	NaN	NaN	NaN	NaN	NaN	NaN	NaN	NaN	NaN	NaN	NaN	NaN	NaN	NaN	NaN	NaN	NaN	NaN	NaN	NaN	NaN	NaN	NaN	NaN	NaN	NaN	NaN	NaN	NaN	NaN	NaN	NaN	NaN	NaN	NaN	NaN	NaN	NaN	NaN	NaN	NaN	NaN	NaN	NaN	NaN	NaN	NaN	NaN	NaN	NaN	NaN	NaN	NaN	NaN	NaN	NaN	NaN	NaN	NaN	NaN	NaN	NaN	NaN	NaN	NaN	NaN	NaN	NaN	NaN	NaN	NaN	NaN	NaN	NaN	NaN	NaN	NaN	NaN	NaN	NaN	NaN	NaN	NaN	NaN	NaN	NaN	NaN	NaN	NaN	NaN	NaN	NaN	NaN	NaN	NaN
4.5363	NaN	NaN	NaN	NaN	NaN	NaN	NaN	NaN	NaN	NaN	NaN	NaN	NaN	NaN	NaN	NaN	NaN	NaN	NaN	NaN	NaN	NaN	NaN	NaN	NaN	NaN	NaN	NaN	NaN	NaN	NaN	NaN	NaN	NaN	NaN	NaN	NaN	NaN	NaN	NaN	NaN	NaN	NaN	NaN	NaN	NaN	NaN	NaN	NaN	NaN	NaN	NaN	NaN	NaN	NaN	NaN	NaN	NaN	NaN	NaN	NaN	NaN	NaN	NaN	NaN	NaN	NaN	NaN	NaN	NaN	NaN	NaN	NaN	NaN	NaN	NaN	NaN	NaN	NaN	NaN	NaN	NaN	NaN	NaN	NaN	NaN	NaN	NaN	NaN	NaN	NaN	NaN	NaN	NaN	NaN	NaN
4.6698	NaN	NaN	NaN	NaN	NaN	NaN	NaN	NaN	NaN	NaN	NaN	NaN	NaN	NaN	NaN	NaN	NaN	NaN	NaN	NaN	NaN	NaN	NaN	NaN	NaN	NaN	NaN	NaN	NaN	NaN	NaN	NaN	NaN	NaN	NaN	NaN	NaN	NaN	NaN	NaN	NaN	NaN	NaN	NaN	NaN	NaN	NaN	NaN	NaN	NaN	NaN	NaN	NaN	NaN	NaN	NaN	NaN	NaN	NaN	NaN	NaN	NaN	NaN	NaN	NaN	NaN	NaN	NaN	NaN	NaN	NaN	NaN	NaN	NaN	NaN	NaN	NaN	NaN	NaN	NaN	NaN	NaN	NaN	NaN	NaN	NaN	NaN	NaN	NaN	NaN	NaN	NaN	NaN	NaN	NaN	NaN
4.8032	NaN	NaN	NaN	NaN	NaN	NaN	NaN	NaN	NaN	NaN	NaN	NaN	NaN	NaN	NaN	NaN	NaN	NaN	NaN	NaN	NaN	NaN	NaN	NaN	NaN	NaN	NaN	NaN	NaN	NaN	NaN	NaN	NaN	NaN	NaN	NaN	NaN	NaN	NaN	NaN	NaN	NaN	NaN	NaN	NaN	NaN	NaN	NaN	NaN	NaN	NaN	NaN	NaN	NaN	NaN	NaN	NaN	NaN	NaN	NaN	NaN	NaN	NaN	NaN	NaN	NaN	NaN	NaN	NaN	NaN	NaN	NaN	NaN	NaN	NaN	NaN	NaN	NaN	NaN	NaN	NaN	NaN	NaN	NaN	NaN	NaN	NaN	NaN	NaN	NaN	NaN	NaN	NaN	NaN	NaN	NaN
4.9366	NaN	NaN	NaN	NaN	NaN	NaN	NaN	NaN	NaN	NaN	NaN	NaN	NaN	NaN	NaN	NaN	NaN	NaN	NaN	NaN	NaN	NaN	NaN	NaN	NaN	NaN	NaN	NaN	NaN	NaN	NaN	NaN	NaN	NaN	NaN	NaN	NaN	NaN	NaN	NaN	NaN	NaN	NaN	NaN	NaN	NaN	NaN	NaN	NaN	NaN	NaN	NaN	NaN	NaN	NaN	NaN	NaN	NaN	NaN	NaN	NaN	NaN	NaN	NaN	NaN	NaN	NaN	NaN	NaN	NaN	NaN	NaN	NaN	NaN	NaN	NaN	NaN	NaN	NaN	NaN	NaN	NaN	NaN	NaN	NaN	NaN	NaN	NaN	NaN	NaN	NaN	NaN	NaN	NaN	NaN	NaN
5.07	NaN	NaN	NaN	NaN	NaN	NaN	NaN	NaN	NaN	NaN	NaN	NaN	NaN	NaN	NaN	NaN	NaN	NaN	NaN	NaN	NaN	NaN	NaN	NaN	NaN	NaN	NaN	NaN	NaN	NaN	NaN	NaN	NaN	NaN	NaN	NaN	NaN	NaN	NaN	NaN	NaN	NaN	NaN	NaN	NaN	NaN	NaN	NaN	NaN	NaN	NaN	NaN	NaN	NaN	NaN	NaN	NaN	NaN	NaN	NaN	NaN	NaN	NaN	NaN	NaN	NaN	NaN	NaN	NaN	NaN	NaN	NaN	NaN	NaN	NaN	NaN	NaN	NaN	NaN	NaN	NaN	NaN	NaN	NaN	NaN	NaN	NaN	NaN	NaN	NaN	NaN	NaN	NaN	NaN	NaN	NaN
5.2035	NaN	NaN	NaN	NaN	NaN	NaN	NaN	NaN	NaN	NaN	NaN	NaN	NaN	NaN	NaN	NaN	NaN	NaN	NaN	NaN	NaN	NaN	NaN	NaN	NaN	NaN	NaN	NaN	NaN	NaN	NaN	NaN	NaN	NaN	NaN	NaN	NaN	NaN	NaN	NaN	NaN	NaN	NaN	NaN	NaN	NaN	NaN	NaN	NaN	NaN	NaN	NaN	NaN	NaN	NaN	NaN	NaN	NaN	NaN	NaN	NaN	NaN	NaN	NaN	NaN	NaN	NaN	NaN	NaN	NaN	NaN	NaN	NaN	NaN	NaN	NaN	NaN	NaN	NaN	NaN	NaN	NaN	NaN	NaN	NaN	NaN	NaN	NaN	NaN	NaN	NaN	NaN	NaN	NaN	NaN	NaN
5.3369	NaN	NaN	NaN	NaN	NaN	NaN	NaN	NaN	NaN	NaN	NaN	NaN	NaN	NaN	NaN	NaN	NaN	NaN	NaN	NaN	NaN	NaN	NaN	NaN	NaN	NaN	NaN	NaN	NaN	NaN	NaN	NaN	NaN	NaN	NaN	NaN	NaN	NaN	NaN	NaN	NaN	NaN	NaN	NaN	NaN	NaN	NaN	NaN	NaN	NaN	NaN	NaN	NaN	NaN	NaN	NaN	NaN	NaN	NaN	NaN	NaN	NaN	NaN	NaN	NaN	NaN	NaN	NaN	NaN	NaN	NaN	NaN	NaN	NaN	NaN	NaN	NaN	NaN	NaN	NaN	NaN	NaN	NaN	NaN	NaN	NaN	NaN	NaN	NaN	NaN	NaN	NaN	NaN	NaN	NaN	NaN
5.4703	NaN	NaN	NaN	NaN	NaN	NaN	NaN	NaN	NaN	NaN	NaN	NaN	NaN	NaN	NaN	NaN	NaN	NaN	NaN	NaN	NaN	NaN	NaN	NaN	NaN	NaN	NaN	NaN	NaN	NaN	NaN	NaN	NaN	NaN	NaN	NaN	NaN	NaN	NaN	NaN	NaN	NaN	NaN	NaN	NaN	NaN	NaN	NaN	NaN	NaN	NaN	NaN	NaN	NaN	NaN	NaN	NaN	NaN	NaN	NaN	NaN	NaN	NaN	NaN	NaN	NaN	NaN	NaN	NaN	NaN	NaN	NaN	NaN	NaN	NaN	NaN	NaN	NaN	NaN	NaN	NaN	NaN	NaN	NaN	NaN	NaN	NaN	NaN	NaN	NaN	NaN	NaN	NaN	NaN	NaN	NaN
5.6037	NaN	NaN	NaN	NaN	NaN	NaN	NaN	NaN	NaN	NaN	NaN	NaN	NaN	NaN	NaN	NaN	NaN	NaN	NaN	NaN	NaN	NaN	NaN	NaN	NaN	NaN	NaN	NaN	NaN	NaN	NaN	NaN	NaN	NaN	NaN	NaN	NaN	NaN	NaN	NaN	NaN	NaN	NaN	NaN	NaN	NaN	NaN	NaN	NaN	NaN	NaN	NaN	NaN	NaN	NaN	NaN	NaN	NaN	NaN	NaN	NaN	NaN	NaN	NaN	NaN	NaN	NaN	NaN	NaN	NaN	NaN	NaN	NaN	NaN	NaN	NaN	NaN	NaN	NaN	NaN	NaN	NaN	NaN	NaN	NaN	NaN	NaN	NaN	NaN	NaN	NaN	NaN	NaN	NaN	NaN	NaN
5.7371	NaN	NaN	NaN	NaN	NaN	NaN	NaN	NaN	NaN	NaN	NaN	NaN	NaN	NaN	NaN	NaN	NaN	NaN	NaN	NaN	NaN	NaN	NaN	NaN	NaN	NaN	NaN	NaN	NaN	NaN	NaN	NaN	NaN	NaN	NaN	NaN	NaN	NaN	NaN	NaN	NaN	NaN	NaN	NaN	NaN	NaN	NaN	NaN	NaN	NaN	NaN	NaN	NaN	NaN	NaN	NaN	NaN	NaN	NaN	NaN	NaN	NaN	NaN	NaN	NaN	NaN	NaN	NaN	NaN	NaN	NaN	NaN	NaN	NaN	NaN	NaN	NaN	NaN	NaN	NaN	NaN	NaN	NaN	NaN	NaN	NaN	NaN	NaN	NaN	NaN	NaN	NaN	NaN	NaN	NaN	NaN
