0.0000	12880.8652
0.1334	13589.7773
0.2668	14921.4717
0.4003	18181.9082
0.5337	20912.8398
0.6671	21749.8926
0.8005	21274.6035
0.9340	19633.9824
1.0674	19513.0273
1.2008	18497.0039
1.3342	16905.0781
1.4676	16660.4043
1.6011	17044.7129
1.7345	16189.6670
1.8679	15234.8232
2.0013	14914.1982
2.1347	14436.9229
2.2682	13837.9355
2.4016	14281.8105
2.5350	14212.3633
2.6684	14349.3818
2.8019	14501.1934
2.9353	14133.2139
3.0687	14581.0459
3.2021	14993.4375
3.3355	14958.5166
3.4690	14335.4385
3.6024	14039.4814
3.7358	14761.4746
3.8692	13043.4258
4.0027	13484.0176
4.1361	13389.0596
4.2695	13488.0850
4.4029	13034.2178
4.5363	13302.7002
4.6698	13322.3135
4.8032	12889.6846
