0.0000	16261.9932
0.1334	15809.3115
0.2668	15394.4795
0.4003	17171.7188
0.5337	19713.1680
0.6671	23951.1758
0.8005	26179.7734
0.9340	23370.5840
1.0674	18362.8535
1.2008	16087.5713
1.3342	15533.4814
1.4676	16232.7891
1.6011	15398.5410
1.7345	15467.8320
1.8679	15792.5342
2.0013	16136.0752
2.1347	15774.4189
2.2682	15724.4980
2.4016	15279.5771
2.5350	14824.8936
2.6684	15077.2070
2.8019	15350.6240
2.9353	14722.7969
3.0687	14538.6943
3.2021	14978.0273
3.3355	14385.6768
