0.0000	33960.9648
0.1334	32897.7812
0.2668	32692.3145
0.4003	35080.5117
0.5337	34045.7422
0.6671	35372.1758
0.8005	36563.7539
0.9340	39862.8594
1.0674	47397.5273
1.2008	64361.4648
1.3342	89980.5469
1.4676	96232.7422
1.6011	71214.3359
1.7345	48310.6953
1.8679	42569.9023
2.0013	40678.1328
2.1347	44514.1328
