X,Y
0.00000,34213.410
0.13342,34564.219
0.26684,34436.238
0.40027,35725.566
0.53369,35533.590
0.66711,34597.195
0.80053,35129.816
0.93395,35746.766
1.06737,35248.961
1.20080,36697.391
1.33422,36768.723
1.46764,38568.867
1.60106,40262.199
1.73448,52384.859
1.86791,70249.656
2.00133,76464.234
2.13475,61512.277
2.26817,44872.738
2.40159,40645.129
2.53502,36061.336
2.66844,35328.699
