X,Y
0.00000,35525.781
0.13342,32748.713
0.26684,34566.977
0.40027,34331.480
0.53369,34090.250
0.66711,33541.055
0.80053,34942.406
0.93395,36021.410
1.06737,34469.684
1.20080,33350.055
1.33422,35532.102
1.46764,36692.879
1.60106,38219.422
1.73448,43694.445
1.86791,58197.125
2.00133,93424.547
2.13475,124768.219
2.26817,103799.945
2.40159,63704.023
2.53502,43950.984
