0.00000,36669.105
0.13342,37737.957
0.26684,34835.453
0.40027,37961.168
0.53369,39634.629
0.66711,36517.098
0.80053,36383.180
0.93395,36183.191
1.06737,36224.176
1.20080,36127.078
1.33422,36147.934
1.46764,35798.191
1.60106,38145.336
1.73448,43124.227
1.86791,55216.508
2.00133,80887.211
2.13475,107161.406
2.26817,82662.258
2.40159,53139.379
2.53502,42853.582
2.66844,39875.203
2.80186,36778.473
