0.0000	33391.8008
0.1334	33155.4805
0.2668	33897.8906
0.4003	32242.4551
0.5337	32522.9512
0.6671	32476.0859
0.8005	32711.7070
0.9340	32534.9062
1.0674	32843.0781
1.2008	32071.7090
1.3342	32081.9023
1.4676	31939.7363
1.6011	33404.4531
1.7345	34758.3828
1.8679	40808.6523
2.0013	53588.9102
2.1347	72403.7500
2.2682	75012.4609
2.4016	56621.6836
2.5350	43046.9492
