0.0000	14522.8574
0.1334	14577.4404
0.2668	15685.9717
0.4003	17539.8711
0.5337	20499.7344
0.6671	23963.5742
0.8005	21329.5195
0.9340	17840.8125
1.0674	15248.7676
1.2008	14617.3340
1.3342	14712.6846
1.4676	14976.9531
1.6011	16165.9902
1.7345	16305.0762
1.8679	17064.4395
2.0013	15053.8115
2.1347	15790.7148
2.2682	14668.1367
2.4016	15080.2061
2.5350	15669.6367
2.6684	14626.1533
2.8019	14626.7861
2.9353	14868.7305
3.0687	15155.7764
