0.0000	13441.0381
0.1334	14211.3115
0.2668	17505.4609
0.4003	21333.7812
0.5337	22159.1602
0.6671	18481.7637
0.8005	15940.2432
0.9340	15254.6045
1.0674	15714.1299
1.2008	16004.5215
1.3342	15553.1543
1.4676	15249.5293
1.6011	14852.8418
1.7345	13821.0625
1.8679	13431.8311
2.0013	13727.7959
2.1347	13727.3662
