x	Y_20180130_15109_14_4g	Y_20180130_15109_15_2g	Y_20180130_15109_16_3g
0	10761.01	13673.386	11812.108
0.1334	11383.427	14307.892	11785.321
0.2668	13010.417	17177.234	13398.122
0.4003	13150.159	21276.252	15131.088
0.5337	14663.312	25793.377	16926.475
0.6671	16747.873	26542.662	16975.57
0.8005	17804.422	23116.779	16787.453
0.934	16451.764	21186.461	16811.918
1.0674	15977.661	19865.797	17351.561
1.2008	15316.146	19231.758	16808.854
1.3342	14901.527	18145.504	15465.917
1.4676	15677.099	17732.234	14980.507
1.6011	15936.615	16011.754	15703.998
1.7345	16437.33	15031.179	14588.272
1.8679	15093.585	14549.713	14959.852
2.0013	13648.068	15039.954	14254.248
2.1348	12748.092	15416.573	14479.454
2.2682	13040.858	16050.553	16090.897
2.4016	13992.537	17646.055	15385.892
2.535	14315.826	18224.686	15589.786
2.6684	13748.819	18631.949	15700.675
2.8019	13574.796	17786.756	15097.251
2.9353	13898.527	16360.413	14097.547
3.0687	13145.86	14705.938	13450.047
3.2021	12758.307	13004.465	12189.099
3.3356	12330.574	12708.232	12051.825
3.469	11933.669	12688.775	11403.108
3.6024	11963.709	NaN	11415.456
3.7358	12130.498	NaN	NaN
3.8692	12359.258	NaN	NaN
4.0027	NaN	NaN	NaN
4.1361	NaN	NaN	NaN
4.2695	NaN	NaN	NaN
4.4029	NaN	NaN	NaN
4.5363	NaN	NaN	NaN
4.6698	NaN	NaN	NaN
4.8032	NaN	NaN	NaN
4.9366	NaN	NaN	NaN
5.07	NaN	NaN	NaN
5.2035	NaN	NaN	NaN
