0.0000	13806.3281
0.1334	13917.6777
0.2668	15168.8750
0.4003	17641.6992
0.5337	21711.7559
0.6671	25303.2305
0.8005	22163.0586
0.9340	20196.9004
1.0674	18618.8281
1.2008	16801.8457
1.3342	16021.0889
1.4676	15080.2754
1.6011	16030.4580
1.7345	16234.5850
1.8679	15075.2998
2.0013	16057.6885
2.1347	15831.3057
2.2682	15959.8945
2.4016	15791.5361
2.5350	16078.2461
2.6684	14769.7744
2.8019	14138.6172
2.9353	13645.4531
3.0687	13493.6621
3.2021	13150.2510
3.3355	13037.3574
3.4690	12788.2871
3.6024	12613.0654
3.7358	12914.9141
3.8692	12938.2793
