0.00000,16982.469
0.13342,15613.990
0.26684,15794.716
0.40027,15880.650
0.53369,16122.079
0.66711,15621.059
0.80053,16493.568
0.93395,17528.838
1.06737,16575.189
1.20080,16068.605
1.33422,16005.871
1.46764,16516.090
1.60106,16417.455
1.73448,16716.129
1.86791,16965.230
2.00133,18039.520
2.13475,20098.867
2.26817,25603.652
2.40159,38094.387
2.53502,53054.164
2.66844,50116.766
2.80186,33242.059
2.93528,23657.781
3.06870,19487.029
3.20212,17363.648
