X,Y
0.00000,11516.269
0.13342,11780.183
0.26684,12606.053
0.40027,14145.271
0.53369,14922.896
0.66711,15007.160
0.80053,13799.526
0.93395,13125.714
1.06737,12140.854
1.20080,12534.682
1.33422,12987.905
1.46764,13188.538
1.60106,12394.578
1.73448,13180.414
1.86791,12713.465
2.00133,12527.306
2.13475,13257.834
