0.00000,32235.020
0.13342,32365.098
0.26684,31790.139
0.40027,32704.670
0.53369,34421.031
0.66711,33895.250
0.80053,33944.996
0.93395,33989.828
1.06737,33936.020
1.20080,34891.426
1.33422,39166.113
1.46764,45778.098
1.60106,61474.672
1.73448,85603.281
1.86791,95552.109
2.00133,67128.500
2.13475,45704.305
2.26817,38394.035
2.40159,35789.820
2.53502,35489.438
