x	Y_20180514_15338_c1_20_3g	Y_20180514_15338_c1_3_3g	Y_20180514_15338_c1_4_3g
0	15472.7949	11929.8955	11957.7549
0.1334	18055.9277	12517.9902	12485.166
0.2668	21752.5938	13995.0273	14022.6309
0.4003	27270.0859	16593.3125	16596.6445
0.5337	30227.2422	20915.4434	20900.4062
0.6671	26778.4668	27518.5586	27559.4512
0.8005	23759.5723	25107.625	24940.043
0.934	20799.7285	20370.0098	20301.5703
1.0674	19704.9609	15786.7148	15684.4102
1.2008	19207.9004	14061.6318	13998.252
1.3342	18916.9883	13726.8916	13613.1016
1.4676	18721.0547	14173.3467	14106.1592
1.6011	18776.1523	14249.7354	14176.8574
1.7345	17970.3828	15221.7988	15154.0498
1.8679	17843.6367	15791.4756	15712.8086
2.0013	18643.1016	16691.2246	16596.0898
2.1347	19035.166	17216.9199	17010.8242
2.2682	19139.5723	16444.8457	16264.4053
2.4016	20283.0547	16128.2334	15762.8262
2.535	22346.7324	15044.9346	14834.0098
2.6684	23259.9043	14702.833	14376.0439
2.8019	22420.8223	15541.9639	15522.2168
2.9353	24026.3281	15343.5312	15397.2871
3.0687	24197.3535	15052.8408	15203.041
3.2021	25051.584	14814.3018	14757.0391
3.3355	24373.1934	14380.4043	14318.9297
3.469	22643.9766	13415.2959	13360.2842
3.6024	20173.5879	13494.8428	13480.2002
3.7358	18497.1504	12774.5391	12684.917
3.8692	17133.1836	12657.501	12465.7637
4.0027	NaN	12501.3369	12437.0098
4.1361	NaN	NaN	11969.2812
4.2695	NaN	NaN	11763.8096
4.4029	NaN	NaN	NaN
4.5363	NaN	NaN	NaN
4.6698	NaN	NaN	NaN
4.8032	NaN	NaN	NaN
4.9366	NaN	NaN	NaN
5.07	NaN	NaN	NaN
5.2035	NaN	NaN	NaN
5.3369	NaN	NaN	NaN
5.4703	NaN	NaN	NaN
5.6037	NaN	NaN	NaN
5.7371	NaN	NaN	NaN
5.8706	NaN	NaN	NaN
