X,Y
0.00000,13658.001
0.13342,13747.879
0.26684,14725.560
0.40027,16786.842
0.53369,17095.338
0.66711,17444.436
0.80053,17216.617
0.93395,16811.686
1.06737,16482.711
1.20080,16060.611
1.33422,14940.027
1.46764,14773.524
1.60106,14768.865
1.73448,14384.612
1.86791,14450.462
2.00133,14821.527
2.13475,14105.667
2.26817,13579.805
2.40159,12508.556
2.53502,12742.777
2.66844,12149.090
2.80186,12456.159
