0.00000,37113.719
0.13342,38326.953
0.26684,37083.641
0.40027,39544.578
0.53369,39533.602
0.66711,39086.535
0.80053,38803.562
0.93395,39638.168
1.06737,38301.570
1.20080,38682.465
1.33422,37392.133
1.46764,37024.121
1.60106,38303.488
1.73448,37794.477
1.86791,37228.184
2.00133,39711.895
2.13475,40662.477
2.26817,41234.484
2.40159,41703.562
2.53502,44824.957
2.66844,54453.285
2.80186,78986.062
2.93528,123523.703
3.06870,137725.859
3.20212,102637.805
3.33555,67280.328
3.46897,55065.051
3.60239,53626.180
3.73581,50305.863
