X,Y
0.00000,14106.851
0.13342,14703.944
0.26684,16198.646
0.40027,17993.732
0.53369,19092.104
0.66711,18440.336
0.80053,17485.344
0.93395,15793.044
1.06737,14235.312
1.20080,13927.624
1.33422,13695.985
1.46764,13671.519
1.60106,12683.812
1.73448,12669.592
1.86791,12872.238
2.00133,12070.439
2.13475,11905.507
