x	Y_20180130_15109_42_11g	Y_20180130_15109_42_5g	Y_20180130_15109_42_7g
0	25629.35	26231.967	24435.375
0.1334	25702.457	25825.855	24821.299
0.2668	25856.555	25872.779	23871.922
0.4003	26026.834	24462.83	24876.77
0.5337	26247.775	24548.703	25557.447
0.6671	25530.57	24239.25	24380.408
0.8005	26020.299	24922.133	25681.293
0.934	28684.613	26202.545	27164.525
1.0674	30365.564	28801.748	26310.178
1.2008	33626.273	30345.564	26733.482
1.3342	42917.566	34534.18	29921.047
1.4676	59563.445	47579.441	36921.32
1.6011	66265.016	68113.117	55745.828
1.7345	52250.387	94678.203	88154.797
1.8679	38020.863	95373.719	98309.25
2.0013	NaN	65556.242	70995.484
2.1348	NaN	43870.098	45464.836
2.2682	NaN	35437.156	34266.629
2.4016	NaN	NaN	30895.227
2.535	NaN	NaN	NaN
2.6684	NaN	NaN	NaN
2.8019	NaN	NaN	NaN
2.9353	NaN	NaN	NaN
3.0687	NaN	NaN	NaN
3.2021	NaN	NaN	NaN
3.3356	NaN	NaN	NaN
3.469	NaN	NaN	NaN
3.6024	NaN	NaN	NaN
3.7358	NaN	NaN	NaN
3.8692	NaN	NaN	NaN
4.0027	NaN	NaN	NaN
4.1361	NaN	NaN	NaN
4.2695	NaN	NaN	NaN
4.4029	NaN	NaN	NaN
4.5363	NaN	NaN	NaN
