X,Y
0.00000,11108.672
0.13342,11414.749
0.26684,12427.688
0.40027,13073.756
0.53369,14772.182
0.66711,17561.451
0.80053,16880.146
0.93395,16742.668
1.06737,14935.352
1.20080,15742.882
1.33422,14776.035
1.46764,13188.664
1.60106,11990.862
1.73448,11708.032
1.86791,11608.941
2.00133,11510.893
2.13475,12024.687
