0.00000,39071.402
0.13342,39571.980
0.26684,40536.574
0.40027,38578.336
0.53369,39277.332
0.66711,38898.121
0.80053,38738.422
0.93395,38533.305
1.06737,37569.211
1.20080,39034.672
1.33422,41238.395
1.46764,38960.992
1.60106,38965.465
1.73448,39116.945
1.86791,44116.691
2.00133,52077.891
2.13475,70703.211
2.26817,110078.352
2.40159,132385.156
2.53502,103324.164
2.66844,67599.656
2.80186,51299.422
2.93528,43260.469
3.06870,40196.914
