0.00000,38859.562
0.13342,40308.613
0.26684,38572.414
0.40027,38701.742
0.53369,38870.156
0.66711,37902.871
0.80053,37131.473
0.93395,37268.059
1.06737,38712.223
1.20080,37735.363
1.33422,38461.738
1.46764,35915.551
1.60106,37461.246
1.73448,38122.996
1.86791,38566.031
2.00133,37504.582
2.13475,37941.016
2.26817,41170.887
2.40159,41237.078
2.53502,44969.266
2.66844,55924.621
2.80186,82267.055
2.93528,129516.727
3.06870,155176.156
3.20212,117920.125
3.33555,73651.039
3.46897,52863.566
3.60239,46161.059
3.73581,43391.746
