0.0000	34223.6172
0.1334	33813.8477
0.2668	34196.9102
0.4003	35517.4219
0.5337	35191.0312
0.6671	33400.4805
0.8005	35628.1680
0.9340	35765.2344
1.0674	37740.8594
1.2008	44833.1602
1.3342	61126.5078
1.4676	94140.6484
1.6011	123422.4062
1.7345	108133.0156
1.8679	68135.6875
2.0013	48594.9492
2.1347	42071.6562
