0.00000,38700.312
0.13342,38528.895
0.26684,36722.238
0.40027,38160.219
0.53369,38167.945
0.66711,36440.883
0.80053,36283.289
0.93395,35997.191
1.06737,37405.996
1.20080,38413.027
1.33422,37736.168
1.46764,38737.543
1.60106,38951.918
1.73448,46288.691
1.86791,63201.953
2.00133,101878.555
2.13475,142892.109
2.26817,125869.031
2.40159,77854.188
2.53502,55345.805
2.66844,50539.559
2.80186,46475.047
