0.00000,13554.931
0.13342,14121.193
0.26684,15446.367
0.40027,19909.117
0.53369,23976.664
0.66711,27265.830
0.80053,24585.809
0.93395,23146.035
1.06737,22856.672
1.20080,22028.090
1.33422,20908.963
1.46764,19053.680
1.60106,17152.953
1.73448,16684.551
1.86791,15573.266
2.00133,14759.368
