0.0000	5767.4688
0.1334	8835.7861
0.2668	18062.8926
0.4003	20323.4238
0.5337	21253.1973
0.6671	22023.1348
0.8005	21328.0098
0.9340	19444.4883
1.0674	17931.0195
1.2008	17295.2695
1.3342	16936.7754
1.4676	15891.7549
1.6011	16318.7324
1.7345	16211.2744
1.8679	15624.2598
2.0013	15418.1152
2.1347	16627.3496
2.2682	15554.8643
2.4016	14058.7686
2.5350	12921.7568
2.6684	12442.4482
2.8019	13057.3340
2.9353	12815.0508
3.0687	12774.6133
3.2021	12459.2598
3.3355	12623.8545
3.4690	12744.3340
