0.0000	33099.7617
0.1334	33745.8125
0.2668	33416.8320
0.4003	33218.5703
0.5337	33566.4219
0.6671	34463.0000
0.8005	35371.8281
0.9340	36627.8711
1.0674	41984.2539
1.2008	57004.3438
1.3342	91054.1875
1.4676	116092.9375
1.6011	97064.1719
1.7345	65080.0820
1.8679	45896.3398
2.0013	39318.0508
