0.0000	33185.0352
0.1334	34009.6172
0.2668	33205.2891
0.4003	34102.1797
0.5337	33678.4727
0.6671	32867.4570
0.8005	34235.6328
0.9340	33334.1875
1.0674	31830.9883
1.2008	33726.6523
1.3342	32753.1797
1.4676	33432.3320
1.6011	32231.4180
1.7345	36248.3047
1.8679	38044.8203
2.0013	51054.1914
2.1347	76092.2031
2.2682	98758.4062
2.4016	84395.6484
2.5350	57323.3516
2.6684	41896.5781
2.8019	37142.8047
2.9353	38139.2461
3.0687	35386.6602
3.2021	33256.3711
3.3355	34757.7148
3.4690	32386.6230
