X,Y
0.00000,12175.809
0.13342,13014.461
0.26684,13699.554
0.40027,14254.068
0.53369,15361.981
0.66711,15813.740
0.80053,14255.762
0.93395,13405.582
1.06737,12798.140
1.20080,13132.352
1.33422,12299.247
1.46764,11863.307
1.60106,11277.777
1.73448,11433.777
