0.00000,35486.359
0.13342,35852.871
0.26684,34243.699
0.40027,35708.383
0.53369,36336.332
0.66711,35829.230
0.80053,35868.754
0.93395,36359.562
1.06737,34925.824
1.20080,35143.270
1.33422,38176.719
1.46764,35973.457
1.60106,39271.324
1.73448,39882.102
1.86791,45069.898
2.00133,57937.672
2.13475,83179.125
2.26817,111223.344
2.40159,100661.727
2.53502,69603.492
2.66844,50450.914
