x	Y_20180130_15101_1_13g	Y_20180130_15101_1_14g	Y_20180130_15101_10_25g	Y_20180130_15101_10_3g	Y_20180130_15101_10_5g	Y_20180130_15101_12_14g	Y_20180130_15101_12_19g	Y_20180130_15101_13_7g	Y_20180130_15101_15_2g	Y_20180130_15101_15_7g	Y_20180130_15101_16_2g	Y_20180130_15101_19_6g	Y_20180130_15101_2_16g	Y_20180130_15101_20_2g	Y_20180130_15101_20_4g	Y_20180130_15101_21_16g	Y_20180130_15101_21_7g	Y_20180130_15101_23_1g	Y_20180130_15101_27_13g	Y_20180130_15101_27_14g	Y_20180130_15101_3_6g	Y_20180130_15101_5_17g	Y_20180130_15101_5_21g	Y_20180130_15101_5_2g	Y_20180130_15101_6_14g	Y_20180130_15101_7_8g	Y_20180130_15101_8_15g	Y_20180130_15101_8_20g	Y_20180130_15101_9_11g	Y_20180130_15101_9_13g	Y_20180130_15101_9_19g
0	11430.677	13095.088	15641.781	15265.133	13259.58	14367.506	13409.954	12363.902	12997.96	13078.576	14625.963	12571.104	12331.942	13059.674	13015.664	16700.148	14108.6	15067.282	14279.706	13727.08	12479.676	11940.263	11806.071	15975.826	12626.261	14058.624	13132.595	14012.202	13571.732	13491.022	12550.664
0.1334	12114.569	13842.504	16033.492	16327.301	14349.229	16186.763	13791.059	12953.559	15516.635	14127.282	15692.946	14342.94	12547.566	13578.331	13389.55	16109.016	15115.403	16788.793	14624.655	13973.534	14323.146	13325.717	12731.412	16305.194	13067.337	14326.204	14544.636	15977.421	13695.851	14685.496	12869.226
0.2668	12884.167	14473.097	16260.882	17842.246	16289.223	18067.152	15329.98	14088.226	17416.297	15018.944	18323.018	17767.922	14052.965	13779.381	14590.202	18107.018	15593.518	20989.711	18599.031	14423.805	15113.913	14676.827	14270.311	18045.064	14076.469	15135.28	16242.535	17198.309	15846.57	16853.277	15850.033
0.4003	14719.352	16572.629	19554.23	22595.631	18782.555	20117.646	16737.639	15632.812	18210.08	16566.471	21243.43	21522.676	16421.344	17911.578	14404.084	21432.422	17949.998	22930.291	21745.332	16017.36	17607.539	17450.207	18082.324	20521.775	15802.996	19996.828	19714.449	20079.479	17925.395	20241.303	20504.045
0.5337	17761.426	17589.922	21224.299	27344.064	21300.646	22585.939	19626.092	17093.377	17290.428	19063.875	18762.24	24833.396	19656.938	20379.947	14295.615	25114.568	21462.031	22003.689	22684.59	18909.205	18693.465	16814.371	20132.512	20760.137	17528.223	22482.174	24534.174	26129.402	20280.609	21964.221	25248.664
0.6671	20112.709	18471.67	22901.76	25709.695	21601.938	22881.57	25069.502	20799.062	17386.15	20487.5	17738.797	25163.312	19680.584	21350.119	14242.979	26897.928	24054.459	22450.512	21380.633	23053.195	18505.832	16443.98	20749.496	21527.076	20057.988	21797.768	25846.523	29316.057	21661.035	21304.883	25868.281
0.8005	18497.863	18955.49	24554.477	24231.086	19899.459	22489.492	28161.865	22415.639	16865.391	21703.199	18333.229	25630.104	18155.801	21229.5	14167.006	26621.061	22964.266	23153.424	21163.754	25663.574	16824.262	16167.063	20634.723	24337.15	19973.941	20747.24	25793.486	27260.801	20055.533	21211.693	25841.816
0.934	18119.703	21705.793	23415.15	24478.756	17356.783	21094.182	27243.793	21709.178	17141.969	20882.977	18589.633	25038.221	16223.838	19596.195	15374.84	26520.66	23766.287	22877.398	21134.869	27555.633	16146.604	15989.932	18871.293	24627.57	20969.846	19098.98	26914.586	26316	20860.748	19667.238	24692.584
1.0674	18713.793	21351.986	22679.941	24426.645	17555.582	19508.473	25542.703	21042.707	16802.006	20898.355	18819.285	25705.76	15457.996	19380.795	16296.521	24356.557	22118.715	22187.812	20065.855	28212.748	15485.846	15625.882	19800.127	23117.314	18483.596	19651.459	25081.246	26218.68	19566.609	19455.652	24146.654
1.2008	17964.525	20109.713	22453.125	23906.131	17847.707	19242.338	26934.326	21783.695	16303.577	20677.143	17423.893	25933.203	15391.792	18635.465	16811.752	23217.77	21015.205	21109.615	19018.934	27188.482	15840.869	16869.35	20722.104	21592.043	17068.021	20779.979	21655.459	27302.006	20406.871	19101.627	24688.305
1.3342	17068.533	19623.271	21625.307	22197.945	17666.299	19340.76	24696.627	22065.336	16852.727	22019.785	16086.263	25132.42	16623.27	18535.775	17344.152	22613.592	21183.08	20279.809	19627.053	25899.771	14823.614	15199.462	20724.043	21858.893	15866.938	20285.039	20483.611	28774.627	19100.146	18995.215	26410.301
1.4676	16505.811	18270.656	26017.133	20127.738	16541.4	17319.68	24229.523	22527.432	18946.461	23620.033	16181.23	23288.648	16903.695	18484.166	16728.463	23207.672	22241.889	18720.512	21493.646	24026.029	16192.399	15772.192	19791.572	22122.969	15811.282	19141.283	23633.764	29294.787	18491.498	18877.301	26120.377
1.6011	17255.289	18219.219	27518.041	18987.424	16375.067	17318.959	24589.531	24981.588	20221.25	22546.59	15674.045	20511.076	16313.166	18104.457	15757.184	22641.484	25284.721	19162.406	21566.004	23022.365	16829.486	15466.64	20205.969	20817.898	14879.021	18216.879	23541.379	28576.383	20376.148	20664.963	23166.934
1.7345	18385.791	18596.424	27757.273	18810.631	15821.896	18967.953	23329.646	25649.029	21569.188	21209.545	14681.924	20239.262	17593.281	18624.912	15185.434	21207.812	23080.875	18922.16	20944.229	24465.754	17981.031	14728.847	18811.043	19499.078	15794.851	17992.496	21702.336	26765.537	20741.223	19677.988	22145.693
1.8679	18596.857	19683.178	26386.539	19382.891	16693.969	20541.65	21425.58	25030.965	21492.764	21440.033	14781.041	19054.074	17464.674	18063.086	15597.981	20772.445	22865.867	18240.479	20329.887	23633.846	19662.711	14685.863	19127.889	20520.73	17310.248	15771.817	20077.904	24969.529	21776.463	18471.783	22806.457
2.0013	17913.76	19137.26	25307.613	21532.346	18603.453	21398.092	20693.178	23732.158	20185.787	22108.939	13774.199	17394.109	16728.826	18832.85	15815.553	22238.908	22976.307	18284.34	21072.363	21287.215	21148.943	14385.58	20046.527	19214	16338.496	15110.948	19436.387	24068.928	21175.189	17552.385	20294.133
2.1348	17480.652	20680.561	22662.822	21610.555	18507.189	21487.027	20239.791	22459.146	18942.955	21170.088	13830.536	18429.602	16333.474	18839.818	14012.164	23817.607	21914.592	18229.637	19547.543	19754.248	21905.152	14380.425	18926.6	19482.4	16744.805	14737.506	16772.943	24959.291	19683.348	16243.518	18846.812
2.2682	15597.246	22646.68	21946.672	19678.619	17864.58	20264.211	19019.816	21794.283	15273.239	19885.963	13408.633	16231.338	16598.973	20263.617	13124.247	20633.543	18933.08	16350.521	19259.258	19960.582	20161.984	13686.254	17712.748	19173.848	17427.893	15075.509	15612.43	23092.713	19503.389	15613.642	16485.438
2.4016	13574.729	21871.188	20737.371	16952.258	16944.34	18530.307	17673.127	19592.537	14279.08	18556.373	13562.24	14940.199	15584.745	18362.168	12675.793	18172.795	17951.965	14662.983	17122.621	19371.354	16820.717	13860.682	16148.024	17861.752	15817.734	15110.555	14597.11	20287.609	17674.135	15439.982	14853.207
2.535	13044.463	22397.475	18033	14353.107	14937.587	17020.553	15013.259	16779.098	13394.371	16559.633	13465.419	14467.406	13970.583	16780.375	11874.25	16550.312	14303.55	13212.984	14895.66	18270.828	14863.74	12977.271	14679.228	18483.023	14020.908	14675.415	13597.116	17491.096	16218.006	13760.245	14220.874
2.6684	13214.221	21598.836	15815.639	14246.161	14232.329	15139.18	12628.457	15389.365	12826.314	14562.336	14193.282	13582.78	13679.309	14673.331	NaN	14944.122	14060.191	12364.997	13574.987	16553.674	13527.034	12582.186	14393.44	16060.018	13959.882	13473.116	12787.278	15991.551	15004.562	13063.146	13162.198
2.8019	13374.09	17212.279	14717.327	14173.893	12742.87	13410.875	13063.636	14291.525	12288.227	13505.722	NaN	12567.926	13457.379	14398.259	NaN	13343.324	13669.896	NaN	13383.927	15750.828	14065.877	12841.72	14855.379	15046.99	13364.766	13110.556	12255.239	14963.396	13882.997	12882.026	13057.406
2.9353	13490.618	14377.741	13924.954	13639.31	12710.553	12944.965	12926.488	13901.619	NaN	13595.538	NaN	12611.671	12418.763	NaN	NaN	13148.122	13284.293	NaN	NaN	14654.5	NaN	NaN	14045.05	13738.316	13238.298	13607.072	13004.599	14272.4	14045.54	NaN	12883.88
3.0687	13236.253	13347.998	14162.326	NaN	12329.694	NaN	12506.35	13529.725	NaN	13265.498	NaN	12843.895	12138.296	NaN	NaN	NaN	12847.652	NaN	NaN	13393.86	NaN	NaN	NaN	13695.671	12704.373	NaN	12631.072	14059.544	13808.755	NaN	NaN
3.2021	14168.193	12310.552	13592.743	NaN	12988.699	NaN	NaN	NaN	NaN	12638.806	NaN	NaN	13056.824	NaN	NaN	NaN	NaN	NaN	NaN	13037.32	NaN	NaN	NaN	13373.679	NaN	NaN	NaN	13500.775	NaN	NaN	NaN
3.3356	NaN	12427.072	NaN	NaN	NaN	NaN	NaN	NaN	NaN	NaN	NaN	NaN	NaN	NaN	NaN	NaN	NaN	NaN	NaN	13262.213	NaN	NaN	NaN	12816.645	NaN	NaN	NaN	NaN	NaN	NaN	NaN
3.469	NaN	12245.668	NaN	NaN	NaN	NaN	NaN	NaN	NaN	NaN	NaN	NaN	NaN	NaN	NaN	NaN	NaN	NaN	NaN	13157.383	NaN	NaN	NaN	14002.058	NaN	NaN	NaN	NaN	NaN	NaN	NaN
3.6024	NaN	NaN	NaN	NaN	NaN	NaN	NaN	NaN	NaN	NaN	NaN	NaN	NaN	NaN	NaN	NaN	NaN	NaN	NaN	NaN	NaN	NaN	NaN	NaN	NaN	NaN	NaN	NaN	NaN	NaN	NaN
3.7358	NaN	NaN	NaN	NaN	NaN	NaN	NaN	NaN	NaN	NaN	NaN	NaN	NaN	NaN	NaN	NaN	NaN	NaN	NaN	NaN	NaN	NaN	NaN	NaN	NaN	NaN	NaN	NaN	NaN	NaN	NaN
3.8692	NaN	NaN	NaN	NaN	NaN	NaN	NaN	NaN	NaN	NaN	NaN	NaN	NaN	NaN	NaN	NaN	NaN	NaN	NaN	NaN	NaN	NaN	NaN	NaN	NaN	NaN	NaN	NaN	NaN	NaN	NaN
4.0027	NaN	NaN	NaN	NaN	NaN	NaN	NaN	NaN	NaN	NaN	NaN	NaN	NaN	NaN	NaN	NaN	NaN	NaN	NaN	NaN	NaN	NaN	NaN	NaN	NaN	NaN	NaN	NaN	NaN	NaN	NaN
