x	Y_20180130_15109_1_2g	Y_20180130_15109_10_13g	Y_20180130_15109_10_1g	Y_20180130_15109_2_15g	Y_20180130_15109_3_3g	Y_20180130_15109_4_4g	Y_20180130_15109_5_2g	Y_20180130_15109_5_6g	Y_20180130_15109_5_8g	Y_20180130_15109_6_11g	Y_20180130_15109_6_16g	Y_20180130_15109_6_2g	Y_20180130_15109_7_6g
0	36992.191	34657.68	38195.766	35745.781	29985.975	38091.988	33241.281	37877.203	32848.594	33565.719	43783.801	37238.492	37361.398
0.1334	35703.188	36051.316	36412.488	36607.379	29224.492	40487.895	34405.812	38235.234	32229.305	33646.938	42377.789	37905	38701.555
0.2668	34022.32	35628.164	37931.266	35977.582	29856.459	39554.973	34664.586	36563.398	32871.395	32132.039	41935.5	38113.348	38066.867
0.4003	35088.242	35587.141	36891.246	36996.746	30307.812	38268.246	36252.688	36958.367	33815.984	33435.398	43013.672	38864.316	39615.387
0.5337	37051.676	34602.098	36801.406	38258.32	29860.295	40485.418	36360.254	37946.609	31612.809	34192.105	44519.367	38896.301	38762.176
0.6671	36544.977	36284.477	36645.793	38324.168	29889.256	39825.887	36976.133	37873.309	31794.01	33563.336	44620.844	38216.863	40418.387
0.8005	35123.359	37538.496	37067.133	37119.445	30501.199	40230.668	36809.93	38256.516	32892.16	32342.301	44937.516	39992.422	39967.977
0.934	35865.531	36095.605	38537.871	37750.547	28293.178	38561.832	36282.91	37852.688	33091.098	32970.191	42272.887	40077.395	34975.152
1.0674	35433.648	36249.031	37795.879	38567.047	29245.572	36782.809	36749.809	35281.871	32782.648	32043.412	43586.688	38676.551	36117.008
1.2008	34537.359	35758.695	38283.758	39948.051	28417.611	38950.648	34929.223	36778.805	32900.512	34208.809	44886.07	37425.82	36795.426
1.3342	35745.352	36118.141	38058.473	39866.73	29322.066	39684.906	36035.426	36742.562	33430.098	33269.238	42732.703	39313.434	37924.391
1.4676	39307.848	35367.953	38296.184	41218.008	28799.133	37684.539	35876.391	37658.688	32721.699	34200.512	42331.852	39662.102	37414.328
1.6011	42551.695	36104.172	38225.395	42084.879	28312.039	38320.387	35346.977	35641.574	32303.408	32720.584	41875.297	40062.727	37976.043
1.7345	43202.332	38138.074	39794.105	41408.121	29689.109	38473.18	35466.906	35892.309	32875.578	33309.742	41536.363	38419.242	37045.211
1.8679	41121.852	37990.934	40197.848	39873.762	29057.75	38142.969	37253.594	36799.285	35148.156	34356.969	41689.75	37515.078	36431.531
2.0013	38080.262	36294.543	39279.426	38892.363	30265.082	37859.477	38663.312	39511.008	35179.156	33318.836	42692.457	37596.184	36989.879
2.1348	37737.695	36644.68	44419.859	38543.832	30294.52	39414.664	41514.633	40411.953	35110.891	34101.086	41707.043	38198.777	38444.332
2.2682	37350.992	39305.977	47239.652	40074.438	31529.604	41142.477	47785.492	41467.586	34491.871	35301.727	40744.559	38701.086	40404.988
2.4016	41233.477	42264.797	59752.926	45688.891	34043.684	41467.652	72040.625	51011.309	35426.566	37802.711	43389.301	41613.734	45739.406
2.535	49089.75	58379.375	90000.766	56916.344	38406.852	45791.781	123260.898	67850.094	35662.75	42429.57	48657.328	44931.004	53915.25
2.6684	65189.191	86600.156	113012.133	82204.969	51659.367	50091.508	184477	104334.281	38622.363	49556.09	54779.254	51977.781	80017.984
2.8019	101853.086	99971.391	99384.977	118040.492	69502.828	69182.141	177874.125	134295.641	42253.277	71811.961	73701.969	78544.656	123518.508
2.9353	136662.469	80804.883	65192.098	122686.273	63373.867	115950.227	112666.32	124296.273	54812.973	93695.312	119112.492	119261.641	143842.344
3.0687	130395.523	54822.094	48527.312	87724.516	44880.957	180045.234	65233.645	84812.688	81626.383	87399.242	137392.469	126242.109	100138.852
3.2021	90663.086	42536.391	43521.461	61585.152	36994.094	202533.047	NaN	57689.059	96211.992	72456.047	100765.562	87315.453	63580.82
3.3356	56197.809	NaN	NaN	NaN	31423.721	159916.703	NaN	48234.902	74953.891	68944.109	61398.371	57834.496	49077.27
3.469	42914.625	NaN	NaN	NaN	NaN	92808.148	NaN	44676.887	52521.305	NaN	49005.992	NaN	NaN
3.6024	NaN	NaN	NaN	NaN	NaN	61529.379	NaN	NaN	NaN	NaN	44538.023	NaN	NaN
3.7358	NaN	NaN	NaN	NaN	NaN	49839.344	NaN	NaN	NaN	NaN	41050.094	NaN	NaN
3.8692	NaN	NaN	NaN	NaN	NaN	46097.664	NaN	NaN	NaN	NaN	NaN	NaN	NaN
4.0027	NaN	NaN	NaN	NaN	NaN	NaN	NaN	NaN	NaN	NaN	NaN	NaN	NaN
4.1361	NaN	NaN	NaN	NaN	NaN	NaN	NaN	NaN	NaN	NaN	NaN	NaN	NaN
4.2695	NaN	NaN	NaN	NaN	NaN	NaN	NaN	NaN	NaN	NaN	NaN	NaN	NaN
4.4029	NaN	NaN	NaN	NaN	NaN	NaN	NaN	NaN	NaN	NaN	NaN	NaN	NaN
4.5363	NaN	NaN	NaN	NaN	NaN	NaN	NaN	NaN	NaN	NaN	NaN	NaN	NaN
