X,Y
0.00000,35094.738
0.13342,34764.961
0.26684,36312.109
0.40027,37194.430
0.53369,39524.633
0.66711,44477.613
0.80053,56939.047
0.93395,81599.859
1.06737,96307.688
1.20080,75546.625
1.33422,52055.586
