X,Y
0.00000,11123.896
0.13342,11979.282
0.26684,14282.250
0.40027,15823.915
0.53369,15735.852
0.66711,15266.833
0.80053,14635.777
0.93395,13793.912
1.06737,14261.822
1.20080,13867.687
1.33422,13057.348
1.46764,12217.695
1.60106,11990.349
1.73448,11198.464
1.86791,11109.637
