x	Y_20180514_15338_c1_1_12g	Y_20180514_15338_c1_1_14g	Y_20180514_15338_c1_10_1g	Y_20180514_15338_c1_12_3g	Y_20180514_15338_c1_13_3g	Y_20180514_15338_c1_14_11g	Y_20180514_15338_c1_14_5g	Y_20180514_15338_c1_14_6g	Y_20180514_15338_c1_14_9g	Y_20180514_15338_c1_15_6g	Y_20180514_15338_c1_16_4g	Y_20180514_15338_c1_18_8g	Y_20180514_15338_c1_19_19g	Y_20180514_15338_c1_2_3g	Y_20180514_15338_c1_20_6g	Y_20180514_15338_c1_8_1g	Y_20180514_15338_c1_8_7g	Y_20180514_15338_c1_8_8g	Y_20180514_15338_c1_9_10g	Y_20180514_15338_c1_9_2g	Y_20180514_15338_c1_9_3g	Y_20180514_15338_c1_9_6g
0	14090.627	11895.7324	14851.5986	12493.7754	13477.2451	12172.1123	13998.5283	14121.0098	12768.1562	11469.5879	13751.459	15576.7852	11536.6396	14454.3154	18266.9902	13122.1836	14506.7002	11125.5996	13648.1523	15100.2998	13863.0596	14330.0576
0.1334	13218.582	12953.8584	14181.3242	12416.3408	13127.7979	11636.877	14338.5693	13553.583	12681.1953	11624.3096	15096.2188	16348.4805	12016.0654	13870.0732	19305.6543	13373.2041	15681.5889	12463.5352	14335.0654	15205.5234	14186.3975	15876.9482
0.2668	13525.6797	14463.2734	13807.0137	12161.8838	12292.9951	11859.4531	13891.5996	12968.3936	12675.0137	12650.3516	18178.5703	16708.4082	12333.6416	13941.2852	24052.7246	13983.71	15025.5166	12026.3037	14206.3545	15353.9658	14231.0596	15541.5273
0.4003	14699.0781	14912.3965	13707.0771	13464.7139	13463.4258	12751.6387	15062.6865	13400.8662	13891.1191	15257.0322	22049.2129	17309.8613	12541.6299	13812.2363	32572.4766	14645.3809	15057.9209	11074.5771	15153.1719	15102.584	17179.8008	15296.3848
0.5337	18459.7246	17659.4141	12796.3066	14489.6416	15441.5879	13493.5791	17552.1621	13543.752	18705.8477	19200.918	24564.4492	19316.5762	13190.7393	14584.8535	36596.082	15651.2197	15700.1133	12535.1758	16209.5283	16497.959	20580.2656	15165.5693
0.6671	21541.7773	19124.9336	14201.4287	16147.415	19221.3301	17056.2617	24765.7129	15043.3145	22248.7031	23328.9551	25614.9688	19653.8184	15242.2568	14911.6514	34120.8477	17356.9844	18036.6543	14475.7236	14977.2354	19050.7129	25302.8867	16872.1523
0.8005	22003.332	19452.666	14688.6455	19158.7188	22674.2246	19259.3027	27139.5156	19322.0664	20776.0195	24758.8223	25779.3555	19013.9277	18743.7891	16062.4189	29690.6172	18069.0918	21963.1406	16207.1973	14294.3408	22581.6172	25179.043	19121.6641
0.934	22183.0938	18754.1973	15772.9131	22748.1328	22659.8926	18163.3809	24047.2051	26549.8145	16643.1797	22787.1953	22200.5781	16359.9912	22678.4355	14590.835	23022.4512	16716.3984	21740.2871	17555.625	13869.3711	23233.5879	22074.8477	21067.1797
1.0674	21545.8105	18758.0996	18480.0723	21640.6797	22522.4297	17019.1699	22811.0703	29938.5957	15412.9287	22674.668	21382.373	15895.9463	23427.3477	13568.7422	19881.5508	15535.2666	18435.916	15851.9824	14355.3711	20354.8223	17745.8086	21312.3555
1.2008	20985.6758	18942.4023	21044.4355	19561.3418	20411.459	15899.7695	24366.6094	26499.752	16085.0215	20374.5273	20851.4629	15549.0156	21642.916	13256.1123	18191.1738	15649.8008	19107.1152	14444.3008	15148.5566	19029.3359	16218.3174	18746.4355
1.3342	22202.8691	18803.3145	22099.291	18433.6328	18482.1387	15728.6533	26469.5137	24845.8223	17668.502	18264.7305	18778.6055	17150.3125	20732.3281	13553.2314	18085.6641	15249.9473	19256.1113	15110.332	16202.7285	19217.9883	14913.4258	18027.916
1.4676	21995.2715	18326.1816	20044.1816	16493.9629	16218.4746	15623.2129	24157.5801	23996.043	21443.4727	16514.5605	18379.2637	19059.1641	17948.9141	13819.0312	16059.2119	15131.292	20669.4375	14610.7676	14790.6787	19066.4609	13911.3232	16471.666
1.6011	18778.2285	18019.6992	20362.8379	15120.9883	15214.708	14999.5801	21592.8965	22476.5254	22843.1152	15636.4531	15542.0283	18896.2168	15882.4863	14504.5752	15335.9893	15305.4072	20088.8867	13073.084	13416.123	18004.6016	12985.1201	16934.1094
1.7345	16771.459	17700.8809	20715.4824	13186.1621	15046.9883	14577.4971	19551.5469	21667.2129	22055.2363	15123.2979	13683.3047	17555.0312	14571.0381	14399.9316	13683.5869	16189.4912	19798.8223	12618.3672	12828.3809	17251.5664	12637.4365	16808.0078
1.8679	15554.1504	17404.8105	18199.2246	12456.4814	14486.4492	14072.5322	17143.8633	19536.6738	18896.2051	14105.2676	13288.0361	15668.627	13624.001	13657.7168	NaN	14966.0381	16257.0098	12181.3818	12993.3125	15734.9111	12365.6191	17602.2812
2.0013	14326.2969	15720.6387	17225.4766	12607.0156	14999.4336	14581.9248	14782.4443	16599.4688	16017.6143	13634.0518	12696.9678	14848.7393	12577.499	13756.3486	NaN	14862.1104	14852.1318	12106.5596	12326.9229	14020.6797	11958.7852	17726.6367
2.1347	13934.8594	13976.4004	15426.3838	12251.1934	15340.624	14927.209	13575.4746	16193.5703	14764.0254	12397.7266	13593.2705	15691.6074	12356.5156	12804.6846	NaN	14840.1162	13207.0068	NaN	12298.5283	13862.3877	NaN	15245.2334
2.2682	13223.7373	12594.2861	14335.4668	11958.5234	NaN	13460.4258	14339.9053	15840.168	13951.7656	NaN	14456.623	14311.4424	12192.96	NaN	NaN	16627.7891	13074.5547	NaN	12057.6602	13022.6367	NaN	14421.1855
2.4016	NaN	NaN	14166.6172	NaN	NaN	NaN	16012.4688	15569.0283	NaN	NaN	14512.8496	NaN	12107.9443	NaN	NaN	15932.3721	12387.0166	NaN	12718.5293	13116.4189	NaN	13264.2529
2.535	NaN	NaN	12926.1094	NaN	NaN	NaN	NaN	15917.5117	NaN	NaN	13183.1016	NaN	NaN	NaN	NaN	14916.9951	13451.168	NaN	NaN	NaN	NaN	12746.2715
2.6684	NaN	NaN	13831.3301	NaN	NaN	NaN	NaN	16046.627	NaN	NaN	NaN	NaN	NaN	NaN	NaN	NaN	NaN	NaN	NaN	NaN	NaN	13428.0381
2.8019	NaN	NaN	13032.0762	NaN	NaN	NaN	NaN	NaN	NaN	NaN	NaN	NaN	NaN	NaN	NaN	NaN	NaN	NaN	NaN	NaN	NaN	13437.3271
2.9353	NaN	NaN	NaN	NaN	NaN	NaN	NaN	NaN	NaN	NaN	NaN	NaN	NaN	NaN	NaN	NaN	NaN	NaN	NaN	NaN	NaN	NaN
3.0687	NaN	NaN	NaN	NaN	NaN	NaN	NaN	NaN	NaN	NaN	NaN	NaN	NaN	NaN	NaN	NaN	NaN	NaN	NaN	NaN	NaN	NaN
3.2021	NaN	NaN	NaN	NaN	NaN	NaN	NaN	NaN	NaN	NaN	NaN	NaN	NaN	NaN	NaN	NaN	NaN	NaN	NaN	NaN	NaN	NaN
3.3355	NaN	NaN	NaN	NaN	NaN	NaN	NaN	NaN	NaN	NaN	NaN	NaN	NaN	NaN	NaN	NaN	NaN	NaN	NaN	NaN	NaN	NaN
3.469	NaN	NaN	NaN	NaN	NaN	NaN	NaN	NaN	NaN	NaN	NaN	NaN	NaN	NaN	NaN	NaN	NaN	NaN	NaN	NaN	NaN	NaN
3.6024	NaN	NaN	NaN	NaN	NaN	NaN	NaN	NaN	NaN	NaN	NaN	NaN	NaN	NaN	NaN	NaN	NaN	NaN	NaN	NaN	NaN	NaN
3.7358	NaN	NaN	NaN	NaN	NaN	NaN	NaN	NaN	NaN	NaN	NaN	NaN	NaN	NaN	NaN	NaN	NaN	NaN	NaN	NaN	NaN	NaN
3.8692	NaN	NaN	NaN	NaN	NaN	NaN	NaN	NaN	NaN	NaN	NaN	NaN	NaN	NaN	NaN	NaN	NaN	NaN	NaN	NaN	NaN	NaN
4.0027	NaN	NaN	NaN	NaN	NaN	NaN	NaN	NaN	NaN	NaN	NaN	NaN	NaN	NaN	NaN	NaN	NaN	NaN	NaN	NaN	NaN	NaN
4.1361	NaN	NaN	NaN	NaN	NaN	NaN	NaN	NaN	NaN	NaN	NaN	NaN	NaN	NaN	NaN	NaN	NaN	NaN	NaN	NaN	NaN	NaN
4.2695	NaN	NaN	NaN	NaN	NaN	NaN	NaN	NaN	NaN	NaN	NaN	NaN	NaN	NaN	NaN	NaN	NaN	NaN	NaN	NaN	NaN	NaN
4.4029	NaN	NaN	NaN	NaN	NaN	NaN	NaN	NaN	NaN	NaN	NaN	NaN	NaN	NaN	NaN	NaN	NaN	NaN	NaN	NaN	NaN	NaN
4.5363	NaN	NaN	NaN	NaN	NaN	NaN	NaN	NaN	NaN	NaN	NaN	NaN	NaN	NaN	NaN	NaN	NaN	NaN	NaN	NaN	NaN	NaN
4.6698	NaN	NaN	NaN	NaN	NaN	NaN	NaN	NaN	NaN	NaN	NaN	NaN	NaN	NaN	NaN	NaN	NaN	NaN	NaN	NaN	NaN	NaN
4.8032	NaN	NaN	NaN	NaN	NaN	NaN	NaN	NaN	NaN	NaN	NaN	NaN	NaN	NaN	NaN	NaN	NaN	NaN	NaN	NaN	NaN	NaN
4.9366	NaN	NaN	NaN	NaN	NaN	NaN	NaN	NaN	NaN	NaN	NaN	NaN	NaN	NaN	NaN	NaN	NaN	NaN	NaN	NaN	NaN	NaN
5.07	NaN	NaN	NaN	NaN	NaN	NaN	NaN	NaN	NaN	NaN	NaN	NaN	NaN	NaN	NaN	NaN	NaN	NaN	NaN	NaN	NaN	NaN
5.2035	NaN	NaN	NaN	NaN	NaN	NaN	NaN	NaN	NaN	NaN	NaN	NaN	NaN	NaN	NaN	NaN	NaN	NaN	NaN	NaN	NaN	NaN
5.3369	NaN	NaN	NaN	NaN	NaN	NaN	NaN	NaN	NaN	NaN	NaN	NaN	NaN	NaN	NaN	NaN	NaN	NaN	NaN	NaN	NaN	NaN
5.4703	NaN	NaN	NaN	NaN	NaN	NaN	NaN	NaN	NaN	NaN	NaN	NaN	NaN	NaN	NaN	NaN	NaN	NaN	NaN	NaN	NaN	NaN
5.6037	NaN	NaN	NaN	NaN	NaN	NaN	NaN	NaN	NaN	NaN	NaN	NaN	NaN	NaN	NaN	NaN	NaN	NaN	NaN	NaN	NaN	NaN
5.7371	NaN	NaN	NaN	NaN	NaN	NaN	NaN	NaN	NaN	NaN	NaN	NaN	NaN	NaN	NaN	NaN	NaN	NaN	NaN	NaN	NaN	NaN
5.8706	NaN	NaN	NaN	NaN	NaN	NaN	NaN	NaN	NaN	NaN	NaN	NaN	NaN	NaN	NaN	NaN	NaN	NaN	NaN	NaN	NaN	NaN
