X,Y
0.00000,34820.879
0.13342,36627.816
0.26684,36240.324
0.40027,35604.793
0.53369,36442.137
0.66711,36949.906
0.80053,34675.086
0.93395,35982.105
1.06737,36047.426
1.20080,36151.219
1.33422,34983.816
1.46764,34484.613
1.60106,35971.078
1.73448,36781.980
1.86791,39460.285
2.00133,42621.902
2.13475,51849.871
2.26817,74950.070
2.40159,98450.570
2.53502,87388.789
2.66844,56858.340
2.80186,42925.871
2.93528,38797.629
3.06870,36747.473
