0.0000	32443.3574
0.1334	30879.9805
0.2668	31478.3770
0.4003	33061.7461
0.5337	32611.1289
0.6671	32598.1602
0.8005	33287.8906
0.9340	35045.8867
1.0674	36739.8203
1.2008	39606.3203
1.3342	42961.9375
1.4676	56423.9297
1.6011	77973.4219
1.7345	95233.6875
1.8679	77550.4453
2.0013	51059.3398
2.1347	37444.6523
2.2682	36568.4492
2.4016	34756.6875
2.5350	34225.1523
