X,Y
0.00000,43829.742
0.13342,42799.215
0.26684,43444.117
0.40027,42265.270
0.53369,40864.652
0.66711,40064.203
0.80053,43425.406
0.93395,47170.688
1.06737,51342.707
1.20080,53492.309
1.33422,51036.734
1.46764,49843.762
1.60106,52359.473
