X,Y
0.00000,33713.281
0.13342,33755.500
0.26684,31467.891
0.40027,31793.750
0.53369,31427.576
0.66711,31161.609
0.80053,31778.480
0.93395,31262.805
1.06737,30956.744
1.20080,32534.920
1.33422,32483.789
1.46764,33578.426
1.60106,38361.332
1.73448,44582.246
1.86791,66678.484
2.00133,106723.281
2.13475,112711.453
2.26817,78928.203
2.40159,53275.641
