0.0000	14164.4756
0.1334	13764.7812
0.2668	13999.3555
0.4003	13988.7939
0.5337	14125.8604
0.6671	17789.4121
0.8005	21399.8418
0.9340	23602.6367
1.0674	22427.4863
1.2008	20094.2695
1.3342	19146.5723
1.4676	17836.5918
1.6011	18757.4102
1.7345	19581.8984
1.8679	21617.2969
2.0013	23005.2461
2.1347	21808.7891
2.2682	18603.4258
2.4016	16338.6895
2.5350	14297.5195
2.6684	13686.8154
2.8019	13529.0566
2.9353	13241.0957
3.0687	13611.5820
3.2021	12538.3867
