0.0000	10539.0186
0.1334	11448.5381
0.2668	13101.1133
0.4003	15472.7295
0.5337	18477.4453
0.6671	17919.7305
0.8005	16535.0000
0.9340	13996.6377
1.0674	13489.3838
1.2008	13324.0049
1.3342	13521.8652
1.4676	14054.3555
1.6011	13943.2773
1.7345	14171.1699
1.8679	14221.0459
2.0013	14260.2666
2.1347	14018.0195
2.2682	13554.1006
2.4016	14169.2002
2.5350	14802.9375
2.6684	14516.1143
2.8019	13659.6133
2.9353	12618.1953
3.0687	12359.0078
3.2021	12966.6650
3.3355	12271.2207
3.4690	12065.6377
3.6024	12319.3135
