0.0000	34517.4805
0.1334	34878.9922
0.2668	37015.9453
0.4003	34080.3203
0.5337	33815.3633
0.6671	32444.1816
0.8005	32664.8672
0.9340	34022.6719
1.0674	34821.7617
1.2008	34759.6914
1.3342	37082.6875
1.4676	50361.2266
1.6011	76582.2656
1.7345	109182.3828
1.8679	94956.0859
2.0013	59421.4805
2.1347	44209.1992
2.2682	39298.9219
2.4016	39143.1875
