0.00000,38903.684
0.13342,37132.500
0.26684,37528.512
0.40027,36673.203
0.53369,36456.652
0.66711,39216.355
0.80053,39622.586
0.93395,41341.043
1.06737,45028.953
1.20080,54800.219
1.33422,77065.914
1.46764,103663.688
1.60106,92971.297
1.73448,64681.113
1.86791,47386.930
