0.00000,35362.195
0.13342,35978.238
0.26684,37806.777
0.40027,35706.773
0.53369,34883.598
0.66711,35470.109
0.80053,37189.551
0.93395,41699.992
1.06737,47619.121
1.20080,69084.695
1.33422,100107.062
1.46764,101412.461
1.60106,78612.602
1.73448,55026.098
1.86791,46167.434
