x	Y_20180514_15100_11_2g	Y_20180514_15100_16_3g	Y_20180514_15100_28_6g	Y_20180514_15100_3_5g	Y_20180514_15100_5_4g
0	12506.021	13018.277	11435.643	10922.396	12960.181
0.1334	13428.859	13452.87	11450.377	11118.017	13719.767
0.2668	13598.729	13195.839	12067.596	11275.438	14364.283
0.4003	14072.674	13552.058	12720.67	12242.274	14848.981
0.5337	14531.921	14417.559	12741.155	11612.986	15793.23
0.6671	17316.705	16135.621	13247.155	13087.275	16716.869
0.8005	18913.729	17314.953	15609.605	15168.544	18071.496
0.934	18773.754	17518.445	20430.162	18757.863	19061.717
1.0674	17209.865	18444.971	20617.227	21047.475	18553.398
1.2008	17022.184	17059.469	18166.801	21715.471	18755.906
1.3342	17838.9	17164.781	16924.846	20297.869	19412.59
1.4676	18256.24	17290.26	16366.058	20056.697	18518.297
1.6011	17928.812	17017.498	15249.503	18101.898	17368.6
1.7345	18001.709	16757.262	16387.197	16372.881	16975.244
1.8679	17143.518	15174.846	16878.221	17294.336	17449.27
2.0013	14934.528	14305.568	16671.236	17700.156	16243.076
2.1348	14395.41	13968.058	15646.654	16222.98	14558.153
2.2682	14181.64	13232.764	14847.256	15359.227	13400.376
2.4016	13033.18	12259.459	14500.488	15608.05	13166.832
2.535	13136.046	12284.523	14197.729	15528.782	NaN
2.6684	12673.844	12567.122	13485.712	14470.145	NaN
2.8019	NaN	12763.514	NaN	15341.628	NaN
2.9353	NaN	NaN	NaN	NaN	NaN
3.0687	NaN	NaN	NaN	NaN	NaN
3.2021	NaN	NaN	NaN	NaN	NaN
3.3356	NaN	NaN	NaN	NaN	NaN
3.469	NaN	NaN	NaN	NaN	NaN
3.6024	NaN	NaN	NaN	NaN	NaN
3.7358	NaN	NaN	NaN	NaN	NaN
3.8692	NaN	NaN	NaN	NaN	NaN
4.0027	NaN	NaN	NaN	NaN	NaN
4.1361	NaN	NaN	NaN	NaN	NaN
4.2695	NaN	NaN	NaN	NaN	NaN
4.4029	NaN	NaN	NaN	NaN	NaN
4.5363	NaN	NaN	NaN	NaN	NaN
4.6698	NaN	NaN	NaN	NaN	NaN
4.8032	NaN	NaN	NaN	NaN	NaN
4.9366	NaN	NaN	NaN	NaN	NaN
5.07	NaN	NaN	NaN	NaN	NaN
5.2035	NaN	NaN	NaN	NaN	NaN
5.3369	NaN	NaN	NaN	NaN	NaN
5.4703	NaN	NaN	NaN	NaN	NaN
5.6037	NaN	NaN	NaN	NaN	NaN
