0.00000,11938.861
0.13342,12264.053
0.26684,14181.844
0.40027,15480.534
0.53369,17359.490
0.66711,17432.650
0.80053,17349.436
0.93395,17762.723
1.06737,17084.332
1.20080,15155.364
1.33422,14150.997
1.46764,14098.894
1.60106,14660.205
