X,Y
0.00000,37751.699
0.13342,40503.434
0.26684,40954.621
0.40027,40479.754
0.53369,39842.086
0.66711,38360.738
0.80053,40077.953
0.93395,39637.625
1.06737,40682.105
1.20080,40992.395
1.33422,45637.777
1.46764,53193.879
1.60106,72593.617
1.73448,111099.102
1.86791,143430.562
2.00133,122323.867
2.13475,76696.766
2.26817,54757.984
2.40159,45457.484
