0.00000,11374.041
0.13342,12051.506
0.26684,13612.768
0.40027,15804.716
0.53369,18772.477
0.66711,20039.658
0.80053,18712.205
0.93395,18819.215
1.06737,19119.535
1.20080,19364.477
1.33422,18062.883
1.46764,17664.010
1.60106,17169.260
1.73448,18016.457
1.86791,17126.928
2.00133,17112.895
2.13475,18916.613
2.26817,19390.428
2.40159,19565.785
2.53502,17453.148
2.66844,15272.906
2.80186,13527.170
2.93528,13213.821
3.06870,12745.425
3.20212,12657.033
