x	Y_20180514_15338_c1_9_11g
0	9642.9287
0.1334	10753.3867
0.2668	11275.0781
0.4003	12434.3984
0.5337	14430.5498
0.6671	15545.0801
0.8005	16468.7559
0.934	16990.248
1.0674	15643.8691
1.2008	14471.4814
1.3342	14079.8525
1.4676	13987.415
1.6011	13148.8447
1.7345	14745.8301
1.8679	15581.8174
2.0013	13988.0049
2.1347	13098.3389
2.2682	12424.1367
2.4016	12596.8516
2.535	12207.2451
2.6684	12792.918
2.8019	13717.7422
2.9353	14277.9482
3.0687	14256.8428
3.2021	15934.625
3.3355	17278.6914
3.469	17910.375
3.6024	19099.6367
3.7358	18725.2188
3.8692	18954.8301
4.0027	18788.8613
4.1361	16705.2129
4.2695	14862.6836
4.4029	13086.4385
4.5363	12559.998
4.6698	12455.3438
4.8032	12818.2871
4.9366	12706.9033
5.07	NaN
5.2035	NaN
5.3369	NaN
5.4703	NaN
5.6037	NaN
5.7371	NaN
5.8706	NaN
