x	Y_20180130_15109_1_5g_left	Y_20180130_15109_12_12g	Y_20180130_15109_12_8g	Y_20180130_15109_13_1g	Y_20180130_15109_14_10g_left	Y_20180130_15109_15_11g	Y_20180130_15109_15_13g	Y_20180130_15109_16_2g_left	Y_20180130_15109_17_11_1g	Y_20180130_15109_17_12g_left	Y_20180130_15109_17_13g_left	Y_20180130_15109_18_5g	Y_20180130_15109_18_8g	Y_20180130_15109_20_3g	Y_20180130_15109_20_5g	Y_20180130_15109_21_10g	Y_20180130_15109_21_11g	Y_20180130_15109_22_2g	Y_20180130_15109_23_3g	Y_20180130_15109_25_2g	Y_20180130_15109_25_8g	Y_20180130_15109_25_9g	Y_20180130_15109_28_3g	Y_20180130_15109_29_2g	Y_20180130_15109_29_6g	Y_20180130_15109_31_1g	Y_20180130_15109_31_7g	Y_20180130_15109_34_5g	Y_20180130_15109_35_4g	Y_20180130_15109_39_3g	Y_20180130_15109_41_2g	Y_20180130_15109_41_7g	Y_20180130_15109_5_1g_left	Y_20180130_15109_7_6g_left	Y_20180130_15109_7_7g_left	Y_20180130_15109_42_1g	Y_20180130_15109_42_2g	Y_20180130_15109_42_6g	Y_20180130_15109_43_5g	Y_20180130_15109_1_2g_right	Y_20180130_15109_10_13g	Y_20180130_15109_10_1g_right	Y_20180130_15109_2_15g	Y_20180130_15109_3_3g_right	Y_20180130_15109_4_4g_right	Y_20180130_15109_5_2g_right	Y_20180130_15109_5_6g_right	Y_20180130_15109_5_8g	Y_20180130_15109_6_11g	Y_20180130_15109_6_16g	Y_20180130_15109_6_2g_right	Y_20180130_15109_7_6g_right	Y_20180130_15109_14_15g	Y_20180130_15109_14_16g	Y_20180130_15109_14_6g_right	Y_20180130_15109_14_7g_right	Y_20180130_15109_14_8g_right	Y_20180130_15109_15_2g_right	Y_20180130_15109_15_4g_right	Y_20180130_15109_16_3g_right	Y_20180130_15109_17_10g_right	Y_20180130_15109_17_19g	Y_20180130_15109_17_3g_right
0	39279.277	35108.836	37791.734	34919.543	36401.461	34282.863	35730.82	38257.602	31779.477	34088.68	34785.113	34965.637	37431.652	35981.754	36990.5	34591.566	33855.219	32423.152	37310.145	36745.328	33937.512	37677.129	33588.301	38081.41	39559.734	38859.562	36248.504	36815.336	32939.285	34056.492	38106.723	38629.941	37671.695	37113.719	32981.895	32699.1976222222	30484.1158333333	34931.0887185185	34155.7639740741	36992.191	34657.68	38195.766	35745.781	29985.975	38091.988	33241.281	37877.203	32848.594	33565.719	43783.801	37238.492	37361.398	16978.211662963	17210.745337037	18382.2152740741	19156.2250814815	18575.2209333333	17893.3192518518	17216.7085851852	17559.4572592593	16926.5382851852	17411.5398703704	16833.4365740741
0.1334	38753.977	36424.051	36422.969	34989.438	38030.18	34380.816	35851.461	37413.102	31967.195	35990.336	35299.984	33705.195	37223.285	36002.48	35901.363	37616.766	33417.855	30217.211	38910.848	36663.703	32443.355	38156.48	34918.84	38324.785	38005.945	40308.613	37290.766	35981.969	34242.211	36520.984	37239.707	35819.688	37588.73	38326.953	34494.582	31304.0720074074	29574.0404407407	35168.1786407407	35355.0178185185	35703.188	36051.316	36412.488	36607.379	29224.492	40487.895	34405.812	38235.234	32229.305	33646.938	42377.789	37905	38701.555	17254.0201407407	17598.2661407407	18631.8448666667	19339.0829703704	20411.2239185185	18763.8631555556	17512.8699259259	17747.2465962963	16719.8204555556	16331.9140296296	18824.8314185185
0.2668	38063.121	35280.215	35787.035	37818.645	37390.148	32679.752	35907.137	38244.738	32828.336	35609.227	36681.672	33398.031	39224.125	37650.078	35742.941	34334.391	34017.391	29761.602	38911.547	37134.594	33698.348	38897.707	35127.441	39314.824	39659.727	38572.414	36503.047	35989.254	33610.625	36059.211	36006.91	35011.98	37307.074	37083.641	33599.727	32224.1405740741	31718.2163777778	32999.673762963	34246.1906481481	34022.32	35628.164	37931.266	35977.582	29856.459	39554.973	34664.586	36563.398	32871.395	32132.039	41935.5	38113.348	38066.867	16698.2342962963	18297.9898222222	18339.0759592593	18495.9095592593	19324.3007851852	18707.6283185185	17642.7256037037	17995.5786222222	16194.3615407407	15751.3476148148	18082.5833333333
0.4003	37992.789	35269.789	35333.066	35702.719	36497.348	34912.145	36222.449	38401.043	32087.271	35483.16	36765.762	33160.363	37320.984	36851.707	36341.047	36824.277	33370.715	31287.809	38884.555	37990.941	34148.074	39999.277	34465.328	38599.09	39185.102	38701.742	37056.797	37217.238	33097.789	36047.328	36894.668	38337.379	36620.824	39544.578	34386.793	33731.1800111111	29980.720762963	34195.5195407407	35111.2385666667	35088.242	35587.141	36891.246	36996.746	30307.812	38268.246	36252.688	36958.367	33815.984	33435.398	43013.672	38864.316	39615.387	18078.6437333333	18007.998437037	18304.8163777778	16944.7563296296	19265.9728185185	18229.3369074074	16989.0473	17461.844462963	15857.8992037037	16750.8144074074	16933.2137185185
0.5337	39465.43	36562.164	36946.523	37579.984	36641.656	33748.336	36724.645	37270.086	32382.654	35621.828	35051.406	34237.922	39009.031	38667.328	37354.324	36166.172	33185.402	31870.488	38159.133	37393.961	34777.883	39881.363	35345.578	40274.109	38318.02	38870.156	37459.148	37842.785	31689.229	38287.246	37036.344	37436.48	35684.156	39533.602	34688.723	34090.7327814815	30628.9638777778	34414.8882111111	34259.7308518518	37051.676	34602.098	36801.406	38258.32	29860.295	40485.418	36360.254	37946.609	31612.809	34192.105	44519.367	38896.301	38762.176	18421.6668592593	18713.8608074074	19324.9434888889	17647.1741555556	18924.3011074074	18428.0053074074	17915.7965111111	17973.4209777778	16259.3215148148	16270.0268740741	17404.8540148148
0.6671	39026.914	37488.426	36993.191	36186.746	36023.23	33741.863	36126.059	36660.52	32702.186	37761.57	36050.367	35186.039	38943.699	36771.434	35742.422	35281.301	33644.852	30214.082	37820.035	36628.48	36369.598	39669.191	34759.965	39344.406	40577.043	37902.871	37776.203	38198.789	32485.828	36050.449	37783.914	36825.551	34434.41	39086.535	34092.789	34495.1480074074	29560.9379703704	33666.5466	33702.2913481481	36544.977	36284.477	36645.793	38324.168	29889.256	39825.887	36976.133	37873.309	31794.01	33563.336	44620.844	38216.863	40418.387	17645.270362963	17663.5735222222	19349.6806333333	18763.5296444444	18726.4334814815	19283.4595703704	17555.3265851852	18610.8857777778	15822.9395962963	16185.9786	18898.8100888889
0.8005	38349.406	37433.02	36810.75	36138.848	37036.926	33424.555	37339.426	35301.969	33002.242	36543.074	37437.172	34908.164	38408.324	37545.168	36188.367	34769.684	33625.023	30572.672	38563.66	36719.918	35611.109	38837.266	33491.254	37782.648	40236.395	37131.473	35703.711	36721.801	32766.738	35843.352	38884.227	36277.07	35197.094	38803.562	34275.129	36778.597837037	28264.1043333333	34195.4465851852	34771.5505518518	35123.359	37538.496	37067.133	37119.445	30501.199	40230.668	36809.93	38256.516	32892.16	32342.301	44937.516	39992.422	39967.977	17634.0560518519	18755.3325666667	18246.9400407407	17747.7138592593	18276.6607444444	18285.8010333333	18070.4466555556	18738.9210407407	16894.7939333333	17507.2749296296	19267.310337037
0.934	37890.535	37555.121	37274.266	38504.898	35910.305	32035.176	36727.711	36007.988	34319.238	35189.867	38096.715	35418.207	38193.109	37815.211	36028.188	36276.195	33487.324	31074.148	39759.617	38934.84	35204.297	39083.516	35377.59	39029.25	42023.359	37268.059	35940.805	38083.754	32891.961	36034.188	40311.215	36580.145	33901.762	39638.168	33450.773	34292.0710074074	29958.3390407407	34788.8045407407	32936.8347111111	35865.531	36095.605	38537.871	37750.547	28293.178	38561.832	36282.91	37852.688	33091.098	32970.191	42272.887	40077.395	34975.152	17966.2904407407	19884.1148185185	18832.2815703704	19167.5783555556	20517.5357962963	19341.4418666667	18336.5346740741	17823.9697851852	17661.4195962963	17652.4755925926	18925.5448259259
1.0674	37312.488	35662.844	36398.242	37197.926	37337.02	31088.4	35810.938	35719.719	34564.25	33968.59	37619.902	35163.758	38382.641	36854.504	37529.812	35782.805	34934.992	29561.385	39582.441	37144.895	34541.293	38946.852	33712.5	40157.68	39338.285	38712.223	37082.59	37446.359	34226.727	36754.559	38590.309	35640.117	34645.582	38301.57	33457.043	37223.5711407407	30747.1675111111	34020.549537037	34028.1994481481	35433.648	36249.031	37795.879	38567.047	29245.572	36782.809	36749.809	35281.871	32782.648	32043.412	43586.688	38676.551	36117.008	17148.9294	19525.213437037	18708.2241222222	20806.5110148148	20015.5251444444	19516.3823407407	18115.9066518518	17608.1880962963	16981.5589333333	16851.6633037037	19429.7371962963
1.2008	39612.918	36951.949	37039.773	36833.078	36459.977	32364.986	36471.227	34973.719	33783.344	36657.402	36695.816	35340.738	36222.234	38016.086	38295.078	33321.156	34878.277	30370.891	40199.828	36477.066	36530.055	39809.027	34032.973	37753.148	39374.25	37735.363	36965.293	36993.34	33677.211	34724.062	38487.965	35750.137	35266.23	38682.465	33087.828	35913.9372777778	31037.3273888889	34695.8765333333	34510.3192888889	34537.359	35758.695	38283.758	39948.051	28417.611	38950.648	34929.223	36778.805	32900.512	34208.809	44886.07	37425.82	36795.426	16412.0053333333	18707.2913333333	18137.2148851852	18748.0248518518	19455.3654407407	18529.2519851852	17241.3224	18845.3631962963	16475.4401888889	17663.4588777778	19481.3567259259
1.3342	37425.852	38311.578	36695.574	36902.438	34830.273	32287.717	37539.91	34784.133	32949.398	37783.852	38280.758	36832.82	37865.242	37903.941	37355.156	36174.738	33007.691	31296.303	39492.199	35997.129	34561.383	39889.414	34338.996	36176.625	39200.332	38461.738	36404.152	36823.758	33350.027	35702.906	39476.363	37119.312	36352.043	37392.133	34931.93	32242.7668222222	31911.4235333333	35241.8967555556	36154.827837037	35745.352	36118.141	38058.473	39866.73	29322.066	39684.906	36035.426	36742.562	33430.098	33269.238	42732.703	39313.434	37924.391	15926.2411888889	18701.8491962963	18234.3083074074	19498.8017888889	18573.1052222222	16945.5571037037	19912.0706925926	18387.8085333333	16090.7438074074	17100.9090111111	19645.7603333333
1.4676	36137.312	36975.992	36721.18	36562.301	35187.664	32748.5	37292.18	35804.648	31902.824	37133.07	39094.09	36301.07	38305.742	38724.672	37640.297	34744.789	33886.715	30976.82	39639.367	35802.902	33565.941	39345.348	34470.645	37834.914	39858.227	35915.551	37376.965	37804.922	31268.354	36984.062	38116.512	35876.949	36392.648	37024.121	35145.801	32647.7917481481	31840.5003111111	31510.7794148148	35833.7643333333	39307.848	35367.953	38296.184	41218.008	28799.133	37684.539	35876.391	37658.688	32721.699	34200.512	42331.852	39662.102	37414.328	17668.2808925926	18969.8965925926	19013.8905296296	19770.0071185185	19216.4221	18784.7076	18411.0865666667	17410.8659	17000.9685851852	17504.8639222222	18290.4823481481
1.6011	37716.598	39048.918	36232.102	38007.598	35895.52	32765.443	36880.355	35738.883	32993.816	36649.492	37785.059	37128.273	38916.453	36071.758	37251.762	33506.672	34180.566	30602.322	38193.559	36922.594	36074.949	39836.625	33796.328	37354.473	39850.172	37461.246	35583.785	37101.973	32000.643	35267.832	36926.094	36932.906	37316.773	38303.488	35944.363	33178.2828592593	31112.8885	34491.9171185185	35546.9030888889	42551.695	36104.172	38225.395	42084.879	28312.039	38320.387	35346.977	35641.574	32303.408	32720.584	41875.297	40062.727	37976.043	18161.2259481481	18638.8347037037	20528.7118925926	19339.0534407407	20120.5863555556	18052.5464888889	18464.9399259259	17825.0867	17098.8593074074	17170.9116037037	18851.8475555556
1.7345	38362.762	37827.051	36980.84	37428.258	35566.527	32416.73	36664.078	36069.656	33644.723	35493.141	38370.02	37155.078	40279.656	37312.625	36660.863	33646.336	33193.133	28524.486	39905.18	37510.414	34534.836	39886.949	33675.57	39441.254	42319.191	38122.996	37256.363	36038.254	33871.488	34629.395	35344.32	38766.879	37279.645	37794.477	35220.082	34487.3817148148	30986.8994666667	34952.9788592593	34928.7141888889	43202.332	38138.074	39794.105	41408.121	29689.109	38473.18	35466.906	35892.309	32875.578	33309.742	41536.363	38419.242	37045.211	17824.6437555556	19050.8859444444	20126.0684444444	19544.8593259259	19219.6060888889	17184.6046666667	17783.7799592593	18119.0732703704	16467.5193	18867.1473777778	18948.3555962963
1.8679	38457.172	40297.375	37623.738	36507.613	35585.707	32868.605	37197.668	35556.457	32290.736	37467.973	35289.988	38303.191	38350.57	37433.676	37878.473	35117.227	33460.312	29418.498	38891.379	36720.145	35876.379	39528.465	32607.062	40601.352	39982.809	38566.031	36905.055	37030.211	33022.742	33559.918	35388.676	37370.18	36467.172	37228.184	34507.227	37492.1135925926	31178.8177407407	37359.5255555555	35952.1347222222	41121.852	37990.934	40197.848	39873.762	29057.75	38142.969	37253.594	36799.285	35148.156	34356.969	41689.75	37515.078	36431.531	20823.1223	18806.0905259259	19731.3979962963	19431.3682740741	20087.3950518518	16937.3339703704	18150.0255333333	18773.5731925926	15461.0696185185	18017.7675333333	17369.547
2.0013	38469.664	45881.727	38223.926	36473.25	36793.59	34317.355	38286.375	36393.195	35188.227	37151.738	35881.008	39102	39589.902	38502.117	39524.574	35075.723	34069.246	30972.629	39393.141	36650.129	37863.238	39584.629	34395.359	41972.703	39960.762	37504.582	37886.465	37950.84	32500.977	34792.133	34111.762	36740.652	38710.82	39711.895	36297.191	41201.5075481481	29543.9514851852	38787.4950666667	36117.8689	38080.262	36294.543	39279.426	38892.363	30265.082	37859.477	38663.312	39511.008	35179.156	33318.836	42692.457	37596.184	36989.879	21926.9520148148	16612.9631481481	20046.5416777778	21301.6864259259	19181.4208037037	18416.6051333333	18363.1634518519	18441.3162222222	19297.8839259259	17487.4188592593	17252.8459037037
2.1348	38955.707	53087.996	36369.098	35747.148	37651.152	35199.281	40292.609	37481.488	36837.09	39836.77	37749.039	38133.836	41959.605	41225.836	40062.441	34671.738	35466.039	33109.738	40412.418	38452.652	39140.152	38156.988	35556.957	43145.484	37941.895	37941.016	40049.988	37393.645	31493.529	35112.137	35487.613	38953.695	39855.203	40662.477	35644.012	45509.8492444444	32549.7881185185	39762.7962	36288.6456962963	37737.695	36644.68	44419.859	38543.832	30294.52	39414.664	41514.633	40411.953	35110.891	34101.086	41707.043	38198.777	38444.332	26312.7759851852	20446.8939740741	20919.0970703704	23944.6664444444	19204.8881740741	19164.0955962963	18615.5549333333	18656.3805148148	17609.7965925926	17576.2509333333	18972.8617148148
2.2682	39971.594	69677.172	39111.68	35829.52	37761.59	41693.367	43032.008	37646.957	43583.547	39640.887	36824.605	40807.453	45756.301	42100.852	39306.875	35390.969	36912.367	39311.016	45043.422	40250.168	43367.848	40767.039	33802.965	47632.152	39848.43	41170.887	42924.797	37934.621	32409.549	34590.816	36660.039	41611.48	41421.363	41234.484	35897.27	55570.5558444444	32498.6636444444	39293.7024	38268.4562407407	37350.992	39305.977	47239.652	40074.438	31529.604	41142.477	47785.492	41467.586	34491.871	35301.727	40744.559	38701.086	40404.988	39429.2833518519	22800.0302555556	22506.2191259259	27967.9864185185	20069.9916777778	19813.832562963	19257.1121925926	18896.2948592593	18140.0584148148	15642.9130777778	20827.3085592593
2.4016	45194.605	109462.281	41268.27	36969.754	39896.598	57085.012	52827.695	37980.926	54640.652	41421.113	37756.387	43726.57	54854.289	47667.402	42789.633	38265.949	38867.906	47847.941	52709.73	42228.07	49363.941	45192.254	36170.547	61750.059	38686.82	41237.078	52557.793	37852.09	34407.035	35124.484	36489.547	48203.113	47604.844	41703.562	37764.02	83679.2162222222	39760.7621296296	40151.3296962963	38380.139037037	41233.477	42264.797	59752.926	45688.891	34043.684	41467.652	72040.625	51011.309	35426.566	37802.711	43389.301	41613.734	45739.406	54386.8536925926	23489.1614851852	22893.243137037	38763.0810111111	22887.7541	20429.8831703704	21625.9321814815	19526.7767703704	20813.2264	17517.1638814815	28423.5174333333
2.535	53423.539	179714.812	42713.211	37462.328	46848.727	96153.508	71791.938	43439.926	69633.234	45942.941	40405.762	50914.578	74026.773	66044.141	54618.18	42302.141	44093.801	67518.383	72717.531	45021.32	69421.93	50668.41	37892.273	93262.477	41067.773	44969.266	83194.75	37905.219	38802.449	35392.188	38460.918	71457.516	63735.453	44824.957	38921.352	108393.025311111	58846.2151259259	42862.9608925926	42032.4157407407	49089.75	58379.375	90000.766	56916.344	38406.852	45791.781	123260.898	67850.094	35662.75	42429.57	48657.328	44931.004	53915.25	56095.2157222222	29181.595137037	28575.4682222222	59469.3632666667	31127.100937037	21683.9127407407	27200.2976888889	20303.2965962963	25410.600637037	17175.1777666667	42821.5968296296
2.6684	71552.812	214457.562	50797.184	36836.18	62449.812	141389.156	80700.234	52833.062	74472.945	58179.004	46895.035	67762.359	91561.086	89193.891	81163.711	59750.453	57915.777	88659.727	113261.508	54058.707	104886.297	65113.281	45157.414	148183.672	40940.453	55924.621	138184.656	38222.168	48680.043	38965.227	40820.047	118259.383	89360.703	54453.285	49239.973	90135.8558444444	96855.0885666667	49757.6847296296	46907.5699925926	65189.191	86600.156	113012.133	82204.969	51659.367	50091.508	184477	104334.281	38622.363	49556.09	54779.254	51977.781	80017.984	38218.3566185185	44664.7598814815	42992.3996814815	63826.4149555555	41780.1962259259	26604.6833222222	39810.9486037037	23358.3643333333	40804.1950666667	19170.9134666667	73973.6433703704
2.8019	97760.836	178582.266	63374.207	39883.777	96119.609	154562.078	63949.406	59583.219	64974.215	90644.438	59222.539	111715.68	80087.445	96231.539	109884	83801.461	88972.594	76980.625	162029.984	76884.445	120762.305	99154.219	63231.781	175001.484	48193.211	82267.055	174850.469	40969.859	56848.621	42610.453	50371.082	145042.266	133469.031	78986.062	72411.5	66464.2550814815	129655.974088889	71577.9983185185	70700.1970740741	101853.086	99971.391	99384.977	118040.492	69502.828	69182.141	177874.125	134295.641	42253.277	71811.961	73701.969	78544.656	123518.508	25377.4736037037	61264.618837037	63524.354637037	48601.4694518519	48382.3040148148	37592.9485925926	65718.6666740741	31852.2583148148	61534.2660444444	25344.8398888889	91252.0393666667
2.9353	103843.102	110717.891	73630.398	44119.328	130224.055	114054.625	47278.609	51336.996	48888.16	138766.062	84979.82	151568.375	57119.164	74502.18	104184.266	89369.039	129778.562	50838.961	169390.797	99433.398	99170.891	127052.984	91865.109	133805.688	65038.898	129516.727	140610.891	43873.113	50773.781	54914.402	70472.422	121691.641	185093.688	123523.703	104870.156	55299.4026259259	126915.756474074	90784.9379481481	115271.71977037	136662.469	80804.883	65192.098	122686.273	63373.867	115950.227	112666.32	124296.273	54812.973	93695.312	119112.492	119261.641	143842.344	NaN	51493.2904481481	63746.2263777778	30852.7949962963	49596.1124925926	62059.2576962963	73019.5340888889	52925.517437037	66683.1078518518	37141.4457666667	67381.4453777778
3.0687	77857.305	67199.039	64302.172	55901.391	118643.773	66821.773	40738.539	44547.219	41692.926	169740.719	99171.039	135914.625	44779.219	NaN	73676.078	64745.391	129343.625	39385.695	124562.023	92888.961	66088.633	110332.695	81841.812	79388.844	88021.703	155176.156	86095.945	52486.879	41542.648	84328.93	86906.156	78645.141	170799.625	137725.859	111660.039	NaN	87545.9405703704	92451.4148037037	136536.417744444	130395.523	54822.094	48527.312	87724.516	44880.957	180045.234	65233.645	84812.688	81626.383	87399.242	137392.469	126242.109	100138.852	NaN	31995.1296111111	45012.0144296296	22954.1471296296	34040.6001555556	90459.0611148148	57849.5762296296	67964.9473851852	44360.6185925926	56310.0264074074	39498.1395
3.2021	53568.438	53002.617	48646.09	87445	77976.484	45499.41	39284.234	41065.336	36012.473	141434.781	77767.367	88815.773	40760.391	NaN	52770.387	46297.898	97247.023	NaN	76571.578	70074.68	51050.016	74020.969	57823.035	56622.441	87195.812	117920.125	56902.316	64176.621	35552.578	117971.977	78842.281	53244.867	108408.102	102637.805	78378.711	NaN	58872.8543259259	68335.8864333333	102212.213274074	90663.086	42536.391	43521.461	61585.152	36994.094	202533.047	NaN	57689.059	96211.992	72456.047	100765.562	87315.453	63580.82	NaN	25016.7274888889	28718.5358037037	NaN	25683.7792407407	83643.3081925926	33815.6816518519	56197.1919555556	25810.7688074074	62247.4969259259	26105.6794814815
3.3356	42258.781	44896.875	40615.984	128515.836	50247.645	39507.34	NaN	NaN	NaN	89350.773	54390.586	58827.059	39983.324	NaN	45493.578	NaN	68361.547	NaN	53545.574	49787.859	44823.238	51570.254	43090.242	44915.348	66554.781	73651.039	46990.336	65013.32	NaN	108503.516	63370.125	43404.961	62626.672	67280.328	54259.875	NaN	NaN	49214.5757814815	65244.1151037037	56197.809	NaN	NaN	NaN	31423.721	159916.703	NaN	48234.902	74953.891	68944.109	61398.371	57834.496	49077.27	NaN	22607.4588555555	22734.0489037037	NaN	22853.9704666667	50450.3820962963	24482.0987555556	38716.8931962963	NaN	44666.2693666667	20888.4314185185
3.469	38699.16	NaN	38754.734	124379.469	42637.668	NaN	NaN	NaN	NaN	60536.395	42838.16	46102.289	NaN	NaN	41073.051	NaN	50285.902	NaN	44478.484	NaN	NaN	45734.461	37092.109	40908.676	50607.699	52863.566	43878.199	55151.984	NaN	71493.469	51118.684	41771.746	47992.945	55065.051	45024.875	NaN	NaN	41028.6532555556	44354.8168888889	42914.625	NaN	NaN	NaN	NaN	92808.148	NaN	44676.887	52521.305	NaN	49005.992	NaN	NaN	NaN	NaN	20546.0614185185	NaN	19994.6338	31836.4703851852	NaN	26549.2509962963	NaN	30257.4359740741	NaN
3.6024	NaN	NaN	39211.656	82470.562	39612.855	NaN	NaN	NaN	NaN	47484.453	NaN	41169.363	NaN	NaN	40041.34	NaN	NaN	NaN	NaN	NaN	NaN	NaN	NaN	NaN	45499.184	46161.059	NaN	55921.074	NaN	49212.156	42972.875	NaN	41125.383	53626.18	39911.906	NaN	NaN	NaN	39764.533237037	NaN	NaN	NaN	NaN	NaN	61529.379	NaN	NaN	NaN	NaN	44538.023	NaN	NaN	NaN	NaN	NaN	NaN	NaN	NaN	NaN	21469.6283777778	NaN	21970.7583518519	NaN
3.7358	NaN	NaN	39103.488	52751.531	NaN	NaN	NaN	NaN	NaN	42720.328	NaN	NaN	NaN	NaN	40604.207	NaN	NaN	NaN	NaN	NaN	NaN	NaN	NaN	NaN	NaN	43391.746	NaN	NaN	NaN	44065.324	39101.922	NaN	NaN	50305.863	38286.195	NaN	NaN	NaN	NaN	NaN	NaN	NaN	NaN	NaN	49839.344	NaN	NaN	NaN	NaN	41050.094	NaN	NaN	NaN	NaN	NaN	NaN	NaN	NaN	NaN	NaN	NaN	19963.118737037	NaN
3.8692	NaN	NaN	NaN	45680.551	NaN	NaN	NaN	NaN	NaN	40680.922	NaN	NaN	NaN	NaN	NaN	NaN	NaN	NaN	NaN	NaN	NaN	NaN	NaN	NaN	NaN	NaN	NaN	NaN	NaN	NaN	NaN	NaN	NaN	NaN	NaN	NaN	NaN	NaN	NaN	NaN	NaN	NaN	NaN	NaN	46097.664	NaN	NaN	NaN	NaN	NaN	NaN	NaN	NaN	NaN	NaN	NaN	NaN	NaN	NaN	NaN	NaN	20419.4678962963	NaN
4.0027	NaN	NaN	NaN	NaN	NaN	NaN	NaN	NaN	NaN	NaN	NaN	NaN	NaN	NaN	NaN	NaN	NaN	NaN	NaN	NaN	NaN	NaN	NaN	NaN	NaN	NaN	NaN	NaN	NaN	NaN	NaN	NaN	NaN	NaN	NaN	NaN	NaN	NaN	NaN	NaN	NaN	NaN	NaN	NaN	NaN	NaN	NaN	NaN	NaN	NaN	NaN	NaN	NaN	NaN	NaN	NaN	NaN	NaN	NaN	NaN	NaN	NaN	NaN
4.1361	NaN	NaN	NaN	NaN	NaN	NaN	NaN	NaN	NaN	NaN	NaN	NaN	NaN	NaN	NaN	NaN	NaN	NaN	NaN	NaN	NaN	NaN	NaN	NaN	NaN	NaN	NaN	NaN	NaN	NaN	NaN	NaN	NaN	NaN	NaN	NaN	NaN	NaN	NaN	NaN	NaN	NaN	NaN	NaN	NaN	NaN	NaN	NaN	NaN	NaN	NaN	NaN	NaN	NaN	NaN	NaN	NaN	NaN	NaN	NaN	NaN	NaN	NaN
4.2695	NaN	NaN	NaN	NaN	NaN	NaN	NaN	NaN	NaN	NaN	NaN	NaN	NaN	NaN	NaN	NaN	NaN	NaN	NaN	NaN	NaN	NaN	NaN	NaN	NaN	NaN	NaN	NaN	NaN	NaN	NaN	NaN	NaN	NaN	NaN	NaN	NaN	NaN	NaN	NaN	NaN	NaN	NaN	NaN	NaN	NaN	NaN	NaN	NaN	NaN	NaN	NaN	NaN	NaN	NaN	NaN	NaN	NaN	NaN	NaN	NaN	NaN	NaN
4.4029	NaN	NaN	NaN	NaN	NaN	NaN	NaN	NaN	NaN	NaN	NaN	NaN	NaN	NaN	NaN	NaN	NaN	NaN	NaN	NaN	NaN	NaN	NaN	NaN	NaN	NaN	NaN	NaN	NaN	NaN	NaN	NaN	NaN	NaN	NaN	NaN	NaN	NaN	NaN	NaN	NaN	NaN	NaN	NaN	NaN	NaN	NaN	NaN	NaN	NaN	NaN	NaN	NaN	NaN	NaN	NaN	NaN	NaN	NaN	NaN	NaN	NaN	NaN
4.5363	NaN	NaN	NaN	NaN	NaN	NaN	NaN	NaN	NaN	NaN	NaN	NaN	NaN	NaN	NaN	NaN	NaN	NaN	NaN	NaN	NaN	NaN	NaN	NaN	NaN	NaN	NaN	NaN	NaN	NaN	NaN	NaN	NaN	NaN	NaN	NaN	NaN	NaN	NaN	NaN	NaN	NaN	NaN	NaN	NaN	NaN	NaN	NaN	NaN	NaN	NaN	NaN	NaN	NaN	NaN	NaN	NaN	NaN	NaN	NaN	NaN	NaN	NaN
4.6698	NaN	NaN	NaN	NaN	NaN	NaN	NaN	NaN	NaN	NaN	NaN	NaN	NaN	NaN	NaN	NaN	NaN	NaN	NaN	NaN	NaN	NaN	NaN	NaN	NaN	NaN	NaN	NaN	NaN	NaN	NaN	NaN	NaN	NaN	NaN	NaN	NaN	NaN	NaN	NaN	NaN	NaN	NaN	NaN	NaN	NaN	NaN	NaN	NaN	NaN	NaN	NaN	NaN	NaN	NaN	NaN	NaN	NaN	NaN	NaN	NaN	NaN	NaN
4.8032	NaN	NaN	NaN	NaN	NaN	NaN	NaN	NaN	NaN	NaN	NaN	NaN	NaN	NaN	NaN	NaN	NaN	NaN	NaN	NaN	NaN	NaN	NaN	NaN	NaN	NaN	NaN	NaN	NaN	NaN	NaN	NaN	NaN	NaN	NaN	NaN	NaN	NaN	NaN	NaN	NaN	NaN	NaN	NaN	NaN	NaN	NaN	NaN	NaN	NaN	NaN	NaN	NaN	NaN	NaN	NaN	NaN	NaN	NaN	NaN	NaN	NaN	NaN
4.9366	NaN	NaN	NaN	NaN	NaN	NaN	NaN	NaN	NaN	NaN	NaN	NaN	NaN	NaN	NaN	NaN	NaN	NaN	NaN	NaN	NaN	NaN	NaN	NaN	NaN	NaN	NaN	NaN	NaN	NaN	NaN	NaN	NaN	NaN	NaN	NaN	NaN	NaN	NaN	NaN	NaN	NaN	NaN	NaN	NaN	NaN	NaN	NaN	NaN	NaN	NaN	NaN	NaN	NaN	NaN	NaN	NaN	NaN	NaN	NaN	NaN	NaN	NaN
5.07	NaN	NaN	NaN	NaN	NaN	NaN	NaN	NaN	NaN	NaN	NaN	NaN	NaN	NaN	NaN	NaN	NaN	NaN	NaN	NaN	NaN	NaN	NaN	NaN	NaN	NaN	NaN	NaN	NaN	NaN	NaN	NaN	NaN	NaN	NaN	NaN	NaN	NaN	NaN	NaN	NaN	NaN	NaN	NaN	NaN	NaN	NaN	NaN	NaN	NaN	NaN	NaN	NaN	NaN	NaN	NaN	NaN	NaN	NaN	NaN	NaN	NaN	NaN
5.2035	NaN	NaN	NaN	NaN	NaN	NaN	NaN	NaN	NaN	NaN	NaN	NaN	NaN	NaN	NaN	NaN	NaN	NaN	NaN	NaN	NaN	NaN	NaN	NaN	NaN	NaN	NaN	NaN	NaN	NaN	NaN	NaN	NaN	NaN	NaN	NaN	NaN	NaN	NaN	NaN	NaN	NaN	NaN	NaN	NaN	NaN	NaN	NaN	NaN	NaN	NaN	NaN	NaN	NaN	NaN	NaN	NaN	NaN	NaN	NaN	NaN	NaN	NaN
5.3369	NaN	NaN	NaN	NaN	NaN	NaN	NaN	NaN	NaN	NaN	NaN	NaN	NaN	NaN	NaN	NaN	NaN	NaN	NaN	NaN	NaN	NaN	NaN	NaN	NaN	NaN	NaN	NaN	NaN	NaN	NaN	NaN	NaN	NaN	NaN	NaN	NaN	NaN	NaN	NaN	NaN	NaN	NaN	NaN	NaN	NaN	NaN	NaN	NaN	NaN	NaN	NaN	NaN	NaN	NaN	NaN	NaN	NaN	NaN	NaN	NaN	NaN	NaN
5.4703	NaN	NaN	NaN	NaN	NaN	NaN	NaN	NaN	NaN	NaN	NaN	NaN	NaN	NaN	NaN	NaN	NaN	NaN	NaN	NaN	NaN	NaN	NaN	NaN	NaN	NaN	NaN	NaN	NaN	NaN	NaN	NaN	NaN	NaN	NaN	NaN	NaN	NaN	NaN	NaN	NaN	NaN	NaN	NaN	NaN	NaN	NaN	NaN	NaN	NaN	NaN	NaN	NaN	NaN	NaN	NaN	NaN	NaN	NaN	NaN	NaN	NaN	NaN
5.6037	NaN	NaN	NaN	NaN	NaN	NaN	NaN	NaN	NaN	NaN	NaN	NaN	NaN	NaN	NaN	NaN	NaN	NaN	NaN	NaN	NaN	NaN	NaN	NaN	NaN	NaN	NaN	NaN	NaN	NaN	NaN	NaN	NaN	NaN	NaN	NaN	NaN	NaN	NaN	NaN	NaN	NaN	NaN	NaN	NaN	NaN	NaN	NaN	NaN	NaN	NaN	NaN	NaN	NaN	NaN	NaN	NaN	NaN	NaN	NaN	NaN	NaN	NaN
5.7371	NaN	NaN	NaN	NaN	NaN	NaN	NaN	NaN	NaN	NaN	NaN	NaN	NaN	NaN	NaN	NaN	NaN	NaN	NaN	NaN	NaN	NaN	NaN	NaN	NaN	NaN	NaN	NaN	NaN	NaN	NaN	NaN	NaN	NaN	NaN	NaN	NaN	NaN	NaN	NaN	NaN	NaN	NaN	NaN	NaN	NaN	NaN	NaN	NaN	NaN	NaN	NaN	NaN	NaN	NaN	NaN	NaN	NaN	NaN	NaN	NaN	NaN	NaN
