0.00000,37606.941
0.13342,37362.156
0.26684,36244.258
0.40027,37994.156
0.53369,38583.785
0.66711,37433.738
0.80053,37394.066
0.93395,37155.254
1.06737,39289.145
1.20080,42316.867
1.33422,48833.867
1.46764,69024.367
1.60106,93840.969
1.73448,89508.633
1.86791,65132.020
2.00133,45767.379
2.13475,40066.617
2.26817,37683.641
