0.00000,15265.133
0.13342,16327.301
0.26684,17842.246
0.40027,22595.631
0.53369,27344.064
0.66711,25709.695
0.80053,24231.086
0.93395,24478.756
1.06737,24426.645
1.20080,23906.131
1.33422,22197.945
1.46764,20127.738
1.60106,18987.424
1.73448,18810.631
1.86791,19382.891
2.00133,21532.346
2.13475,21610.555
2.26817,19678.619
2.40159,16952.258
2.53502,14353.107
2.66844,14246.161
2.80186,14173.893
2.93528,13639.310
