0.00000,13712.466
0.13342,13928.934
0.26684,15822.422
0.40027,19150.510
0.53369,20402.344
0.66711,19339.756
0.80053,19904.863
0.93395,19418.389
1.06737,17574.369
1.20080,16156.396
1.33422,16123.143
1.46764,15124.414
1.60106,15323.389
1.73448,14939.346
1.86791,13413.359
2.00133,12072.329
2.13475,11637.725
2.26817,11842.412
2.40159,11658.562
2.53502,12006.967
2.66844,11929.907
