X,Y
0.00000,37517.477
0.13342,36854.785
0.26684,37391.719
0.40027,37068.297
0.53369,37200.031
0.66711,38424.180
0.80053,37563.996
0.93395,38377.555
1.06737,39849.277
1.20080,44663.984
1.33422,53513.348
1.46764,82793.609
1.60106,145267.812
1.73448,202542.688
1.86791,171951.406
2.00133,112032.633
2.13475,77016.422
2.26817,57571.836
2.40159,46144.250
2.53502,40965.379
