x	Y_20180514_15100_1_3g	Y_20180514_15100_11_2g	Y_20180514_15100_11_5g	Y_20180514_15100_13_2g	Y_20180514_15100_13_8g	Y_20180514_15100_14_2g	Y_20180514_15100_14_8g	Y_20180514_15100_16_2g	Y_20180514_15100_16_3g	Y_20180514_15100_16_7g	Y_20180514_15100_19_1g	Y_20180514_15100_23_2g	Y_20180514_15100_23_5g	Y_20180514_15100_27_5g	Y_20180514_15100_28_4g	Y_20180514_15100_28_6g	Y_20180514_15100_3_2g	Y_20180514_15100_31_2g	Y_20180514_15100_31_4g	Y_20180514_15100_32_2g	Y_20180514_15100_4_13g	Y_20180514_15100_4_9g	Y_20180514_15100_5_3g	Y_20180514_15100_7_6g
0	14504.9238	12948.5898	13323.3271	14741.7246	15288.2129	13859.5879	14144.3594	17341.3145	13538.3242	12907.1982	14432.1152	13372.5889	14768.5469	11953.4004	11338.2051	14383.5146	16069.6445	16470.3438	12368.1201	12050.1943	14416.7588	16586.5117	15407.9844	12967.6006
0.1334	15731.6133	12789.8682	14155.8643	15381.7725	15573.4043	16599.084	14618.8652	17002.0469	13352.3584	13468.0361	14742.7656	13137.8818	16183.043	11881.4473	10961.1641	17247.0234	16528.207	16926.5195	12393.5674	12554.7051	16067.6768	16322.7314	16109.4277	13487.5791
0.2668	19864.9199	13406.5215	13941.6396	18041.3203	15310.9189	20119.1738	15091.5674	17819.7461	14322.2695	15280.0127	17405.6523	13274.9795	20012.959	13935.2578	12111.9248	20364.5703	19301.8555	18177.7812	14414.1465	15542.2031	19252.3047	18020.8477	19611.7148	14522.1797
0.4003	25383.8008	14385.1768	15056.8145	22787.4531	16474.5078	19303.7441	16797.3613	20234.6738	15467.9424	18256.3008	22490.0684	13225.4512	23357.9844	17138.375	13043.1729	19588.4512	24191.0488	22355.8047	17528.4102	19890.2383	26234.8457	23019.8379	25215.2324	16776.2441
0.5337	28875.1016	20117.9609	16008.583	29201.2246	18593.834	15749.3926	20367.6758	23501.2168	18143.6719	20291.9395	26576.502	14123.4551	23679.1172	24341.293	15830.0967	17118.5137	26485.2949	23708.9941	22791.7441	25391.8574	30500.7188	26211.5586	28644.6445	19017.7715
0.6671	27104.1992	24453.1035	19113.9004	28680.1348	20774.9336	14274.5967	25169.0957	22809.6699	24383.7129	21972.1973	25564.3164	15319.8535	19760.373	32426.3066	19592.7773	16086.1562	22133.2441	25326.9766	25918.1367	28402.6699	25677.8105	21680.5723	25452.7227	20764.6719
0.8005	21108.1855	23051.6914	18951.6992	24157.2227	20314.2441	14630.6963	27588.127	20450.9746	28697.5625	19462.8125	22048.4551	17221.3945	18793.7129	32596.5078	19611.7812	16816.2754	19698.3945	23899.2051	23123.4043	25621.7852	20129.1914	17917.1484	20139.3086	20469.8379
0.934	18093.1172	18200.4258	16749.752	24038.332	18055.3867	14130.6328	26076.2617	19788.0059	24772.377	17357.125	18153.2363	17688.6641	19054.2734	28686.248	17504.7754	16732.3164	17534.3672	20507.8105	20709.2598	21545.7715	16943.6777	18365.2324	18278.9336	18477.4316
1.0674	16543.2793	16469.1895	14331.4385	22978.2266	16100.0498	15342.167	23211.9941	18109.0547	19556.1953	15841.9395	17251.9082	16636.2891	19695.4297	26288.2383	16139.0176	15381.8125	16614.7949	19049.8906	18618.6035	19199.1055	15555.751	19750.8574	18229.457	17819.3945
1.2008	17490.8164	15861.6602	13320.4424	21988.0254	16607.8984	15624.6855	20785.9707	16345.833	17734.0117	16560.6562	16168.4502	16075.7705	19466.3438	25147.873	16166.2529	15095.9434	16203.5332	18621.6738	19085.2285	17617.7129	15370.6787	20307.3359	18442.0527	16987.7734
1.3342	17112.377	15761.6982	12945.3867	22849.4961	16255.4775	16521.0117	20485.3574	16078.8672	15747.998	15429.7686	15520.2881	15253.8311	20830.7402	22169.7617	16242.0303	16622.6016	16989.957	18407.9766	17139.3945	16620.5273	15069.3955	21596.0566	19641.4648	15153.0537
1.4676	16782.4141	14460.3633	12581.1602	20357.6191	16057.0752	17210.8262	20708.2832	17573.6074	15050.8691	14187.6406	14511.1299	14282.6826	19748.9492	20918.2441	15787.7529	15875.6035	18081.2695	17795.2266	16593.7324	15251.2754	16331.6934	21028.5039	19166.4121	14571.6045
1.6011	17784.3105	13685.5225	12193.3008	20696.2695	16512.1113	16538.9355	20582.8691	19999.3691	15360.498	15081.7412	13215.8076	13345.0225	18940.2109	20442.623	15789.6426	15110.7783	18413.1074	19070.0176	16331.0703	15587.4297	14830.3281	19647.0957	18721.2969	13364.5752
1.7345	16410.9043	14152.5918	12443.4004	18626.4922	15938.0332	16349.4658	18604.4688	21152.3418	18180.416	16500.168	12918.0254	12974.0107	19534.8926	21686.3145	14316.6318	13946.6465	20916.9512	18502.3438	16059.0322	16692.3516	15887.5186	19095.4121	19007.7012	14096.875
1.8679	14649.9756	14221.1797	12094.4961	18837.3594	15226.9922	15618.9268	17186.8281	20052.332	19436.1328	17288.5977	14146.0342	12932.9209	18937.2422	21237.9043	13837.9941	12708.2314	20774.9414	19053.166	16007.1602	18226.7383	15699.4072	19334.1426	18232.4941	14345.5078
2.0013	14356.3262	13916.4941	12259.2861	20548.8809	14898.0039	14349.0859	16238.1172	18714.5664	19873.5918	16893.7227	15889.2832	12913.3955	18262.4316	20542.4082	15113.9717	12426.1611	18445.8145	19765.9941	15864.5137	19495.459	15479.0459	18534.3398	17722.877	13929.667
2.1347	13565.3711	13000.4062	12336.5439	22081.1953	13780.8604	13448.332	15233.0723	16774.8164	18952.2891	15551.043	17983.1465	12775.2217	16297.7871	17350.1777	15222.3662	12627.9854	16640.082	17377.1953	15473.7119	19565.4023	15180.5693	17024.2148	17174.3633	14844.25
2.2682	13439.1162	12749.8115	13225.665	18835.4863	13922.0742	12695.7178	14016.6816	15147.9346	17467.0039	14496.0771	18629.9043	13642.5479	15539.4141	15264.4004	15641.6006	12749.0205	15319.459	16539.9258	14974.4346	17717.3223	14606.1885	15912.3965	16238.375	14465.8711
2.4016	12758.7002	13369.0176	14091.3105	16830.8301	13320.0723	12769.0166	13528.1914	15131.5596	15874.0176	13673.1826	18285.3926	14590.9893	15125.1084	13734.541	14892.6104	12026.9785	15253.126	16233.0967	14004.8008	15801.832	14644.7988	15798.4639	14840.2939	14275.0654
2.535	12877.8701	12960.2139	13651.0576	14569.5957	13776.2559	13453.9648	12572.0479	14835.4629	15111.9805	13478.4893	16405.2617	14770.6367	14520.0615	14234.832	14041.1943	11988.9805	14771.1553	14814.9424	13606.5762	14868.9023	13586.3223	15279.3545	13860.625	14476.2451
2.6684	13428.7617	12691.6465	13568.8643	14655.3779	14126.0615	12859.085	11711.0479	14550.124	14904.4326	13598.8643	16267.7227	14317.8115	14360.541	14651.0039	13922.709	NaN	14485.0615	NaN	13121.6406	14335.0762	13899.7959	16385.6094	13969.8066	14622.3789
2.8019	13035.9873	13186.7227	13086.0225	14235.7607	NaN	NaN	11485.7344	14799.8682	14289.4639	13533.3828	16295.0117	14149.1211	14579.3506	14933.0156	14901.4395	NaN	14653.0713	NaN	12716.8691	13825.6445	14568.3857	17232.6953	NaN	NaN
2.9353	NaN	NaN	13205.6826	13828.4785	NaN	NaN	12319.9453	NaN	NaN	NaN	15034.4004	13515.9531	NaN	14200.8662	NaN	NaN	13848.2412	NaN	12945.9375	14039.8271	NaN	NaN	NaN	NaN
3.0687	NaN	NaN	NaN	NaN	NaN	NaN	11775.7061	NaN	NaN	NaN	14896.3916	13972.6611	NaN	NaN	NaN	NaN	NaN	NaN	13752.6836	14167.4648	NaN	NaN	NaN	NaN
3.2021	NaN	NaN	NaN	NaN	NaN	NaN	NaN	NaN	NaN	NaN	NaN	NaN	NaN	NaN	NaN	NaN	NaN	NaN	NaN	NaN	NaN	NaN	NaN	NaN
3.3355	NaN	NaN	NaN	NaN	NaN	NaN	NaN	NaN	NaN	NaN	NaN	NaN	NaN	NaN	NaN	NaN	NaN	NaN	NaN	NaN	NaN	NaN	NaN	NaN
3.469	NaN	NaN	NaN	NaN	NaN	NaN	NaN	NaN	NaN	NaN	NaN	NaN	NaN	NaN	NaN	NaN	NaN	NaN	NaN	NaN	NaN	NaN	NaN	NaN
3.6024	NaN	NaN	NaN	NaN	NaN	NaN	NaN	NaN	NaN	NaN	NaN	NaN	NaN	NaN	NaN	NaN	NaN	NaN	NaN	NaN	NaN	NaN	NaN	NaN
3.7358	NaN	NaN	NaN	NaN	NaN	NaN	NaN	NaN	NaN	NaN	NaN	NaN	NaN	NaN	NaN	NaN	NaN	NaN	NaN	NaN	NaN	NaN	NaN	NaN
3.8692	NaN	NaN	NaN	NaN	NaN	NaN	NaN	NaN	NaN	NaN	NaN	NaN	NaN	NaN	NaN	NaN	NaN	NaN	NaN	NaN	NaN	NaN	NaN	NaN
4.0027	NaN	NaN	NaN	NaN	NaN	NaN	NaN	NaN	NaN	NaN	NaN	NaN	NaN	NaN	NaN	NaN	NaN	NaN	NaN	NaN	NaN	NaN	NaN	NaN
4.1361	NaN	NaN	NaN	NaN	NaN	NaN	NaN	NaN	NaN	NaN	NaN	NaN	NaN	NaN	NaN	NaN	NaN	NaN	NaN	NaN	NaN	NaN	NaN	NaN
4.2695	NaN	NaN	NaN	NaN	NaN	NaN	NaN	NaN	NaN	NaN	NaN	NaN	NaN	NaN	NaN	NaN	NaN	NaN	NaN	NaN	NaN	NaN	NaN	NaN
4.4029	NaN	NaN	NaN	NaN	NaN	NaN	NaN	NaN	NaN	NaN	NaN	NaN	NaN	NaN	NaN	NaN	NaN	NaN	NaN	NaN	NaN	NaN	NaN	NaN
4.5363	NaN	NaN	NaN	NaN	NaN	NaN	NaN	NaN	NaN	NaN	NaN	NaN	NaN	NaN	NaN	NaN	NaN	NaN	NaN	NaN	NaN	NaN	NaN	NaN
4.6698	NaN	NaN	NaN	NaN	NaN	NaN	NaN	NaN	NaN	NaN	NaN	NaN	NaN	NaN	NaN	NaN	NaN	NaN	NaN	NaN	NaN	NaN	NaN	NaN
4.8032	NaN	NaN	NaN	NaN	NaN	NaN	NaN	NaN	NaN	NaN	NaN	NaN	NaN	NaN	NaN	NaN	NaN	NaN	NaN	NaN	NaN	NaN	NaN	NaN
4.9366	NaN	NaN	NaN	NaN	NaN	NaN	NaN	NaN	NaN	NaN	NaN	NaN	NaN	NaN	NaN	NaN	NaN	NaN	NaN	NaN	NaN	NaN	NaN	NaN
5.07	NaN	NaN	NaN	NaN	NaN	NaN	NaN	NaN	NaN	NaN	NaN	NaN	NaN	NaN	NaN	NaN	NaN	NaN	NaN	NaN	NaN	NaN	NaN	NaN
