x	Y_20180514_15100b_12_3g	Y_20180514_15100b_13_6g	Y_20180514_15100b_14_9g	Y_20180514_15100b_16_15g	Y_20180514_15100b_18_1g	Y_20180514_15100b_19_1g	Y_20180514_15100b_20_3g	Y_20180514_15100b_22_12g	Y_20180514_15100b_22_4g	Y_20180514_15100b_25_8g	Y_20180514_15100b_9_9g
0	30264.1641	33441.543	28701.5	33697.5	29592.8926	33736.2148	32875.8711	32287.582	26545.1211	35037.6172	33213.2109
0.1334	28883.7891	34139.8633	29411.959	33792.3047	30214.2988	34048.1133	32192.168	33560.4688	27695.125	35864.5664	33537.3047
0.2668	29724.9551	31521.2461	31052.8496	32840.6797	30193.8398	33742.0312	32437.543	32762.2305	27998.875	36056.8945	35022.4531
0.4003	29433.8379	34560.3281	31221.6953	34835.3164	30129.2012	33418.3008	33239.6797	34663.5508	29277.0527	35718.3438	33908.3984
0.5337	29194.2227	33906.7656	30322.1523	33455.0625	29448.1855	33575.1758	32553.7051	34437.6016	29841.793	36317.4531	33907.2891
0.6671	31449.7363	34281.4141	31822.1641	34516.5117	30526.8477	34381.3359	33478.1016	34203.7539	29447.6289	36961.4023	34626.2031
0.8005	30436.4746	33487.3242	31028.5508	34897.6016	29747.957	35121.1211	32593.0781	35103.4766	28721.5684	36375.7891	35795.7305
0.934	31422.6992	33229.8203	30959.8223	33863.1172	29955.748	34244	33737.3203	35334.293	29284.8652	35517.3867	34670.3906
1.0674	31592.2578	32462.9766	31052.8926	32484.5625	30323.2598	35645.0898	33484.1719	34624.7266	29630.3906	34584.6562	35563.7656
1.2008	29937.8281	32529.7207	31407.8613	32929.4883	29193.0645	35528.2305	33041.0703	34033.1211	28401.2832	34907.0703	35582.5078
1.3342	29549.7598	32402.209	29154.4004	33818.3711	29039.3965	35519.4023	31730.2207	32832.1797	27589.0234	35314.3125	36757.1875
1.4676	31487.9785	34223.5859	29170.7988	34864.9453	29146.5918	34001.207	34112.3281	33252.9062	29144.832	36449.5781	37726.5078
1.6011	31559.3965	34100.9922	27243.7891	33868.1094	29694.4199	35846.2852	34151.2227	33884.3125	28208.7754	35900.7031	36652.2891
1.7345	30005.2305	31759.4023	29206.4629	33539.8008	31126.9961	33890.0195	31903.7363	34351.9766	28400.8535	36225.1094	35989.0547
1.8679	30599.7969	33100.6523	29011.6699	34107.1758	30558.7852	33618.0352	32977.1367	32551.0723	28117.6523	36381.8672	35773.6094
2.0013	29853.8496	34755.168	28382.0625	33688.9023	30677.9902	31738.543	32320.5039	33067.3203	28347.6758	37566.0273	35629.168
2.1347	31086.6953	34407.8477	29740.0117	35154.4883	31237.5547	34230.1289	32625.4512	32886.4688	29218.3945	38232.957	33629.4531
2.2682	31683.0859	35779.668	29656.2148	36471.3984	32268.2637	33828.457	33676.4883	33614.957	29803.4355	38804.9727	35625.6797
2.4016	36210.8555	33831.1836	31220.7988	41203.9102	30982.5664	34731.9062	34678.0742	35210.5859	29672.709	42740.7656	36719.0508
2.535	43249.3945	34755.7891	35391.2617	51804.7656	31657.6172	36518.3477	36248.957	35594.3477	31838.0801	51296.2344	34587.0312
2.6684	57068.5234	35834.9805	44873.2773	68745.5391	34049.9375	40406.0156	40940.6328	41348.4531	40179.8203	69256.6953	36101.8359
2.8019	92142.25	41495.6875	69863.6953	75203.3516	39902.3086	45881.6641	49196.4492	53788.0234	54629.4961	109736.7812	36679.9062
2.9353	134923.4375	54021.293	89427.6406	56504.6016	54832.2344	66615.9766	76005.4844	76083.875	78068.7344	133639.5625	36722.0039
3.0687	131770.125	68635.0938	82909.0938	43411.6406	97398.4531	119079.5938	127869.2422	76336.9844	82454.3906	103459.2969	39439.2578
3.2021	83247.8594	64516.418	57963.1094	NaN	139678.5156	163843.875	158625.4062	54953.4297	62989.582	64658.8672	43336.5
3.3355	47269.2734	50245.0703	40994.4922	NaN	131381.125	136438.2812	123547.4688	42171.5859	44324.8086	47836.9492	53630.9258
3.469	35286.1562	40845.375	35104.8984	NaN	82488.3828	77320.7578	76758.3594	40761.5352	33955.6758	40389.6523	81538.8828
3.6024	32103.4551	39302.543	31976.9883	NaN	51430.7109	51490.2148	54126.5742	39730.8867	32659.5508	39298.3633	106344.1094
3.7358	29133.5039	35652.2227	30333.4648	NaN	40269.8672	42301.9883	42968.4492	NaN	32499.2109	37390.4297	91838.5
3.8692	29407.4355	34754.6484	30738.3848	NaN	34364.6172	NaN	39139.5938	NaN	NaN	35921.7656	62144.1523
4.0027	32018.5332	38032.5781	28834.4648	NaN	34652.5195	NaN	36934.8867	NaN	NaN	36390.5234	47134.8125
4.1361	NaN	35585.793	28900.3008	NaN	NaN	NaN	35657.5586	NaN	NaN	36517.0664	42007.7539
4.2695	NaN	NaN	NaN	NaN	NaN	NaN	NaN	NaN	NaN	NaN	41148.9453
4.4029	NaN	NaN	NaN	NaN	NaN	NaN	NaN	NaN	NaN	NaN	NaN
4.5363	NaN	NaN	NaN	NaN	NaN	NaN	NaN	NaN	NaN	NaN	NaN
4.6698	NaN	NaN	NaN	NaN	NaN	NaN	NaN	NaN	NaN	NaN	NaN
4.8032	NaN	NaN	NaN	NaN	NaN	NaN	NaN	NaN	NaN	NaN	NaN
4.9366	NaN	NaN	NaN	NaN	NaN	NaN	NaN	NaN	NaN	NaN	NaN
5.07	NaN	NaN	NaN	NaN	NaN	NaN	NaN	NaN	NaN	NaN	NaN
