0.00000,13173.529
0.13342,12979.362
0.26684,13920.364
0.40027,14814.348
0.53369,17272.684
0.66711,20280.789
0.80053,25412.789
0.93395,26773.699
1.06737,24787.221
1.20080,21581.600
1.33422,19977.217
1.46764,18179.184
1.60106,16729.934
1.73448,14803.775
1.86791,13475.186
2.00133,12977.091
2.13475,12626.350
2.26817,12477.034
2.40159,12337.103
2.53502,12304.521
