0.0000	13132.0273
0.1334	14377.1855
0.2668	15597.1094
0.4003	19681.6777
0.5337	23614.9844
0.6671	25310.5508
0.8005	24465.4512
0.9340	22606.4805
1.0674	21039.0703
1.2008	19956.8965
1.3342	18818.0488
1.4676	17912.0449
1.6011	16951.3594
1.7345	15810.4795
1.8679	14672.9697
2.0013	15573.9473
2.1347	16102.7803
2.2682	18370.9531
2.4016	18323.7578
2.5350	19352.7891
2.6684	18891.7637
2.8019	18267.8652
2.9353	16675.9668
3.0687	15080.0303
3.2021	14517.8428
3.3355	14003.1885
3.4690	13839.8242
3.6024	12947.5234
3.7358	13450.0791
