0.00000,37813.258
0.13342,35571.938
0.26684,37505.406
0.40027,38597.051
0.53369,37868.352
0.66711,36842.109
0.80053,39804.383
0.93395,38569.484
1.06737,39219.164
1.20080,38868.469
1.33422,37365.449
1.46764,38781.172
1.60106,38792.984
1.73448,39090.652
1.86791,38940.117
2.00133,37680.375
2.13475,38727.020
2.26817,40118.070
2.40159,38421.262
2.53502,41235.141
2.66844,44154.500
2.80186,51606.137
2.93528,69695.656
3.06870,116052.922
3.20212,181252.094
3.33555,200924.750
3.46897,157995.641
3.60239,92849.125
3.73581,62051.867
3.86923,50152.922
