0.00000,36711.953
0.13342,37957.332
0.26684,38007.719
0.40027,37153.484
0.53369,38484.496
0.66711,37783.191
0.80053,37974.391
0.93395,38813.363
1.06737,39262.332
1.20080,38191.723
1.33422,37873.879
1.46764,37930.652
1.60106,39805.117
1.73448,39862.660
1.86791,41919.238
2.00133,45447.637
2.13475,52760.672
2.26817,68767.148
2.40159,105914.273
2.53502,144206.812
2.66844,122355.727
2.80186,77097.727
2.93528,54658.199
