x	Y_20180130_15109_1_5g	Y_20180130_15109_12_12g	Y_20180130_15109_12_8g	Y_20180130_15109_13_1g	Y_20180130_15109_14_10g	Y_20180130_15109_15_11g	Y_20180130_15109_15_13g	Y_20180130_15109_16_2g	Y_20180130_15109_17_11_1g	Y_20180130_15109_17_12g	Y_20180130_15109_17_13g	Y_20180130_15109_18_5g	Y_20180130_15109_18_8g	Y_20180130_15109_20_3g	Y_20180130_15109_20_5g	Y_20180130_15109_21_10g	Y_20180130_15109_21_11g	Y_20180130_15109_22_2g	Y_20180130_15109_23_3g	Y_20180130_15109_25_2g	Y_20180130_15109_25_8g	Y_20180130_15109_25_9g	Y_20180130_15109_28_3g	Y_20180130_15109_29_2g	Y_20180130_15109_29_6g	Y_20180130_15109_31_1g	Y_20180130_15109_31_7g	Y_20180130_15109_34_5g	Y_20180130_15109_35_4g	Y_20180130_15109_39_3g	Y_20180130_15109_41_2g	Y_20180130_15109_41_7g	Y_20180130_15109_5_1g	Y_20180130_15109_7_6g	Y_20180130_15109_7_7g
0	39279.277	35108.836	37791.734	34919.543	36401.461	34282.863	35730.82	38257.602	31779.477	34088.68	34785.113	34965.637	37431.652	35981.754	36990.5	34591.566	33855.219	32423.152	37310.145	36745.328	33937.512	37677.129	33588.301	38081.41	39559.734	38859.562	36248.504	36815.336	32939.285	34056.492	38106.723	38629.941	37671.695	37113.719	32981.895
0.1334	38753.977	36424.051	36422.969	34989.438	38030.18	34380.816	35851.461	37413.102	31967.195	35990.336	35299.984	33705.195	37223.285	36002.48	35901.363	37616.766	33417.855	30217.211	38910.848	36663.703	32443.355	38156.48	34918.84	38324.785	38005.945	40308.613	37290.766	35981.969	34242.211	36520.984	37239.707	35819.688	37588.73	38326.953	34494.582
0.2668	38063.121	35280.215	35787.035	37818.645	37390.148	32679.752	35907.137	38244.738	32828.336	35609.227	36681.672	33398.031	39224.125	37650.078	35742.941	34334.391	34017.391	29761.602	38911.547	37134.594	33698.348	38897.707	35127.441	39314.824	39659.727	38572.414	36503.047	35989.254	33610.625	36059.211	36006.91	35011.98	37307.074	37083.641	33599.727
0.4003	37992.789	35269.789	35333.066	35702.719	36497.348	34912.145	36222.449	38401.043	32087.271	35483.16	36765.762	33160.363	37320.984	36851.707	36341.047	36824.277	33370.715	31287.809	38884.555	37990.941	34148.074	39999.277	34465.328	38599.09	39185.102	38701.742	37056.797	37217.238	33097.789	36047.328	36894.668	38337.379	36620.824	39544.578	34386.793
0.5337	39465.43	36562.164	36946.523	37579.984	36641.656	33748.336	36724.645	37270.086	32382.654	35621.828	35051.406	34237.922	39009.031	38667.328	37354.324	36166.172	33185.402	31870.488	38159.133	37393.961	34777.883	39881.363	35345.578	40274.109	38318.02	38870.156	37459.148	37842.785	31689.229	38287.246	37036.344	37436.48	35684.156	39533.602	34688.723
0.6671	39026.914	37488.426	36993.191	36186.746	36023.23	33741.863	36126.059	36660.52	32702.186	37761.57	36050.367	35186.039	38943.699	36771.434	35742.422	35281.301	33644.852	30214.082	37820.035	36628.48	36369.598	39669.191	34759.965	39344.406	40577.043	37902.871	37776.203	38198.789	32485.828	36050.449	37783.914	36825.551	34434.41	39086.535	34092.789
0.8005	38349.406	37433.02	36810.75	36138.848	37036.926	33424.555	37339.426	35301.969	33002.242	36543.074	37437.172	34908.164	38408.324	37545.168	36188.367	34769.684	33625.023	30572.672	38563.66	36719.918	35611.109	38837.266	33491.254	37782.648	40236.395	37131.473	35703.711	36721.801	32766.738	35843.352	38884.227	36277.07	35197.094	38803.562	34275.129
0.934	37890.535	37555.121	37274.266	38504.898	35910.305	32035.176	36727.711	36007.988	34319.238	35189.867	38096.715	35418.207	38193.109	37815.211	36028.188	36276.195	33487.324	31074.148	39759.617	38934.84	35204.297	39083.516	35377.59	39029.25	42023.359	37268.059	35940.805	38083.754	32891.961	36034.188	40311.215	36580.145	33901.762	39638.168	33450.773
1.0674	37312.488	35662.844	36398.242	37197.926	37337.02	31088.4	35810.938	35719.719	34564.25	33968.59	37619.902	35163.758	38382.641	36854.504	37529.812	35782.805	34934.992	29561.385	39582.441	37144.895	34541.293	38946.852	33712.5	40157.68	39338.285	38712.223	37082.59	37446.359	34226.727	36754.559	38590.309	35640.117	34645.582	38301.57	33457.043
1.2008	39612.918	36951.949	37039.773	36833.078	36459.977	32364.986	36471.227	34973.719	33783.344	36657.402	36695.816	35340.738	36222.234	38016.086	38295.078	33321.156	34878.277	30370.891	40199.828	36477.066	36530.055	39809.027	34032.973	37753.148	39374.25	37735.363	36965.293	36993.34	33677.211	34724.062	38487.965	35750.137	35266.23	38682.465	33087.828
1.3342	37425.852	38311.578	36695.574	36902.438	34830.273	32287.717	37539.91	34784.133	32949.398	37783.852	38280.758	36832.82	37865.242	37903.941	37355.156	36174.738	33007.691	31296.303	39492.199	35997.129	34561.383	39889.414	34338.996	36176.625	39200.332	38461.738	36404.152	36823.758	33350.027	35702.906	39476.363	37119.312	36352.043	37392.133	34931.93
1.4676	36137.312	36975.992	36721.18	36562.301	35187.664	32748.5	37292.18	35804.648	31902.824	37133.07	39094.09	36301.07	38305.742	38724.672	37640.297	34744.789	33886.715	30976.82	39639.367	35802.902	33565.941	39345.348	34470.645	37834.914	39858.227	35915.551	37376.965	37804.922	31268.354	36984.062	38116.512	35876.949	36392.648	37024.121	35145.801
1.6011	37716.598	39048.918	36232.102	38007.598	35895.52	32765.443	36880.355	35738.883	32993.816	36649.492	37785.059	37128.273	38916.453	36071.758	37251.762	33506.672	34180.566	30602.322	38193.559	36922.594	36074.949	39836.625	33796.328	37354.473	39850.172	37461.246	35583.785	37101.973	32000.643	35267.832	36926.094	36932.906	37316.773	38303.488	35944.363
1.7345	38362.762	37827.051	36980.84	37428.258	35566.527	32416.73	36664.078	36069.656	33644.723	35493.141	38370.02	37155.078	40279.656	37312.625	36660.863	33646.336	33193.133	28524.486	39905.18	37510.414	34534.836	39886.949	33675.57	39441.254	42319.191	38122.996	37256.363	36038.254	33871.488	34629.395	35344.32	38766.879	37279.645	37794.477	35220.082
1.8679	38457.172	40297.375	37623.738	36507.613	35585.707	32868.605	37197.668	35556.457	32290.736	37467.973	35289.988	38303.191	38350.57	37433.676	37878.473	35117.227	33460.312	29418.498	38891.379	36720.145	35876.379	39528.465	32607.062	40601.352	39982.809	38566.031	36905.055	37030.211	33022.742	33559.918	35388.676	37370.18	36467.172	37228.184	34507.227
2.0013	38469.664	45881.727	38223.926	36473.25	36793.59	34317.355	38286.375	36393.195	35188.227	37151.738	35881.008	39102	39589.902	38502.117	39524.574	35075.723	34069.246	30972.629	39393.141	36650.129	37863.238	39584.629	34395.359	41972.703	39960.762	37504.582	37886.465	37950.84	32500.977	34792.133	34111.762	36740.652	38710.82	39711.895	36297.191
2.1348	38955.707	53087.996	36369.098	35747.148	37651.152	35199.281	40292.609	37481.488	36837.09	39836.77	37749.039	38133.836	41959.605	41225.836	40062.441	34671.738	35466.039	33109.738	40412.418	38452.652	39140.152	38156.988	35556.957	43145.484	37941.895	37941.016	40049.988	37393.645	31493.529	35112.137	35487.613	38953.695	39855.203	40662.477	35644.012
2.2682	39971.594	69677.172	39111.68	35829.52	37761.59	41693.367	43032.008	37646.957	43583.547	39640.887	36824.605	40807.453	45756.301	42100.852	39306.875	35390.969	36912.367	39311.016	45043.422	40250.168	43367.848	40767.039	33802.965	47632.152	39848.43	41170.887	42924.797	37934.621	32409.549	34590.816	36660.039	41611.48	41421.363	41234.484	35897.27
2.4016	45194.605	109462.281	41268.27	36969.754	39896.598	57085.012	52827.695	37980.926	54640.652	41421.113	37756.387	43726.57	54854.289	47667.402	42789.633	38265.949	38867.906	47847.941	52709.73	42228.07	49363.941	45192.254	36170.547	61750.059	38686.82	41237.078	52557.793	37852.09	34407.035	35124.484	36489.547	48203.113	47604.844	41703.562	37764.02
2.535	53423.539	179714.812	42713.211	37462.328	46848.727	96153.508	71791.938	43439.926	69633.234	45942.941	40405.762	50914.578	74026.773	66044.141	54618.18	42302.141	44093.801	67518.383	72717.531	45021.32	69421.93	50668.41	37892.273	93262.477	41067.773	44969.266	83194.75	37905.219	38802.449	35392.188	38460.918	71457.516	63735.453	44824.957	38921.352
2.6684	71552.812	214457.562	50797.184	36836.18	62449.812	141389.156	80700.234	52833.062	74472.945	58179.004	46895.035	67762.359	91561.086	89193.891	81163.711	59750.453	57915.777	88659.727	113261.508	54058.707	104886.297	65113.281	45157.414	148183.672	40940.453	55924.621	138184.656	38222.168	48680.043	38965.227	40820.047	118259.383	89360.703	54453.285	49239.973
2.8019	97760.836	178582.266	63374.207	39883.777	96119.609	154562.078	63949.406	59583.219	64974.215	90644.438	59222.539	111715.68	80087.445	96231.539	109884	83801.461	88972.594	76980.625	162029.984	76884.445	120762.305	99154.219	63231.781	175001.484	48193.211	82267.055	174850.469	40969.859	56848.621	42610.453	50371.082	145042.266	133469.031	78986.062	72411.5
2.9353	103843.102	110717.891	73630.398	44119.328	130224.055	114054.625	47278.609	51336.996	48888.16	138766.062	84979.82	151568.375	57119.164	74502.18	104184.266	89369.039	129778.562	50838.961	169390.797	99433.398	99170.891	127052.984	91865.109	133805.688	65038.898	129516.727	140610.891	43873.113	50773.781	54914.402	70472.422	121691.641	185093.688	123523.703	104870.156
3.0687	77857.305	67199.039	64302.172	55901.391	118643.773	66821.773	40738.539	44547.219	41692.926	169740.719	99171.039	135914.625	44779.219	NaN	73676.078	64745.391	129343.625	39385.695	124562.023	92888.961	66088.633	110332.695	81841.812	79388.844	88021.703	155176.156	86095.945	52486.879	41542.648	84328.93	86906.156	78645.141	170799.625	137725.859	111660.039
3.2021	53568.438	53002.617	48646.09	87445	77976.484	45499.41	39284.234	41065.336	36012.473	141434.781	77767.367	88815.773	40760.391	NaN	52770.387	46297.898	97247.023	NaN	76571.578	70074.68	51050.016	74020.969	57823.035	56622.441	87195.812	117920.125	56902.316	64176.621	35552.578	117971.977	78842.281	53244.867	108408.102	102637.805	78378.711
3.3356	42258.781	44896.875	40615.984	128515.836	50247.645	39507.34	NaN	NaN	NaN	89350.773	54390.586	58827.059	39983.324	NaN	45493.578	NaN	68361.547	NaN	53545.574	49787.859	44823.238	51570.254	43090.242	44915.348	66554.781	73651.039	46990.336	65013.32	NaN	108503.516	63370.125	43404.961	62626.672	67280.328	54259.875
3.469	38699.16	NaN	38754.734	124379.469	42637.668	NaN	NaN	NaN	NaN	60536.395	42838.16	46102.289	NaN	NaN	41073.051	NaN	50285.902	NaN	44478.484	NaN	NaN	45734.461	37092.109	40908.676	50607.699	52863.566	43878.199	55151.984	NaN	71493.469	51118.684	41771.746	47992.945	55065.051	45024.875
3.6024	NaN	NaN	39211.656	82470.562	39612.855	NaN	NaN	NaN	NaN	47484.453	NaN	41169.363	NaN	NaN	40041.34	NaN	NaN	NaN	NaN	NaN	NaN	NaN	NaN	NaN	45499.184	46161.059	NaN	55921.074	NaN	49212.156	42972.875	NaN	41125.383	53626.18	39911.906
3.7358	NaN	NaN	39103.488	52751.531	NaN	NaN	NaN	NaN	NaN	42720.328	NaN	NaN	NaN	NaN	40604.207	NaN	NaN	NaN	NaN	NaN	NaN	NaN	NaN	NaN	NaN	43391.746	NaN	NaN	NaN	44065.324	39101.922	NaN	NaN	50305.863	38286.195
3.8692	NaN	NaN	NaN	45680.551	NaN	NaN	NaN	NaN	NaN	40680.922	NaN	NaN	NaN	NaN	NaN	NaN	NaN	NaN	NaN	NaN	NaN	NaN	NaN	NaN	NaN	NaN	NaN	NaN	NaN	NaN	NaN	NaN	NaN	NaN	NaN
4.0027	NaN	NaN	NaN	NaN	NaN	NaN	NaN	NaN	NaN	NaN	NaN	NaN	NaN	NaN	NaN	NaN	NaN	NaN	NaN	NaN	NaN	NaN	NaN	NaN	NaN	NaN	NaN	NaN	NaN	NaN	NaN	NaN	NaN	NaN	NaN
4.1361	NaN	NaN	NaN	NaN	NaN	NaN	NaN	NaN	NaN	NaN	NaN	NaN	NaN	NaN	NaN	NaN	NaN	NaN	NaN	NaN	NaN	NaN	NaN	NaN	NaN	NaN	NaN	NaN	NaN	NaN	NaN	NaN	NaN	NaN	NaN
4.2695	NaN	NaN	NaN	NaN	NaN	NaN	NaN	NaN	NaN	NaN	NaN	NaN	NaN	NaN	NaN	NaN	NaN	NaN	NaN	NaN	NaN	NaN	NaN	NaN	NaN	NaN	NaN	NaN	NaN	NaN	NaN	NaN	NaN	NaN	NaN
4.4029	NaN	NaN	NaN	NaN	NaN	NaN	NaN	NaN	NaN	NaN	NaN	NaN	NaN	NaN	NaN	NaN	NaN	NaN	NaN	NaN	NaN	NaN	NaN	NaN	NaN	NaN	NaN	NaN	NaN	NaN	NaN	NaN	NaN	NaN	NaN
4.5363	NaN	NaN	NaN	NaN	NaN	NaN	NaN	NaN	NaN	NaN	NaN	NaN	NaN	NaN	NaN	NaN	NaN	NaN	NaN	NaN	NaN	NaN	NaN	NaN	NaN	NaN	NaN	NaN	NaN	NaN	NaN	NaN	NaN	NaN	NaN
4.6698	NaN	NaN	NaN	NaN	NaN	NaN	NaN	NaN	NaN	NaN	NaN	NaN	NaN	NaN	NaN	NaN	NaN	NaN	NaN	NaN	NaN	NaN	NaN	NaN	NaN	NaN	NaN	NaN	NaN	NaN	NaN	NaN	NaN	NaN	NaN
4.8032	NaN	NaN	NaN	NaN	NaN	NaN	NaN	NaN	NaN	NaN	NaN	NaN	NaN	NaN	NaN	NaN	NaN	NaN	NaN	NaN	NaN	NaN	NaN	NaN	NaN	NaN	NaN	NaN	NaN	NaN	NaN	NaN	NaN	NaN	NaN
4.9366	NaN	NaN	NaN	NaN	NaN	NaN	NaN	NaN	NaN	NaN	NaN	NaN	NaN	NaN	NaN	NaN	NaN	NaN	NaN	NaN	NaN	NaN	NaN	NaN	NaN	NaN	NaN	NaN	NaN	NaN	NaN	NaN	NaN	NaN	NaN
5.07	NaN	NaN	NaN	NaN	NaN	NaN	NaN	NaN	NaN	NaN	NaN	NaN	NaN	NaN	NaN	NaN	NaN	NaN	NaN	NaN	NaN	NaN	NaN	NaN	NaN	NaN	NaN	NaN	NaN	NaN	NaN	NaN	NaN	NaN	NaN
5.2035	NaN	NaN	NaN	NaN	NaN	NaN	NaN	NaN	NaN	NaN	NaN	NaN	NaN	NaN	NaN	NaN	NaN	NaN	NaN	NaN	NaN	NaN	NaN	NaN	NaN	NaN	NaN	NaN	NaN	NaN	NaN	NaN	NaN	NaN	NaN
5.3369	NaN	NaN	NaN	NaN	NaN	NaN	NaN	NaN	NaN	NaN	NaN	NaN	NaN	NaN	NaN	NaN	NaN	NaN	NaN	NaN	NaN	NaN	NaN	NaN	NaN	NaN	NaN	NaN	NaN	NaN	NaN	NaN	NaN	NaN	NaN
5.4703	NaN	NaN	NaN	NaN	NaN	NaN	NaN	NaN	NaN	NaN	NaN	NaN	NaN	NaN	NaN	NaN	NaN	NaN	NaN	NaN	NaN	NaN	NaN	NaN	NaN	NaN	NaN	NaN	NaN	NaN	NaN	NaN	NaN	NaN	NaN
5.6037	NaN	NaN	NaN	NaN	NaN	NaN	NaN	NaN	NaN	NaN	NaN	NaN	NaN	NaN	NaN	NaN	NaN	NaN	NaN	NaN	NaN	NaN	NaN	NaN	NaN	NaN	NaN	NaN	NaN	NaN	NaN	NaN	NaN	NaN	NaN
5.7371	NaN	NaN	NaN	NaN	NaN	NaN	NaN	NaN	NaN	NaN	NaN	NaN	NaN	NaN	NaN	NaN	NaN	NaN	NaN	NaN	NaN	NaN	NaN	NaN	NaN	NaN	NaN	NaN	NaN	NaN	NaN	NaN	NaN	NaN	NaN
