0.00000,37464.539
0.13342,38436.715
0.26684,37568.250
0.40027,38338.996
0.53369,36633.098
0.66711,38956.875
0.80053,39945.266
0.93395,46626.996
1.06737,62130.480
1.20080,85225.008
1.33422,85949.234
1.46764,65519.102
1.60106,49367.129
1.73448,42687.203
