0.00000,38135.008
0.13342,38335.188
0.26684,38768.000
0.40027,36756.250
0.53369,38736.723
0.66711,39637.848
0.80053,37765.324
0.93395,36538.207
1.06737,36894.695
1.20080,36692.242
1.33422,36333.348
1.46764,37587.957
1.60106,38240.465
1.73448,37273.898
1.86791,38840.637
2.00133,42454.199
2.13475,50793.562
2.26817,71898.969
2.40159,98808.117
2.53502,91919.719
2.66844,65867.617
2.80186,50463.117
