0.00000,32753.559
0.13342,32943.859
0.26684,32199.906
0.40027,33002.090
0.53369,32710.820
0.66711,31559.904
0.80053,34029.996
0.93395,33170.891
1.06737,32108.412
1.20080,31745.309
1.33422,32645.852
1.46764,33250.875
1.60106,35114.105
1.73448,36602.277
1.86791,47324.926
2.00133,65521.820
2.13475,77641.234
2.26817,72255.992
2.40159,52537.109
2.53502,38712.965
