X,Y
0.00000,14440.000
0.13342,14555.594
0.26684,15347.843
0.40027,18075.152
0.53369,22378.854
0.66711,24254.262
0.80053,21766.332
0.93395,20969.918
1.06737,20762.047
1.20080,19636.840
1.33422,18131.449
1.46764,19126.641
1.60106,22875.777
1.73448,20436.990
1.86791,19082.691
2.00133,17933.246
2.13475,17036.516
2.26817,17173.875
2.40159,15684.626
2.53502,15757.166
2.66844,17402.080
2.80186,19545.477
2.93528,20812.148
3.06870,18889.883
3.20212,15115.024
3.33555,14288.442
3.46897,13634.714
3.60239,13609.274
3.73581,13706.348
