0.0000	35528.6289
0.1334	33834.1055
0.2668	34492.0781
0.4003	34902.6953
0.5337	33448.3125
0.6671	33564.1914
0.8005	35427.9258
0.9340	35448.0547
1.0674	36063.6211
1.2008	34106.4062
1.3342	35684.5352
1.4676	35497.3945
1.6011	35670.2734
1.7345	35095.5781
1.8679	34074.8203
2.0013	35184.2383
2.1347	35586.2578
2.2682	34715.9258
2.4016	37275.1328
2.5350	40710.1484
2.6684	50292.6914
2.8019	61803.8008
2.9353	55275.1445
3.0687	44543.6758
3.2021	39492.7461
3.3355	37625.8281
