x	Y_20180514_15100_10_4g	Y_20180514_15100_13_3g	Y_20180514_15100_14_2g	Y_20180514_15100_15_1g	Y_20180514_15100_17_1g	Y_20180514_15100_17_5g	Y_20180514_15100_19_1g	Y_20180514_15100_22_1g	Y_20180514_15100_25_3g	Y_20180514_15100_6_2g	Y_20180514_15100_6_3g	Y_20180514_15100_8_3g	Y_20180514_15100_8_5g
0	30098.051	33001.703	33175.914	35209.727	34296.859	26503.766	32563.059	30791.537	30442.207	34693.152	35031.281	28424.066	31362.65
0.1334	28949.463	31079.131	35285.824	35693.191	34448.695	27648.721	32685.732	31010.869	29603.176	35954.348	34998.348	28392.633	31459.219
0.2668	29608.881	32218.158	35675.684	35563.371	35600.652	26231.955	31913.266	30729.189	29209.203	34800.574	35029.102	28955.771	30337.24
0.4003	29525.555	33173.172	35457.121	35138.867	36811.777	26859.975	31384.986	32317.961	29631.506	34646.281	35836.148	29910.938	29990.639
0.5337	29653.148	34004.598	34213.762	35103.992	37031.148	27335.865	32005.26	31408.885	31871.58	33679.598	36351.738	26629.078	31137.217
0.6671	29744.418	32902.277	33421.309	33885.059	37571.852	26927.453	34780.242	31869.176	30895.777	34964.254	35271.664	30425.137	29839.799
0.8005	27687.74	33127.695	33866.875	34165.129	37087.688	27447.637	31980.234	32647.137	31206.826	34418.199	34193.059	28478.881	30926.264
0.934	29567.729	33670.727	33892.207	34555.078	37294.047	26145.348	31120.514	32884.113	31659.236	35369.715	34746.832	29047.023	31556.713
1.0674	29832.061	34977.777	34946.117	35781.91	37921.688	26520.508	31913.852	32565.664	32116.582	35111.316	35845.113	29333.967	30923.537
1.2008	29647.703	33381.707	35631.844	34695.211	38302.117	27451.385	32143.547	33254.324	32602.826	35069.863	34853.512	29896.832	32079.061
1.3342	30484.186	33056.859	35427.754	36971.156	46595.918	28740.025	32323.912	34299.918	36661.125	34476.184	34746.914	29795.383	31316.82
1.4676	31399.857	34313.059	33609.973	36438.227	61215.801	26703.951	32428.018	34940.668	40439.027	34869.582	36919.867	30522.342	32482.338
1.6011	30564.811	34566.852	34577.184	38721.777	66177.594	27095.045	35260.543	36832.012	52176.508	34713.898	40043.625	29872.711	33247.484
1.7345	30868.666	34632.906	35006.332	41436.727	55571.031	28063.83	34173.281	38897.973	76736.023	34987.273	44166.035	29744.574	34206.488
1.8679	31893.744	35174.844	35578.012	43588.215	46561.684	28127.898	33710.891	42202.82	86729.898	36776.379	52800.5	29615.789	34169.34
2.0013	35485.469	37370.316	35490.902	43909.371	39417.957	33209.992	34796.23	53869.219	68243.484	46546.098	57025.582	28089.891	37118.152
2.1348	44928.402	43320.715	39277.184	51161.996	38877.43	36057.832	34605.695	80659.391	49115.945	67582.68	47687.352	28980.742	46591.277
2.2682	53142.332	59557.258	43358.98	62985.785	37616.277	37399.914	33037	127050.453	38398.84	107207.328	39170.613	29529.506	62818.961
2.4016	48221.965	75128.664	49773.832	64574.684	34663.305	33654.418	32738.91	159372.781	37128.742	133634.234	37860.957	28990.107	63955.445
2.535	38416.086	73873.742	51654.086	49132.863	NaN	30324.896	33486.895	129376.617	35614.855	108041.727	NaN	30078.838	53845.176
2.6684	32315.738	56563.586	45758.617	39232.938	NaN	29381.887	36197.266	75810.852	NaN	62665.191	NaN	31077.078	41431.863
2.8019	31489.771	43433.062	42630.121	34971.449	NaN	28206.541	39931.812	49660.961	NaN	45921.707	NaN	34498.203	36142.352
2.9353	32412.91	37082.316	NaN	34957.254	NaN	29599.279	47728.777	41427.523	NaN	40728.426	NaN	39569.508	33416.008
3.0687	31492.367	35277.289	NaN	34329.402	NaN	NaN	64833.426	37233.27	NaN	37474.082	NaN	53302.695	33587.66
3.2021	34734.242	34193.93	NaN	34128.375	NaN	NaN	84190.984	35201.336	NaN	36811.781	NaN	58702.793	NaN
3.3356	NaN	NaN	NaN	33549.055	NaN	NaN	78251.672	33724.082	NaN	36035.395	NaN	46707.207	NaN
3.469	NaN	NaN	NaN	33753.184	NaN	NaN	59494.887	32371.541	NaN	34548.586	NaN	37547.574	NaN
3.6024	NaN	NaN	NaN	NaN	NaN	NaN	43960.656	32983.074	NaN	36197.008	NaN	33993.758	NaN
3.7358	NaN	NaN	NaN	NaN	NaN	NaN	37934.676	32530.469	NaN	NaN	NaN	31460.027	NaN
3.8692	NaN	NaN	NaN	NaN	NaN	NaN	36666.055	NaN	NaN	NaN	NaN	31496.617	NaN
4.0027	NaN	NaN	NaN	NaN	NaN	NaN	35245.145	NaN	NaN	NaN	NaN	31375.096	NaN
4.1361	NaN	NaN	NaN	NaN	NaN	NaN	34335.949	NaN	NaN	NaN	NaN	31129.199	NaN
4.2695	NaN	NaN	NaN	NaN	NaN	NaN	35009.324	NaN	NaN	NaN	NaN	30769.258	NaN
4.4029	NaN	NaN	NaN	NaN	NaN	NaN	34901.41	NaN	NaN	NaN	NaN	29178.703	NaN
4.5363	NaN	NaN	NaN	NaN	NaN	NaN	NaN	NaN	NaN	NaN	NaN	29338.012	NaN
4.6698	NaN	NaN	NaN	NaN	NaN	NaN	NaN	NaN	NaN	NaN	NaN	NaN	NaN
4.8032	NaN	NaN	NaN	NaN	NaN	NaN	NaN	NaN	NaN	NaN	NaN	NaN	NaN
4.9366	NaN	NaN	NaN	NaN	NaN	NaN	NaN	NaN	NaN	NaN	NaN	NaN	NaN
5.07	NaN	NaN	NaN	NaN	NaN	NaN	NaN	NaN	NaN	NaN	NaN	NaN	NaN
5.2035	NaN	NaN	NaN	NaN	NaN	NaN	NaN	NaN	NaN	NaN	NaN	NaN	NaN
5.3369	NaN	NaN	NaN	NaN	NaN	NaN	NaN	NaN	NaN	NaN	NaN	NaN	NaN
5.4703	NaN	NaN	NaN	NaN	NaN	NaN	NaN	NaN	NaN	NaN	NaN	NaN	NaN
5.6037	NaN	NaN	NaN	NaN	NaN	NaN	NaN	NaN	NaN	NaN	NaN	NaN	NaN
