0.00000,32607.561
0.13342,33248.207
0.26684,32951.965
0.40027,33264.723
0.53369,33135.613
0.66711,32604.148
0.80053,31616.619
0.93395,32791.484
1.06737,31885.555
1.20080,32445.543
1.33422,32267.592
1.46764,33614.742
1.60106,33408.582
1.73448,33767.582
1.86791,36713.043
2.00133,42490.711
2.13475,55918.680
2.26817,85053.266
2.40159,102750.781
2.53502,81671.492
2.66844,54983.711
