x	Y_20180130_15109_12_12g	Y_20180130_15109_14_10g_left	Y_20180130_15109_15_13g	Y_20180130_15109_16_2g_left	Y_20180130_15109_17_11_1g	Y_20180130_15109_18_8g	Y_20180130_15109_20_3g	Y_20180130_15109_20_5g	Y_20180130_15109_22_2g	Y_20180130_15109_25_2g	Y_20180130_15109_25_8g	Y_20180130_15109_31_1g	Y_20180130_15109_35_4g	Y_20180130_15109_41_2g	Y_20180130_15109_41_7g	Y_20180130_15109_7_7g_left	Y_20180130_15109_42_6g	Y_20180130_15109_10_1g_right	Y_20180130_15109_2_15g	Y_20180130_15109_3_3g_right	Y_20180130_15109_5_2g_right	Y_20180130_15109_5_6g_right	Y_20180130_15109_14_15g	Y_20180130_15109_14_16g	Y_20180130_15109_14_6g_right	Y_20180130_15109_14_7g_right	Y_20180130_15109_14_8g_right
0	11348.467	13386.494	15388.997	12524.841	11548.956	12036.786	12454.1	11492.315	12528.16	14166.295	10790.704	11563.11	12418.341	14435.247	10462.231	10359.253	10891.725	11816.994	11327.225	10488.002	10460.361	10825.847	11532.407	12824.464	12779.5	13231.341	12398.826
0.1334	12571.605	14506.1	16838.68	12462.791	13195.407	13523.114	13146.235	12745.578	14639.091	14984.089	11973.683	12145.727	13127.969	13932.604	10793.428	10581.688	11537.04	11914.124	11563.648	11096.579	11371.891	11128.5	12544.362	13706.77	13918.342	14456.619	13949.447
0.2668	15410.317	14981.307	20709.955	13767.183	15751.789	13867.452	14401.619	13981.099	16025.452	15361.719	14067.379	14316.526	15951.098	14539.967	12221.527	10878.164	12375.304	13472.551	12815.921	11656.871	12466.154	12811.94	13487.565	17206.16	15331.51	16303.205	14865.188
0.4003	19256.754	17780.975	27867.639	16191.074	20307.73	16425.076	16573.965	15223.888	18143.428	16847.83	17933.043	17242.588	17463.578	14948.039	13481.51	11078.671	15199.5	15940.528	16336.911	12222.341	15325.968	15941.146	15448.737	20647.438	17279.463	18706.432	18091.125
0.5337	19888.715	22217.049	33510.039	20571.686	20961.486	18897.986	20713.711	18407.717	18267.709	19788.406	21238.145	20224.361	19220.27	16339.812	15185.381	12634.977	18328.83	18881.359	19534.701	13345.669	17220.338	19275.574	15418.916	21857.869	22918.965	22269.637	19341.986
0.6671	17591.182	27673.391	33059.395	24303.557	20860.217	18769.479	23939.775	20661.031	16488.014	21732.145	21769.635	22798.49	19432.727	18855.709	17794.273	14625.037	21116.994	18221.207	23748.637	15749.389	15918.158	19589.984	14958.562	22608.135	26637.051	20755.574	20052.748
0.8005	16342.457	33298.652	32240.574	23354.576	18215.635	17396.02	23610.221	20431.984	15256.307	23662.434	20104.631	25932.529	16792.73	20718.529	16750.639	17228.059	22707.459	18099.555	25031.023	15553.203	14917.084	17776.41	13491.629	20610.893	27499.516	19803.664	20955.812
0.934	14752.892	29980.688	30975.545	22631.424	17195.432	16969.764	22032.572	17741.262	15485.231	23514.998	18411.191	26145.547	16323.437	21314.814	15081.222	19255.248	22921.83	17789.137	24698.488	14487.741	14282.535	16746.459	13079.57	17534.682	22428.725	18452.68	20100.801
1.0674	14358.959	28818.482	29425.346	20084.516	17327.512	17061.014	19685.75	17412.473	15099.605	24568.781	16961	24193.477	15557.835	19372.637	13929.57	18171.412	22151.984	15741.466	23925.977	14364.634	14048.344	14945.805	13255.475	16699.408	19807.156	17227.553	19469.211
1.2008	13935.88	24782.391	26485.998	18333.723	16522.385	16852.527	18596.723	16751.281	14502.086	24253.115	17585.133	24882.605	15357.081	18090.916	13969.042	16189.618	20677.904	15162.995	21017.594	14071.75	14308.791	13310.37	14905.864	15930.835	20106.23	16666.881	17907.641
1.3342	14155.646	22800.959	24988.783	17218.162	15792.23	16893.131	17496.809	17522.828	14731.033	24645.754	17582.367	22094.852	15109.508	18003.824	13766.188	14265.879	19336.205	13943.088	20908.287	13910.706	14699.513	14329.556	14502.743	15420.444	18500.869	16127.132	17470.123
1.4676	15111.645	21548.148	22965.355	14968.209	15708.129	16977.994	15975.199	16835.809	14552.878	22391.16	19338.619	20115.146	14983.555	17447.287	13499.476	14694.743	19058.447	14780.612	20268.273	13917.21	15071.476	14438.801	14685.463	14081.033	18021.984	15207.524	18257.293
1.6011	15169.791	20442.799	23388.625	13942.452	14718.181	16003.612	16066.034	16945.455	15098.227	20812.387	18034.613	18098.508	13961.364	18087.312	13938.327	15091.425	17663.873	14953.943	19317.105	14019.416	15755.814	14892.304	14808.75	14180.167	17117.271	15805.886	17343.084
1.7345	15721.456	19286.893	21351.152	14190.487	13317.351	14963.309	15258.431	16402.182	14081.355	18445.162	17365.664	18163.766	13445.135	18512.865	14284.991	15209.195	17085.258	15257.699	18493.625	15082.239	16048.471	16148.495	14094.648	14572.961	17812.793	16007.226	16855.191
1.8679	17402.529	18291.303	20401.158	13674.92	12828.877	13827.115	15004.843	15667.574	14033.064	17664.787	15468.696	17918.729	12680.085	18195.127	15052.596	15679.475	15732.277	15315.23	16181.363	14282.812	15328.104	15679.483	13303.345	13768.483	17706.672	16154.248	17938.309
2.0013	17930.271	17054.539	18203.717	13605.229	12833.76	13401.336	15044.385	16363.921	15014.117	18722.453	14816.266	17012.32	12284.564	17308.771	15428.835	15271.241	16109.431	15642.231	15704.962	13517.975	15838.924	15179.606	13651.876	15054.244	18496.203	15837.499	18353.236
2.1348	18088.072	17095.406	16654.986	13886.74	12718.51	13525.348	15131.852	16997.48	15061.89	20151.967	14289.631	16506.342	12760.481	16166.175	16279.819	14960.345	16189.121	14740.571	14343.157	12367.9	15853.866	15856.54	13885.427	15645.553	18332.467	15204.762	20304.127
2.2682	18234.672	17147.34	15127.315	14608.368	12973.471	13429.027	16321.634	17315.207	14479.839	20603.08	12780.302	16449.904	13262.449	15817.166	16431.334	14594.256	16019.767	14943.132	12660.748	12173.303	14489.596	15660.193	15232.127	15174.54	16674.691	15132.752	20701.576
2.4016	16733.988	16438.805	13281.122	15146.951	13342.285	12965.756	15089.22	16847.049	14077.289	20148.508	13536.222	15133.243	13658.967	16468.367	16973.654	14542.879	14736.973	15339.716	13286.956	11858.676	13742.323	14879.602	16518.367	15282.056	16413.447	15320.437	19641.213
2.535	15026.81	15942.022	12876.753	14397.068	13000.37	12914.112	14434.678	15526.464	12222.933	19062.043	12938.632	15117.934	13428.662	16647.76	16639.307	14826.985	14098.941	15213.047	14578.561	11666.669	12983.907	14990.681	16817.297	14618.843	16002.107	14723.578	18412.572
2.6684	13527.078	15610.883	11874.558	13435.679	12816.42	13155.349	14007.548	13603.207	12255.532	18017.967	13185.723	15626.162	12595.438	15233.462	15709.207	14200.987	14304.503	14796.168	15088.966	11591.615	12385.857	14592.057	15127.556	14071.821	15693.117	13565.963	16579.982
2.8019	13813.398	15459.272	11003.737	12707.209	12237.25	12833.114	13813.479	12986.144	11708.926	16791.264	12829.516	15417.96	12081.435	14777.684	14402.686	14415.08	14023.488	13501.371	15787.925	11109.742	12518.395	13841.552	13286.81	13524.02	13928.827	13090.938	14758.389
2.9353	13530.044	14646.991	11617.459	12615.517	11394.129	12991.648	12912.272	12203.167	11499.068	15118.827	12049.896	14900.797	12412.902	14732.1	13830.977	12934.558	13906.962	12558.429	16417.275	10656.86	12781.546	12878.028	NaN	13191.867	13304.281	13560.134	14702.314
3.0687	12469.89	14405.87	12096.306	12402.341	12343.228	12959.212	NaN	12210.839	11441.589	13637.836	12333.462	14139.508	11697.535	14132.408	13548.401	12471.71	13083.528	12040.766	16273.738	10618.265	12786.188	13572.769	NaN	12531.698	13531.159	12782.574	14563.056
3.2021	12830.938	14228.873	11610.026	12012.572	11398.722	13030.376	NaN	12506.486	NaN	13663.306	11633.063	15016.402	11571.31	14599.808	12646.771	11469.357	12273.098	12463.353	14572.05	10663.998	NaN	13093.154	NaN	12496.479	13024.443	NaN	13631.664
3.3356	12719.093	12784.589	NaN	NaN	NaN	12580.773	NaN	13419.953	NaN	14120.861	11936.435	14425.46	NaN	14666.005	13635.998	11534.639	12218.548	NaN	NaN	10434.607	NaN	13013.776	NaN	13158.064	12909.57	NaN	13403.707
3.469	NaN	12721.017	NaN	NaN	NaN	NaN	NaN	12951.42	NaN	NaN	NaN	14137.655	NaN	14453.81	13921.068	11283.022	12309.887	NaN	NaN	NaN	NaN	12596.783	NaN	NaN	13518.896	NaN	12883.026
3.6024	NaN	12816.928	NaN	NaN	NaN	NaN	NaN	13966.271	NaN	NaN	NaN	14617.635	NaN	13916.16	NaN	11557.53	NaN	NaN	NaN	NaN	NaN	NaN	NaN	NaN	NaN	NaN	NaN
3.7358	NaN	NaN	NaN	NaN	NaN	NaN	NaN	14193.31	NaN	NaN	NaN	15178.68	NaN	13935.505	NaN	11326.812	NaN	NaN	NaN	NaN	NaN	NaN	NaN	NaN	NaN	NaN	NaN
3.8692	NaN	NaN	NaN	NaN	NaN	NaN	NaN	NaN	NaN	NaN	NaN	NaN	NaN	NaN	NaN	NaN	NaN	NaN	NaN	NaN	NaN	NaN	NaN	NaN	NaN	NaN	NaN
4.0027	NaN	NaN	NaN	NaN	NaN	NaN	NaN	NaN	NaN	NaN	NaN	NaN	NaN	NaN	NaN	NaN	NaN	NaN	NaN	NaN	NaN	NaN	NaN	NaN	NaN	NaN	NaN
4.1361	NaN	NaN	NaN	NaN	NaN	NaN	NaN	NaN	NaN	NaN	NaN	NaN	NaN	NaN	NaN	NaN	NaN	NaN	NaN	NaN	NaN	NaN	NaN	NaN	NaN	NaN	NaN
4.2695	NaN	NaN	NaN	NaN	NaN	NaN	NaN	NaN	NaN	NaN	NaN	NaN	NaN	NaN	NaN	NaN	NaN	NaN	NaN	NaN	NaN	NaN	NaN	NaN	NaN	NaN	NaN
4.4029	NaN	NaN	NaN	NaN	NaN	NaN	NaN	NaN	NaN	NaN	NaN	NaN	NaN	NaN	NaN	NaN	NaN	NaN	NaN	NaN	NaN	NaN	NaN	NaN	NaN	NaN	NaN
4.5363	NaN	NaN	NaN	NaN	NaN	NaN	NaN	NaN	NaN	NaN	NaN	NaN	NaN	NaN	NaN	NaN	NaN	NaN	NaN	NaN	NaN	NaN	NaN	NaN	NaN	NaN	NaN
4.6698	NaN	NaN	NaN	NaN	NaN	NaN	NaN	NaN	NaN	NaN	NaN	NaN	NaN	NaN	NaN	NaN	NaN	NaN	NaN	NaN	NaN	NaN	NaN	NaN	NaN	NaN	NaN
4.8032	NaN	NaN	NaN	NaN	NaN	NaN	NaN	NaN	NaN	NaN	NaN	NaN	NaN	NaN	NaN	NaN	NaN	NaN	NaN	NaN	NaN	NaN	NaN	NaN	NaN	NaN	NaN
4.9366	NaN	NaN	NaN	NaN	NaN	NaN	NaN	NaN	NaN	NaN	NaN	NaN	NaN	NaN	NaN	NaN	NaN	NaN	NaN	NaN	NaN	NaN	NaN	NaN	NaN	NaN	NaN
5.07	NaN	NaN	NaN	NaN	NaN	NaN	NaN	NaN	NaN	NaN	NaN	NaN	NaN	NaN	NaN	NaN	NaN	NaN	NaN	NaN	NaN	NaN	NaN	NaN	NaN	NaN	NaN
5.2035	NaN	NaN	NaN	NaN	NaN	NaN	NaN	NaN	NaN	NaN	NaN	NaN	NaN	NaN	NaN	NaN	NaN	NaN	NaN	NaN	NaN	NaN	NaN	NaN	NaN	NaN	NaN
5.3369	NaN	NaN	NaN	NaN	NaN	NaN	NaN	NaN	NaN	NaN	NaN	NaN	NaN	NaN	NaN	NaN	NaN	NaN	NaN	NaN	NaN	NaN	NaN	NaN	NaN	NaN	NaN
5.4703	NaN	NaN	NaN	NaN	NaN	NaN	NaN	NaN	NaN	NaN	NaN	NaN	NaN	NaN	NaN	NaN	NaN	NaN	NaN	NaN	NaN	NaN	NaN	NaN	NaN	NaN	NaN
5.6037	NaN	NaN	NaN	NaN	NaN	NaN	NaN	NaN	NaN	NaN	NaN	NaN	NaN	NaN	NaN	NaN	NaN	NaN	NaN	NaN	NaN	NaN	NaN	NaN	NaN	NaN	NaN
5.7371	NaN	NaN	NaN	NaN	NaN	NaN	NaN	NaN	NaN	NaN	NaN	NaN	NaN	NaN	NaN	NaN	NaN	NaN	NaN	NaN	NaN	NaN	NaN	NaN	NaN	NaN	NaN
