0.00000,13163.655
0.13342,14060.518
0.26684,15928.973
0.40027,17952.004
0.53369,19454.389
0.66711,19320.441
0.80053,18326.119
0.93395,17844.410
1.06737,19122.363
1.20080,19007.289
1.33422,18362.656
1.46764,18026.137
1.60106,16877.441
1.73448,16937.414
1.86791,17428.971
2.00133,16970.264
2.13475,16750.219
2.26817,16431.082
2.40159,16816.041
2.53502,15534.040
2.66844,14788.760
2.80186,14151.773
2.93528,13129.104
3.06870,13122.633
3.20212,13081.512
3.33555,13237.289
3.46897,12476.932
