0.00000,15606.935
0.13342,15909.230
0.26684,18895.057
0.40027,21272.494
0.53369,23173.209
0.66711,25364.156
0.80053,23521.455
0.93395,23938.404
1.06737,20616.088
1.20080,19412.311
1.33422,20670.455
1.46764,19504.693
1.60106,19968.385
1.73448,20439.406
1.86791,19646.383
2.00133,17064.543
2.13475,14306.222
2.26817,13628.607
2.40159,13124.023
2.53502,13036.642
2.66844,12986.902
2.80186,12555.058
