X,Y
0.00000,11532.407
0.13342,12544.362
0.26684,13487.565
0.40027,15448.737
0.53369,15418.916
0.66711,14958.562
0.80053,13491.629
0.93395,13079.570
1.06737,13255.475
1.20080,14905.864
1.33422,14502.743
1.46764,14685.463
1.60106,14808.750
1.73448,14094.648
1.86791,13303.345
2.00133,13651.876
2.13475,13885.427
2.26817,15232.127
2.40159,16518.367
2.53502,16817.297
2.66844,15127.556
2.80186,13286.810
