x	Y_20180514_15323_1_9g	Y_20180514_15323_10_10g	Y_20180514_15323_14_7g	Y_20180514_15323_16_6g	Y_20180514_15323_17_2g	Y_20180514_15323_20_18g	Y_20180514_15323_20_1g	Y_20180514_15323_20_23g	Y_20180514_15323_20_8g	Y_20180514_15323_21_3g	Y_20180514_15323_25_11g	Y_20180514_15323_25_18g	Y_20180514_15323_25_7g	Y_20180514_15323_27_4g	Y_20180514_15323_27_5g	Y_20180514_15323_27_9g	Y_20180514_15323_28_4g	Y_20180514_15323_30_4g	Y_20180514_15323_6_16g	Y_20180514_15323_7_7g
0	14518.2588	11325.2002	12062.3701	13353.3096	13545.3154	11615.5469	11918.4033	15918.8438	11439.4287	12203.8613	11412.5283	13444.9697	12986.9902	12935.2422	12661.2715	12218.624	11499.9326	12959.4473	12097.4961	13250.0674
0.1334	15037.8916	11744.8311	12575.0967	13664.7061	13340.0977	12479.3945	12055.79	18193.9062	12421.1201	12779.6807	11253.6777	13317.0879	11755.415	15041.9316	13511.4209	11943.4023	12891.5605	13294.0244	12423.335	13637.3262
0.2668	18240.6914	11705.3818	13514.7383	14817.3838	15784.3945	13305.8105	11758.3428	25672.8262	13409.9932	14333.2295	11631.1914	15469.4238	11679.0186	21182.9531	17353.3379	11765.3633	16916.9004	14102.9062	11659.2432	14421.3037
0.4003	22484.6035	14434.9424	15553.1982	18037.209	20910.9648	15813.1211	12307.3057	30174.9082	16129.1309	15523.0518	13195.2061	21013.582	12286.0586	29573.4004	23497.7578	13238.0156	20991.7832	15321.2871	11549.832	17366.6562
0.5337	31211.377	18622.1816	21955.8691	23033.0508	27535.0859	21975.7656	14915.873	28578.2734	21735.9785	18561.7148	16218.0664	25705.7051	13216.4033	30416.9629	29247.5273	17460.416	20091.998	18987.6934	12622.8633	21117.9102
0.6671	39198.5508	29693.2559	28591.9004	21207.4785	26951.2734	28893.1777	21581.2793	22692.0762	27718.6387	21904.2559	22669.7285	31652.6953	15463.1758	27638.8379	30287.1152	28290.375	18179.5762	24032.1445	13946.3633	28325.8086
0.8005	34311.4766	40533.8438	30449.1875	19106.0977	22814.8262	29566.1953	28447.6465	19715.002	34681.582	25410.4551	29088.4824	28313.6016	17582.9785	24958.6816	25499.5	41071.2266	16513.209	27978.6797	20150.6387	33351.6172
0.934	27037.7812	37418.1016	27303.0918	17616.1797	19652.1777	24245.6172	28568.043	18243.0938	37620.6289	24417.6348	29155.0938	26593.1523	18491.7871	22986.3125	21799.7266	38177.7422	18164.9941	27517.5879	29901.7773	29362.5469
1.0674	22453.3438	29234.082	26011.6016	15990	20662.1621	19277.0391	21693.5977	18596.2129	37689.2891	21536.1543	23986.1621	22693.8945	17150.7441	22966.541	20835.8164	28701.3184	18609.7129	25995.6055	41226.7227	23883.4297
1.2008	21528.7148	24040.7285	24079.7695	15466.7119	20988.8242	17773.0762	18557.0977	17931.0215	30464.0996	21974.6113	19841.7207	21169.5762	16638.1816	23234.6777	20465.9785	23315.5605	18935.1973	24685.0664	39957.1055	20738.2656
1.3342	21831.5352	21370.7539	23022.3047	15519.8984	20069.8398	18048.2578	19279.5176	17068.8047	25506.7441	19617.3496	18721.4863	21782.9551	15892.3486	23475.7656	19285.582	22273.6113	18956.1289	22542.6035	30782.9688	19657.7031
1.4676	20328.1914	18523.8262	22742.3555	15905.1738	19029.6172	17060.9492	18798.8711	17609.2812	21650.2227	19824.4297	17234.5312	22253.3008	15627.7676	22910.6797	17742.6719	20026.1895	18775.2051	21986.0879	25739.6719	19158.959
1.6011	20659.7852	19019.6094	22354.6348	15907.5947	18113.168	16112.4141	17888.8359	17157.2891	23294.7754	17089.334	17029.957	22096.9844	15715.0801	22775.8047	17010.5508	20582.1719	20122.8242	21329.3555	23903.041	18761.6777
1.7345	18962.4023	16917.8594	21574.8477	16197.6953	16843.3906	15987.915	17059.4531	18074.7812	22450.9844	17377.6172	18900.6523	21558.0195	15057.6191	20796.3867	17592.3184	19642.7305	19176.1953	22209.4141	21997.3164	18463.6895
1.8679	19080.0488	15882.0312	21955.8301	15877.9297	18554.8203	15370.8467	16470	18545.8027	22374.873	15485.0781	19015.4375	22693.7969	15338.4365	20499.6484	18248.7734	19582.9004	20691.1191	22264.8516	21512.8457	17621.0957
2.0013	19914.4102	15051.833	21651.7559	16041.8076	18341.041	15303.2002	15212.9756	18449.668	19577.125	15383.6445	18544.9941	18870.459	15089.5508	22961.4453	18032.125	18521.7539	21691.9355	22188.0918	21408.332	17620.4277
2.1347	18789.7188	15424.252	20867.3125	16255.627	17151.5078	14782.9971	15095.4277	16778.5566	18243.4121	14962.3848	18339.0508	19172.7949	16686.2031	23472.2852	17374.7148	17917.8945	21671.9473	20213.4219	21698.4336	18131.4805
2.2682	20875.0488	14817.9004	20801.0137	16622.0273	16955.4922	15054.7529	14579.6641	16039.2207	17592.1621	14070.6152	19277.5312	16611.9141	16536.5352	22586.9277	15369.8887	17565.0898	19590.3711	18707.752	21805.5234	19976.8066
2.4016	22145.7695	15462.8936	20008.3125	17101.1836	17592.2461	14518.2295	13981.5947	16227.1318	16701.7578	13006.0244	19173.502	16301.6035	17080.0566	21056.1699	14097.4062	19059.1328	18508.5781	17305.4023	21212.7168	21401.916
2.535	22634.0332	16239.4297	20512.4473	17726.4102	18251.3203	13802.7705	14266.4336	16334.0088	15802.3174	13692.585	17059.6211	15011.542	16433.7695	19514.6387	13503.4326	19524.4316	18114.373	15878.3457	21415.5781	19527.8008
2.6684	23365.4434	16667.5605	20214.1367	17480.9414	20259.7656	14123.5996	13537.8018	17258.8555	15369.1768	13603.708	17251.9785	14572.7246	17773.8652	18685.0898	13662.3379	20403.6719	17605.9805	16023.875	20980.5566	18638.1309
2.8019	22602.4277	15360.4346	19842.2129	16048.8525	19582.8066	14565.3877	13997.3809	17179.4277	15944.4043	13493.5967	15880.0479	14452.7705	20490.1328	17515.334	14824.3584	20055.543	16651.8555	14882.4639	21723.1562	17584.9785
2.9353	20473.3906	16029.5303	17886.3965	15616.8809	17963.6934	16380.6465	14585.5273	16316.4971	15755.7705	14147.9893	15017.9229	14913.0215	24322.7969	16746.1387	16300.8799	19787.3945	16422.6426	14364.0391	20575.6172	17187.0977
3.0687	18962.248	17400.5566	17707.3984	14774.8867	17031.0566	17655.2754	14542.3945	15312.2275	14760.8008	14826.6621	14961.4316	16059.8887	24730.8047	16534.5137	18447.8574	19954.8066	14575.9531	14605.6572	20002.3613	15500.7295
3.2021	17814.6289	17155.4863	17056.9434	13915.0713	18285.3223	17655.1504	14082.0732	14767.2383	14328.7412	14867.791	14691.7949	15448.7002	19236.2832	16567.8164	17710.1133	20700.5586	13537.498	14696.0225	18192.4629	15590.1777
3.3355	16840.1426	15697.2119	16340.4707	12790.9961	17538.873	16531.3027	13640.835	15727.8652	13927.1094	14128.5947	15240.2881	14447.4121	15976.5059	15884.1846	15531.499	18955.9863	12479.2041	14494.1533	18081.123	15529.1865
3.469	17317.123	14701.4746	15704.1445	12731.2422	14719.5986	15537.9121	13368.8887	16934.2852	13902.8301	16229.915	13759.3721	14600.0762	15307.5088	15874.8604	13996.7393	16900.9512	12886.0391	15129.29	15791.2793	14760.5674
3.6024	15575.9854	14351.7529	17447.6211	12802.3506	13951.7275	14125.5645	13341.9209	16629.1953	14648.7656	17856.3652	13285.5352	15357.2246	14283.0977	15055.6475	12725.6562	15289.1289	13175.043	14714.6172	14479.3154	13848.5889
3.7358	15509.2158	13726.0732	19679.1406	NaN	13811.7188	13164.7207	12941.0391	NaN	14701.9248	17343.1777	12539.1914	16750.1953	14884.2188	14422.2559	13153.7354	14495.2734	13507.2891	14724.1982	13739.4053	13028.9395
3.8692	15274.3057	13591.6738	22511.6387	NaN	13408.4199	13324.2178	12013.9912	NaN	14958.2266	18827.4199	12956.6797	NaN	15110.7217	13649.8291	13452.7773	14084.8926	NaN	13691.0146	13617.6943	NaN
4.0027	16298.543	12915.4805	NaN	NaN	NaN	12808.9258	NaN	NaN	14700.4092	NaN	12784.0381	NaN	15628.415	12996.4912	NaN	14072.501	NaN	14717.5664	14059.7812	NaN
4.1361	16846.7363	13780.4785	NaN	NaN	NaN	12097.1445	NaN	NaN	14303.0449	NaN	13106.0498	NaN	15619.6846	NaN	NaN	14092.0596	NaN	NaN	14398.458	NaN
4.2695	NaN	12984.0615	NaN	NaN	NaN	NaN	NaN	NaN	14526.8496	NaN	12191.1846	NaN	14536.0615	NaN	NaN	13700.6826	NaN	NaN	NaN	NaN
4.4029	NaN	13382.9229	NaN	NaN	NaN	NaN	NaN	NaN	NaN	NaN	13140.9746	NaN	NaN	NaN	NaN	NaN	NaN	NaN	NaN	NaN
4.5363	NaN	NaN	NaN	NaN	NaN	NaN	NaN	NaN	NaN	NaN	12728.4668	NaN	NaN	NaN	NaN	NaN	NaN	NaN	NaN	NaN
4.6698	NaN	NaN	NaN	NaN	NaN	NaN	NaN	NaN	NaN	NaN	NaN	NaN	NaN	NaN	NaN	NaN	NaN	NaN	NaN	NaN
4.8032	NaN	NaN	NaN	NaN	NaN	NaN	NaN	NaN	NaN	NaN	NaN	NaN	NaN	NaN	NaN	NaN	NaN	NaN	NaN	NaN
4.9366	NaN	NaN	NaN	NaN	NaN	NaN	NaN	NaN	NaN	NaN	NaN	NaN	NaN	NaN	NaN	NaN	NaN	NaN	NaN	NaN
5.07	NaN	NaN	NaN	NaN	NaN	NaN	NaN	NaN	NaN	NaN	NaN	NaN	NaN	NaN	NaN	NaN	NaN	NaN	NaN	NaN
5.2035	NaN	NaN	NaN	NaN	NaN	NaN	NaN	NaN	NaN	NaN	NaN	NaN	NaN	NaN	NaN	NaN	NaN	NaN	NaN	NaN
5.3369	NaN	NaN	NaN	NaN	NaN	NaN	NaN	NaN	NaN	NaN	NaN	NaN	NaN	NaN	NaN	NaN	NaN	NaN	NaN	NaN
5.4703	NaN	NaN	NaN	NaN	NaN	NaN	NaN	NaN	NaN	NaN	NaN	NaN	NaN	NaN	NaN	NaN	NaN	NaN	NaN	NaN
5.6037	NaN	NaN	NaN	NaN	NaN	NaN	NaN	NaN	NaN	NaN	NaN	NaN	NaN	NaN	NaN	NaN	NaN	NaN	NaN	NaN
5.7371	NaN	NaN	NaN	NaN	NaN	NaN	NaN	NaN	NaN	NaN	NaN	NaN	NaN	NaN	NaN	NaN	NaN	NaN	NaN	NaN
5.8706	NaN	NaN	NaN	NaN	NaN	NaN	NaN	NaN	NaN	NaN	NaN	NaN	NaN	NaN	NaN	NaN	NaN	NaN	NaN	NaN
6.004	NaN	NaN	NaN	NaN	NaN	NaN	NaN	NaN	NaN	NaN	NaN	NaN	NaN	NaN	NaN	NaN	NaN	NaN	NaN	NaN
6.1374	NaN	NaN	NaN	NaN	NaN	NaN	NaN	NaN	NaN	NaN	NaN	NaN	NaN	NaN	NaN	NaN	NaN	NaN	NaN	NaN
6.2708	NaN	NaN	NaN	NaN	NaN	NaN	NaN	NaN	NaN	NaN	NaN	NaN	NaN	NaN	NaN	NaN	NaN	NaN	NaN	NaN
6.4042	NaN	NaN	NaN	NaN	NaN	NaN	NaN	NaN	NaN	NaN	NaN	NaN	NaN	NaN	NaN	NaN	NaN	NaN	NaN	NaN
6.5377	NaN	NaN	NaN	NaN	NaN	NaN	NaN	NaN	NaN	NaN	NaN	NaN	NaN	NaN	NaN	NaN	NaN	NaN	NaN	NaN
6.6711	NaN	NaN	NaN	NaN	NaN	NaN	NaN	NaN	NaN	NaN	NaN	NaN	NaN	NaN	NaN	NaN	NaN	NaN	NaN	NaN
