x	Y_20180130_15109_42_12g	Y_20180130_15109_42_3g	Y_20180130_15109_42_4g	Y_20180130_15109_42_5g
0	12159.997	11583.526	13245.072	12860.303
0.1334	12879.796	12181.491	13192.86	12534.318
0.2668	13379.675	13362.231	13755.572	12321.538
0.4003	14032.326	15071.08	15435.337	12796.389
0.5337	16423.801	15713.281	18532.74	15063.754
0.6671	18476.613	14078.641	22463.176	19868.455
0.8005	19029.447	14124.048	22065.047	22463.871
0.934	18464.703	16399.846	20651.264	21615.297
1.0674	19319.756	16321.025	19823.68	20754.086
1.2008	18998.92	16814.836	17885.592	19719.898
1.3342	17027.719	17529.527	18153.746	17570.084
1.4676	15969.218	20695.078	18541.098	16937.605
1.6011	15282.583	25586.936	18505.387	15539.074
1.7345	13865.998	25807.789	17675.234	13926.027
1.8679	12566.729	20488.199	15553.316	13269.444
2.0013	11516.917	16261.484	13966.541	11997.775
2.1348	11491.586	14011.966	13396.196	12097.386
2.2682	10861.04	13416.98	13075.72	12258.814
2.4016	10751.616	12999.905	11784.347	NaN
2.535	11254.308	NaN	11292.108	NaN
2.6684	11471.966	NaN	NaN	NaN
2.8019	12071.124	NaN	NaN	NaN
2.9353	NaN	NaN	NaN	NaN
3.0687	NaN	NaN	NaN	NaN
3.2021	NaN	NaN	NaN	NaN
3.3356	NaN	NaN	NaN	NaN
3.469	NaN	NaN	NaN	NaN
3.6024	NaN	NaN	NaN	NaN
3.7358	NaN	NaN	NaN	NaN
3.8692	NaN	NaN	NaN	NaN
4.0027	NaN	NaN	NaN	NaN
4.1361	NaN	NaN	NaN	NaN
4.2695	NaN	NaN	NaN	NaN
4.4029	NaN	NaN	NaN	NaN
4.5363	NaN	NaN	NaN	NaN
