0.0000	13703.3096
0.1334	13695.9062
0.2668	14224.6836
0.4003	15008.1143
0.5337	17735.9355
0.6671	19972.3242
0.8005	21333.5098
0.9340	19414.2168
1.0674	17968.6055
1.2008	16798.2188
1.3342	16929.3340
1.4676	16280.8906
1.6011	17267.9355
1.7345	17003.0000
1.8679	16974.0293
2.0013	16584.4453
2.1347	16326.5410
2.2682	15590.7949
2.4016	15851.3750
2.5350	14479.4746
2.6684	13470.0732
2.8019	13113.2188
2.9353	12689.5332
3.0687	13181.4727
3.2021	12881.5059
3.3355	12673.0293
3.4690	13401.3516
