x	Y_20180130_15109_14_10g	Y_20180130_15109_14_14g	Y_20180130_15109_14_3g	Y_20180130_15109_14_9g	Y_20180130_15109_15_3g	Y_20180130_15109_15_7g	Y_20180130_15109_16_15g	Y_20180130_15109_16_1g	Y_20180130_15109_16_4g	Y_20180130_15109_16_8g	Y_20180130_15109_17_12g	Y_20180130_15109_17_13g	Y_20180130_15109_17_2g	Y_20180130_15109_17_4g
0	12378.65	13134.697	11744.5	14334.387	14248.033	13352.624	12831.49	12053.364	12637.173	12818.887	13533.752	12298.635	13599.032	11730.599
0.1334	13738.813	13687.33	12430.706	14273.308	15396.129	14520.588	12180.685	13442.667	13242.66	13834.323	13865.02	13034.997	13679.034	12008.718
0.2668	15069.891	15411.06	14186.7	15207.507	16094.094	15146.945	13506.266	15531.706	15360.139	14186.751	15007.131	15278.473	14455.204	13069.603
0.4003	18610.443	16863.549	16910.131	17262.775	18892.902	20469.619	16064.975	15289.994	16886.893	16276.234	17917.293	17591.662	15215.971	14386.837
0.5337	22822.445	15899.361	19487.002	18630.686	23306.941	23470.58	18011.742	14838.97	18360.58	20812.002	19007.105	18032.99	15570.565	16841.164
0.6671	25928.219	15040.082	20113.129	19388.479	23967.318	22021.91	17448.746	13407.444	17981.135	25458.766	19568.703	19237.834	17189.148	20349.186
0.8005	25264.889	15209.196	19142.209	19693.033	26945.684	20298.146	16834.332	12934.361	17782.879	24810.529	19941.332	19914.271	20216.668	20259.607
0.934	25515.539	15925.798	17820.154	18193.436	24746.32	19467.877	15579.086	13408.245	17217.838	21137.572	18130.559	19330.172	21022.961	19844.164
1.0674	26388.404	15418.56	15667.862	19128.889	23303.658	18379.41	15943.691	13290.559	16459.613	19787.49	17560.439	18349.924	19136.008	19476.844
1.2008	25741.572	15952.629	16424.18	18300.754	20103.895	17497.734	15171.604	12291.684	15742.721	19315.109	16425.686	19802.504	17692.037	17643.117
1.3342	21856.197	15882.173	15560.831	19948.078	18829.416	17806.338	15883.064	11289.181	17385.27	18980.375	14545.428	19020.049	17209.141	17181.287
1.4676	19021.533	14447.971	14688.714	21016.721	18513.484	18623.996	16549.215	11425.9	17757.896	17814.123	14113.718	19361.334	17024.689	17188.678
1.6011	15627.245	14330.184	13103.864	20717.25	17799.113	17399.438	14381.467	11126.76	16939.777	15727.433	13290.615	18366.66	16199.602	15741.053
1.7345	13567.483	13345.451	13153.588	20684.771	16096.824	15436.631	12612.283	11149.533	14752.37	15200.163	12548.221	16235.562	15232.972	15061.342
1.8679	13163.412	13053.436	12604.603	20557.764	14537.294	13626.174	11812.375	NaN	13727.709	13729.18	11861.293	14806.729	14673.727	12547.984
2.0013	13147.678	NaN	11353.289	18188.662	13863.431	12899.091	11654.623	NaN	13426.741	12841.224	12697.578	13536.23	14268.535	11659.65
2.1348	NaN	NaN	11812.146	15738.886	12749.738	13049.942	NaN	NaN	13314.199	12431.881	12892.157	12793.19	14771.488	10780.495
2.2682	NaN	NaN	11824.149	13774.999	13182.934	12593.678	NaN	NaN	12695.762	11822.997	12599.133	11988.204	14523.853	10837.825
2.4016	NaN	NaN	11470.524	13174.722	12575.207	12567.057	NaN	NaN	12739.73	12951.184	NaN	12024.742	13280.587	10792.625
2.535	NaN	NaN	11630.062	12807.815	NaN	NaN	NaN	NaN	NaN	NaN	NaN	NaN	13634.888	NaN
2.6684	NaN	NaN	NaN	12841.28	NaN	NaN	NaN	NaN	NaN	NaN	NaN	NaN	NaN	NaN
2.8019	NaN	NaN	NaN	13223.755	NaN	NaN	NaN	NaN	NaN	NaN	NaN	NaN	NaN	NaN
2.9353	NaN	NaN	NaN	NaN	NaN	NaN	NaN	NaN	NaN	NaN	NaN	NaN	NaN	NaN
3.0687	NaN	NaN	NaN	NaN	NaN	NaN	NaN	NaN	NaN	NaN	NaN	NaN	NaN	NaN
3.2021	NaN	NaN	NaN	NaN	NaN	NaN	NaN	NaN	NaN	NaN	NaN	NaN	NaN	NaN
3.3356	NaN	NaN	NaN	NaN	NaN	NaN	NaN	NaN	NaN	NaN	NaN	NaN	NaN	NaN
3.469	NaN	NaN	NaN	NaN	NaN	NaN	NaN	NaN	NaN	NaN	NaN	NaN	NaN	NaN
3.6024	NaN	NaN	NaN	NaN	NaN	NaN	NaN	NaN	NaN	NaN	NaN	NaN	NaN	NaN
3.7358	NaN	NaN	NaN	NaN	NaN	NaN	NaN	NaN	NaN	NaN	NaN	NaN	NaN	NaN
3.8692	NaN	NaN	NaN	NaN	NaN	NaN	NaN	NaN	NaN	NaN	NaN	NaN	NaN	NaN
4.0027	NaN	NaN	NaN	NaN	NaN	NaN	NaN	NaN	NaN	NaN	NaN	NaN	NaN	NaN
4.1361	NaN	NaN	NaN	NaN	NaN	NaN	NaN	NaN	NaN	NaN	NaN	NaN	NaN	NaN
4.2695	NaN	NaN	NaN	NaN	NaN	NaN	NaN	NaN	NaN	NaN	NaN	NaN	NaN	NaN
4.4029	NaN	NaN	NaN	NaN	NaN	NaN	NaN	NaN	NaN	NaN	NaN	NaN	NaN	NaN
4.5363	NaN	NaN	NaN	NaN	NaN	NaN	NaN	NaN	NaN	NaN	NaN	NaN	NaN	NaN
4.6698	NaN	NaN	NaN	NaN	NaN	NaN	NaN	NaN	NaN	NaN	NaN	NaN	NaN	NaN
4.8032	NaN	NaN	NaN	NaN	NaN	NaN	NaN	NaN	NaN	NaN	NaN	NaN	NaN	NaN
4.9366	NaN	NaN	NaN	NaN	NaN	NaN	NaN	NaN	NaN	NaN	NaN	NaN	NaN	NaN
5.07	NaN	NaN	NaN	NaN	NaN	NaN	NaN	NaN	NaN	NaN	NaN	NaN	NaN	NaN
5.2035	NaN	NaN	NaN	NaN	NaN	NaN	NaN	NaN	NaN	NaN	NaN	NaN	NaN	NaN
