X,Y
0.00000,34657.680
0.13342,36051.316
0.26684,35628.164
0.40027,35587.141
0.53369,34602.098
0.66711,36284.477
0.80053,37538.496
0.93395,36095.605
1.06737,36249.031
1.20080,35758.695
1.33422,36118.141
1.46764,35367.953
1.60106,36104.172
1.73448,38138.074
1.86791,37990.934
2.00133,36294.543
2.13475,36644.680
2.26817,39305.977
2.40159,42264.797
2.53502,58379.375
2.66844,86600.156
2.80186,99971.391
2.93528,80804.883
3.06870,54822.094
3.20212,42536.391
