X,Y
0.00000,42816.090
0.13342,41739.406
0.26684,41187.906
0.40027,36926.859
0.53369,39564.207
0.66711,37081.922
0.80053,41098.777
0.93395,39387.520
1.06737,38699.859
1.20080,43206.496
1.33422,48280.383
1.46764,59187.781
1.60106,97936.977
1.73448,132493.219
1.86791,110870.281
2.00133,73849.562
2.13475,54287.289
2.26817,48863.500
2.40159,43066.461
