0.00000,34571.195
0.13342,34433.516
0.26684,35846.953
0.40027,35084.371
0.53369,34973.793
0.66711,35761.234
0.80053,36032.465
0.93395,37119.848
1.06737,38838.746
1.20080,45604.633
1.33422,60666.211
1.46764,91702.844
1.60106,116460.281
1.73448,97305.562
1.86791,64495.918
2.00133,46118.133
