0.00000,13562.170
0.13342,14637.007
0.26684,16971.371
0.40027,19024.889
0.53369,21212.703
0.66711,21808.402
0.80053,22128.709
0.93395,21537.486
1.06737,22021.674
1.20080,22323.744
1.33422,22235.588
1.46764,20915.629
1.60106,20322.447
1.73448,19966.561
1.86791,17548.367
2.00133,15814.158
2.13475,14390.066
2.26817,14192.845
2.40159,14071.906
