0.0000	33457.3789
0.1334	33281.4844
0.2668	34749.9023
0.4003	34275.0273
0.5337	32777.9727
0.6671	34418.0781
0.8005	35280.2227
0.9340	34245.1289
1.0674	33768.7773
1.2008	34364.1211
1.3342	34503.0312
1.4676	33343.6484
1.6011	34431.6484
1.7345	34880.7969
1.8679	35929.1875
2.0013	36618.6602
2.1347	38690.8906
2.2682	46667.3477
2.4016	67548.4141
2.5350	103889.4141
2.6684	124211.9688
2.8019	95844.0312
2.9353	58305.6992
3.0687	42652.9375
3.2021	38961.9297
3.3355	36774.4570
3.4690	35392.5625
3.6024	35520.3477
