x	Y_20180130_15109_10_8g	Y_20180130_15109_11_5g	Y_20180130_15109_12_1g	Y_20180130_15109_13_3g	Y_20180130_15109_15_14g	Y_20180130_15109_15_1g	Y_20180130_15109_15_7g	Y_20180130_15109_16_3g	Y_20180130_15109_16_9g	Y_20180130_15109_17_1g	Y_20180130_15109_17_3g	Y_20180130_15109_17_4g	Y_20180130_15109_18_2g	Y_20180130_15109_18_9g	Y_20180130_15109_19_10g	Y_20180130_15109_19_5g	Y_20180130_15109_20_7g	Y_20180130_15109_21_8g	Y_20180130_15109_24_10g	Y_20180130_15109_26_3g	Y_20180130_15109_26_4g	Y_20180130_15109_28_2g	Y_20180130_15109_29_3g	Y_20180130_15109_3_6g	Y_20180130_15109_30_5g	Y_20180130_15109_38_1g	Y_20180130_15109_39_5g	Y_20180130_15109_4_2g	Y_20180130_15109_4_5g	Y_20180130_15109_40_1g	Y_20180130_15109_5_3g	Y_20180130_15109_8_3g	Y_20180130_15109_8_7g	Y_20180130_15109_9_2g	Y_20180130_15109_9_8g
0	13661.125	13628.4	13103.795	13521.554	13828.013	13895.006	13517.589	12680.176	13132.479	11457.351	13712.466	11306.262	11499.752	12232.132	12998.59	14621.358	12476.196	12713.94	12903.792	13030.777	14056.358	12967.66	13219.261	11513.888	16747.572	13107.263	12744.18	13008.878	13046.338	13902.414	12948.931	10327	13932.552	12464.768	11615.355
0.1334	13771.801	14997.443	13263.381	13286.586	14244.136	14301.502	14681.21	12355.675	13746.692	11869.629	13928.934	11852.527	12261.765	12283.746	13228.304	14887.943	12513.784	12781.719	13462.21	13934.366	15597.348	12685.22	12951.997	12119.975	16711.232	13203.627	12537.441	13092.053	13000.597	13957.502	12821.549	10701.506	14529.685	12957.624	12549.48
0.2668	14551.153	15664.114	13729.405	13102.238	15451.911	15493.594	15244.467	14055.429	14228.427	12343.987	15822.422	12400.225	13116.888	13359.546	14187.38	15543.922	14014.372	13775.108	13998.661	15782.947	16509.57	13493.026	14215.627	12356.326	18180.967	14208.182	12868.263	14420.065	13577.707	14092.5	12922.07	11987.238	15501.694	15223.216	13782.936
0.4003	15759.013	17997.984	16654.309	14482.65	16971.186	17461.008	16164.2	15142.394	15710.427	13548.862	19150.51	14387.479	14342.079	14212.844	15961.962	16824.734	15523.824	15258.74	15847.695	19513.102	19533.955	15265.176	15087.602	13326.616	20231.51	16452.93	14285.097	16988.881	14876.694	14585.742	14712.665	13680.358	19190.281	19160.791	14883.472
0.5337	17601.686	24012.467	19968.572	15709.964	19802.951	24096.883	19946.205	15468.789	19067.582	16682.482	20402.344	16128.989	15453.98	18218.094	18844.498	19439.549	19654.051	17579.189	18181.064	21372.109	24087.748	18340.754	19253.846	14410.678	21198.775	17654.311	16644.215	20661.588	16105.325	17603.412	17347.66	15191.2	24678.305	20690.441	15503.766
0.6671	19745.059	26262.037	20430.068	19192.914	21650.641	27230.994	23071.82	14235.752	25530.697	19514.994	19339.756	18767.51	16768.766	21265.312	25299.131	23417.859	23635.285	19692.588	23981.061	22461.547	33035.746	22507.951	25568.75	16444.039	23301.045	19531.928	19221.156	21469.904	19380.07	20362.197	19883.146	14723.069	28954.424	20562.166	15392.81
0.8005	21979.281	21567.127	18858.695	22701.418	19445.93	24967.973	22102.301	14208.263	32021.871	19396.197	19904.863	21637.533	15388.398	19722.768	28966.152	23941.088	22955.418	20349.396	32337.463	21363.621	38052.363	23916.529	27949.932	18308.383	25262.9	20147.691	20229.404	22791.17	21483.562	20037.139	19892.145	13909.127	29200.814	17845.51	15546.583
0.934	22957.531	18315.332	17501.619	21783.619	16797.039	23733.928	19273.832	13401.87	33433.555	17751.484	19418.389	20964.459	14993.568	17595.801	28649.48	22078.045	22258.396	20033.443	33301.875	21371.76	36788.121	25318.688	28232.873	19601.797	25155.957	19052.48	18797.832	21182.889	20221.201	18215.76	20771.975	14389.621	25006.461	17064.246	16754.373
1.0674	21702.414	16464.178	17867.584	19312.975	15794.986	20998.957	17736.641	13946.05	33190.434	17976.203	17574.369	19327.869	15142.38	15368.149	24912.764	21133.578	20703.143	19026.822	31218.975	21029.316	30075.287	24557.229	28336.084	19602.572	25185.574	18103.797	18751.303	22780.846	19333.158	17739.99	21084.039	14074.424	20744.604	16407.955	18016.252
1.2008	21062.078	15189.507	19331.234	17285.826	16457.324	19096.256	16363.406	14276.358	31066.152	17674.99	16156.396	18407.09	15389.45	14272.506	24074.244	20224.834	21640.246	17053.795	28504.861	19324.707	27081.115	24420.838	30516.871	19907.072	22173.916	17663.492	18793.814	21551.143	19093.932	18520.451	21901.357	16033.396	18933.467	16469.178	20155.717
1.3342	19563.738	14697.404	19157.33	17504.219	16755.229	18775.273	17697.631	15120.802	28272.752	18913.477	16123.143	17354.855	15646.748	14330.583	22855.211	19445.52	20982.4	15399.684	28461.117	17718.518	25497.441	23473.277	29448.951	20033.453	18992.545	16673.209	17899.664	20585.148	17957.355	18060.389	20275.08	15122.395	17717.498	16139.951	19986.477
1.4676	17054.768	15616.752	17380.117	17759.309	15993.97	21104.652	15509.054	17107.996	24458.982	18478.469	15124.414	17085.418	14585.979	15026.939	23390.158	19116.482	19743.785	14763.282	26450.807	17057.5	24573.121	21265.125	26961.615	20995.484	18244.516	16331.994	17125.242	19348.828	18910.533	16790.773	19453.963	15638.113	17278.08	14379.905	19625.557
1.6011	16071.437	16450.498	17080.777	18112.035	15253.368	21650.176	14562.034	19473.461	22698.297	19113.416	15323.389	15128.063	14005.688	14489.267	22496.533	19231.479	18498.066	15774.19	25232.148	15832.521	22221.615	18683.939	24792.779	19522.752	17333.717	16168.686	16110.085	18191.146	19224.035	18140.002	19518.486	15241.349	16998.496	13724.573	19464.084
1.7345	15623.267	16335.723	16042.538	16550.541	14287.929	18806.9	15832.511	19519.232	21458.834	19050.25	14939.346	15355.251	14160.095	14885.115	20634.277	18455.002	17723.793	16375.372	23234.174	15380.363	19297.893	17648.689	21785.783	17494.637	16430.473	16252.416	15533.004	16728.895	18188.477	18874.162	17448.545	16425.41	16618.945	12784.724	18019.646
1.8679	14345.058	15182.707	14853.615	16838.74	13458.521	15944.263	16463.471	16750.51	20106.328	16331.456	13413.359	14224.531	14454.096	16441.35	19136.123	17374.119	16597.543	15588.025	20386.098	14065.872	17554.4	17158.146	18942.748	16250.715	15107.084	15827.604	15130.411	15497.919	16831.533	16887.973	16367.459	14389.44	16000.684	12482.444	17525.512
2.0013	12125.933	14013.152	14049.196	16695.594	12041.131	13465.37	14398.842	14357.347	19350.408	14127.447	12072.329	13152.829	14180.593	15680.338	17421.816	16043.574	15528.949	14516.374	18378.824	12907.985	15280.31	14994.207	17646.713	15928.923	14731.999	15086.442	16441.861	14459.793	16029.928	15189.36	15483.795	13637.235	15290.211	11985.618	18221.742
2.1348	11158.519	12071.653	12904.099	14985.087	12056.821	12274.603	13716.971	13420.194	17126.578	12639.824	11637.725	11911.271	13016.884	13973.832	15297.546	15615.616	15519.558	12922.339	15102.764	12458.197	14286.098	13416.978	17178.273	15318.605	14118.74	14590.176	16106.77	13224.126	15932.832	13350.109	15310.26	12182.179	14502.027	11333.097	17577.707
2.2682	12313.202	12746.28	12095.322	14544.44	11511.569	12434.146	13108.496	NaN	15160.159	12341.196	11842.412	11340.106	13189.878	13116.359	13578.594	15406.267	15601.168	13298.798	13140.903	11868.61	13298.531	12093.712	17271.441	15833.623	12726.093	13500.35	13888.038	12613.382	14744.473	13125.245	15307.15	12087.515	13206.722	11598.309	18279.328
2.4016	11955.514	12772.177	12221.713	13436.52	11904.521	NaN	12225.451	NaN	12835.102	12988.506	11658.562	11607.597	NaN	12451.458	12968.378	14257.784	14857.43	12289.871	12833.689	11529.409	12952.181	11895.881	16057.245	16318.985	12353.024	12827.234	12701.242	12991.319	13026.518	13448.015	14286.036	12008.229	13249.867	11933.385	16322.634
2.535	11754.604	12650.9	11982.683	13529.561	12096.012	NaN	12289.742	NaN	12845.224	NaN	12006.967	11212.928	NaN	12413.054	12516.268	13421.112	14330.4	13692.337	12168.782	NaN	11718.48	12039.832	15484.728	14514.886	12115.292	11976.822	12681.521	12503.158	12161.392	12924.732	12924.422	NaN	12146.061	12156.856	13802.263
2.6684	11271.421	NaN	11802.844	12516.13	NaN	NaN	NaN	NaN	12922.886	NaN	11929.907	11459.95	NaN	NaN	12833.032	12974.472	NaN	13178.679	11726.799	NaN	11971.728	12250.355	14349.887	13787.366	NaN	12201.634	12502.095	NaN	11981.27	12872.1	12383.094	NaN	12422.785	NaN	13000.353
2.8019	11607.916	NaN	12777.657	11862.822	NaN	NaN	NaN	NaN	NaN	NaN	NaN	NaN	NaN	NaN	12483.651	NaN	NaN	13464.471	11780.013	NaN	12532.414	NaN	13250.207	12341.678	NaN	12618.609	12043.811	NaN	NaN	NaN	11897.163	NaN	NaN	NaN	11812.998
2.9353	11518.673	NaN	NaN	NaN	NaN	NaN	NaN	NaN	NaN	NaN	NaN	NaN	NaN	NaN	NaN	NaN	NaN	NaN	11921.058	NaN	NaN	NaN	12701.292	12164.599	NaN	NaN	NaN	NaN	NaN	NaN	12139.879	NaN	NaN	NaN	11840.54
3.0687	12068.059	NaN	NaN	NaN	NaN	NaN	NaN	NaN	NaN	NaN	NaN	NaN	NaN	NaN	NaN	NaN	NaN	NaN	NaN	NaN	NaN	NaN	12492.282	11268.055	NaN	NaN	NaN	NaN	NaN	NaN	12541.372	NaN	NaN	NaN	NaN
3.2021	NaN	NaN	NaN	NaN	NaN	NaN	NaN	NaN	NaN	NaN	NaN	NaN	NaN	NaN	NaN	NaN	NaN	NaN	NaN	NaN	NaN	NaN	NaN	12215.64	NaN	NaN	NaN	NaN	NaN	NaN	NaN	NaN	NaN	NaN	NaN
3.3356	NaN	NaN	NaN	NaN	NaN	NaN	NaN	NaN	NaN	NaN	NaN	NaN	NaN	NaN	NaN	NaN	NaN	NaN	NaN	NaN	NaN	NaN	NaN	11812.389	NaN	NaN	NaN	NaN	NaN	NaN	NaN	NaN	NaN	NaN	NaN
3.469	NaN	NaN	NaN	NaN	NaN	NaN	NaN	NaN	NaN	NaN	NaN	NaN	NaN	NaN	NaN	NaN	NaN	NaN	NaN	NaN	NaN	NaN	NaN	12109.294	NaN	NaN	NaN	NaN	NaN	NaN	NaN	NaN	NaN	NaN	NaN
3.6024	NaN	NaN	NaN	NaN	NaN	NaN	NaN	NaN	NaN	NaN	NaN	NaN	NaN	NaN	NaN	NaN	NaN	NaN	NaN	NaN	NaN	NaN	NaN	NaN	NaN	NaN	NaN	NaN	NaN	NaN	NaN	NaN	NaN	NaN	NaN
3.7358	NaN	NaN	NaN	NaN	NaN	NaN	NaN	NaN	NaN	NaN	NaN	NaN	NaN	NaN	NaN	NaN	NaN	NaN	NaN	NaN	NaN	NaN	NaN	NaN	NaN	NaN	NaN	NaN	NaN	NaN	NaN	NaN	NaN	NaN	NaN
3.8692	NaN	NaN	NaN	NaN	NaN	NaN	NaN	NaN	NaN	NaN	NaN	NaN	NaN	NaN	NaN	NaN	NaN	NaN	NaN	NaN	NaN	NaN	NaN	NaN	NaN	NaN	NaN	NaN	NaN	NaN	NaN	NaN	NaN	NaN	NaN
4.0027	NaN	NaN	NaN	NaN	NaN	NaN	NaN	NaN	NaN	NaN	NaN	NaN	NaN	NaN	NaN	NaN	NaN	NaN	NaN	NaN	NaN	NaN	NaN	NaN	NaN	NaN	NaN	NaN	NaN	NaN	NaN	NaN	NaN	NaN	NaN
4.1361	NaN	NaN	NaN	NaN	NaN	NaN	NaN	NaN	NaN	NaN	NaN	NaN	NaN	NaN	NaN	NaN	NaN	NaN	NaN	NaN	NaN	NaN	NaN	NaN	NaN	NaN	NaN	NaN	NaN	NaN	NaN	NaN	NaN	NaN	NaN
4.2695	NaN	NaN	NaN	NaN	NaN	NaN	NaN	NaN	NaN	NaN	NaN	NaN	NaN	NaN	NaN	NaN	NaN	NaN	NaN	NaN	NaN	NaN	NaN	NaN	NaN	NaN	NaN	NaN	NaN	NaN	NaN	NaN	NaN	NaN	NaN
4.4029	NaN	NaN	NaN	NaN	NaN	NaN	NaN	NaN	NaN	NaN	NaN	NaN	NaN	NaN	NaN	NaN	NaN	NaN	NaN	NaN	NaN	NaN	NaN	NaN	NaN	NaN	NaN	NaN	NaN	NaN	NaN	NaN	NaN	NaN	NaN
4.5363	NaN	NaN	NaN	NaN	NaN	NaN	NaN	NaN	NaN	NaN	NaN	NaN	NaN	NaN	NaN	NaN	NaN	NaN	NaN	NaN	NaN	NaN	NaN	NaN	NaN	NaN	NaN	NaN	NaN	NaN	NaN	NaN	NaN	NaN	NaN
4.6698	NaN	NaN	NaN	NaN	NaN	NaN	NaN	NaN	NaN	NaN	NaN	NaN	NaN	NaN	NaN	NaN	NaN	NaN	NaN	NaN	NaN	NaN	NaN	NaN	NaN	NaN	NaN	NaN	NaN	NaN	NaN	NaN	NaN	NaN	NaN
4.8032	NaN	NaN	NaN	NaN	NaN	NaN	NaN	NaN	NaN	NaN	NaN	NaN	NaN	NaN	NaN	NaN	NaN	NaN	NaN	NaN	NaN	NaN	NaN	NaN	NaN	NaN	NaN	NaN	NaN	NaN	NaN	NaN	NaN	NaN	NaN
4.9366	NaN	NaN	NaN	NaN	NaN	NaN	NaN	NaN	NaN	NaN	NaN	NaN	NaN	NaN	NaN	NaN	NaN	NaN	NaN	NaN	NaN	NaN	NaN	NaN	NaN	NaN	NaN	NaN	NaN	NaN	NaN	NaN	NaN	NaN	NaN
5.07	NaN	NaN	NaN	NaN	NaN	NaN	NaN	NaN	NaN	NaN	NaN	NaN	NaN	NaN	NaN	NaN	NaN	NaN	NaN	NaN	NaN	NaN	NaN	NaN	NaN	NaN	NaN	NaN	NaN	NaN	NaN	NaN	NaN	NaN	NaN
5.2035	NaN	NaN	NaN	NaN	NaN	NaN	NaN	NaN	NaN	NaN	NaN	NaN	NaN	NaN	NaN	NaN	NaN	NaN	NaN	NaN	NaN	NaN	NaN	NaN	NaN	NaN	NaN	NaN	NaN	NaN	NaN	NaN	NaN	NaN	NaN
5.3369	NaN	NaN	NaN	NaN	NaN	NaN	NaN	NaN	NaN	NaN	NaN	NaN	NaN	NaN	NaN	NaN	NaN	NaN	NaN	NaN	NaN	NaN	NaN	NaN	NaN	NaN	NaN	NaN	NaN	NaN	NaN	NaN	NaN	NaN	NaN
5.4703	NaN	NaN	NaN	NaN	NaN	NaN	NaN	NaN	NaN	NaN	NaN	NaN	NaN	NaN	NaN	NaN	NaN	NaN	NaN	NaN	NaN	NaN	NaN	NaN	NaN	NaN	NaN	NaN	NaN	NaN	NaN	NaN	NaN	NaN	NaN
5.6037	NaN	NaN	NaN	NaN	NaN	NaN	NaN	NaN	NaN	NaN	NaN	NaN	NaN	NaN	NaN	NaN	NaN	NaN	NaN	NaN	NaN	NaN	NaN	NaN	NaN	NaN	NaN	NaN	NaN	NaN	NaN	NaN	NaN	NaN	NaN
5.7371	NaN	NaN	NaN	NaN	NaN	NaN	NaN	NaN	NaN	NaN	NaN	NaN	NaN	NaN	NaN	NaN	NaN	NaN	NaN	NaN	NaN	NaN	NaN	NaN	NaN	NaN	NaN	NaN	NaN	NaN	NaN	NaN	NaN	NaN	NaN
