0.00000,38751.828
0.13342,38678.410
0.26684,38272.703
0.40027,37331.566
0.53369,36480.938
0.66711,36239.180
0.80053,36312.027
0.93395,34556.301
1.06737,35928.703
1.20080,38853.582
1.33422,42886.516
1.46764,48945.480
1.60106,54608.332
1.73448,56468.445
1.86791,67336.953
2.00133,90937.039
2.13475,90230.703
2.26817,65761.211
2.40159,45926.352
