X,Y
0.00000,12671.640
0.13342,13242.265
0.26684,14322.018
0.40027,16561.973
0.53369,19529.613
0.66711,19279.529
0.80053,16904.262
0.93395,14537.823
1.06737,13161.508
1.20080,13371.543
1.33422,12757.828
1.46764,12720.704
1.60106,13071.172
1.73448,13288.859
1.86791,12411.037
2.00133,12026.608
2.13475,11991.838
2.26817,11865.583
2.40159,11808.255
2.53502,12378.821
