0.0000	15563.6162
0.1334	16494.3340
0.2668	19296.3926
0.4003	24728.2695
0.5337	26611.2188
0.6671	25447.3535
0.8005	21229.3223
0.9340	20736.3750
1.0674	19159.4277
1.2008	17897.6816
1.3342	16052.3770
1.4676	14514.5820
1.6011	14245.5166
1.7345	13405.1729
1.8679	14150.8457
2.0013	13497.5596
2.1347	13303.9805
