0.0000	11135.8213
0.1334	13192.2607
0.2668	13176.3135
0.4003	13410.8271
0.5337	15153.0420
0.6671	20610.8008
0.8005	25852.8516
0.9340	31140.8047
1.0674	26210.1562
1.2008	21853.8027
1.3342	20528.0645
1.4676	20816.0293
1.6011	20498.9238
1.7345	19925.9023
1.8679	19808.3730
2.0013	18718.1406
2.1347	17312.3008
2.2682	16822.8672
2.4016	15761.9434
2.5350	17773.6445
2.6684	18709.4824
2.8019	19171.1426
2.9353	18828.3828
3.0687	18249.5410
3.2021	18364.7578
3.3355	17144.5234
3.4690	16768.1406
3.6024	14730.3838
3.7358	14298.2666
3.8692	14358.1289
4.0027	13571.0967
4.1361	13820.2686
4.2695	13818.1406
4.4029	13322.3164
