0.00000,33069.680
0.13342,30472.607
0.26684,32258.428
0.40027,30840.320
0.53369,32181.963
0.66711,31517.395
0.80053,30611.074
0.93395,30730.137
1.06737,30893.889
1.20080,30434.758
1.33422,30778.473
1.46764,31295.930
1.60106,29525.695
1.73448,31498.613
1.86791,33418.633
2.00133,36281.203
2.13475,44304.633
2.26817,60363.875
2.40159,77438.414
2.53502,66937.352
2.66844,45382.648
2.80186,36589.703
2.93528,32128.688
