x	Y_20180514_15338_c1_1_10g	Y_20180514_15338_c1_10_1g	Y_20180514_15338_c1_10_7g	Y_20180514_15338_c1_11_2g	Y_20180514_15338_c1_11_3g	Y_20180514_15338_c1_11_4g	Y_20180514_15338_c1_11_7g	Y_20180514_15338_c1_12_2g	Y_20180514_15338_c1_13_1g	Y_20180514_15338_c1_14_1g	Y_20180514_15338_c1_14_4g	Y_20180514_15338_c1_14_5g	Y_20180514_15338_c1_14_9g	Y_20180514_15338_c1_15_4g	Y_20180514_15338_c1_17_1g	Y_20180514_15338_c1_17_8g	Y_20180514_15338_c1_18_5g	Y_20180514_15338_c1_18_8g	Y_20180514_15338_c1_18_9g	Y_20180514_15338_c1_19_18g	Y_20180514_15338_c1_20_6g	Y_20180514_15338_c1_4_2g	Y_20180514_15338_c1_4_5g	Y_20180514_15338_c1_5_2g	Y_20180514_15338_c1_7_11g	Y_20180514_15338_c1_7_4g	Y_20180514_15338_c1_7_5g	Y_20180514_15338_c1_8_15g	Y_20180514_15338_c1_8_1g	Y_20180514_15338_c1_8_7g	Y_20180514_15338_c1_9_10g	Y_20180514_15338_c1_9_6g
0	13914.5645	14851.5986	14252.6689	14839.8809	14266.8232	15748.1797	14224.8623	14580.7295	15560.7041	15071.1309	12153.7578	13998.5283	12768.1562	12064.1279	11324.9004	13861.1377	14608.709	15576.7852	15414.4736	11713.4551	18266.9902	12274.6396	13916.7568	10974.3564	13197.5039	18491.4004	10961.9766	14489.3887	13122.1836	14506.7002	13648.1523	14330.0576
0.1334	14003.4033	14181.3242	14233.667	17132.0898	14223.6709	15702.4883	14732.1641	15325.4131	15162.7334	15305.4795	13233.2129	14338.5693	12681.1953	12533.3193	13984.542	14259.5166	15153.1963	16348.4805	16071.8691	12565.8066	19305.6543	12035.0283	15349.3633	11530.2529	13468.7051	18455.7383	11078.7178	14140.6494	13373.2041	15681.5889	14335.0654	15876.9482
0.2668	14336.7627	13807.0137	13706.0684	21172.9668	14460.252	17517.2109	14841.29	15166.3037	15177.7314	15794.7207	14014.5703	13891.5996	12675.0137	12767.2549	17572.9688	14074.6328	15642.9463	16708.4082	16722.9062	12423.3213	24052.7246	12306.9512	17107.8242	11193.8076	14468.8613	18853.0703	10836.6152	15197.3369	13983.71	15025.5166	14206.3545	15541.5273
0.4003	15027.4521	13707.0771	13516.9248	22882.0352	13392.4629	20282.6621	15748.6953	15365.3369	15606.0439	15465.8682	15648.2559	15062.6865	13891.1191	12606.6846	16844.373	14760.3691	22070.748	17309.8613	19461.9141	12661.916	32572.4766	13006.8672	19731.5195	11649.3906	14657.1934	18257.9746	11748.1426	15818.2822	14645.3809	15057.9209	15153.1719	15296.3848
0.5337	17385.5449	12796.3066	13407.0352	19710.5195	14022.9756	24659.1465	18353.1387	16321.6299	17514.0312	16801.9531	16544.8867	17552.1621	18705.8477	12666.0986	14973.1836	18053.5234	29338.7871	19316.5762	20535.4141	15246.6562	36596.082	14401.0654	20640.8848	12106.6562	16352.3672	20663.9824	12978.5967	19155.9609	15651.2197	15700.1133	16209.5283	15165.5693
0.6671	21147.9316	14201.4287	14725.4551	18001.1094	17083.6875	26128.8574	18898.6016	18981.5039	21487.6562	19074.7832	19331.1309	24765.7129	22248.7031	13917.8496	15002.4658	24449.5664	34756.3164	19653.8184	18675.8691	21555.3984	34120.8477	16100.3311	19332.7559	12889.5654	21474.3047	24459.9629	14185.5908	23361.5391	17356.9844	18036.6543	14977.2354	16872.1523
0.8005	21363.2656	14688.6455	16526.1426	16198.2354	20955.2871	25447.3262	16659.7773	21376.1582	24692.3164	19206.625	24325.3438	27139.5156	20776.0195	16752.0586	13276.7734	28640.1699	35243.5391	19013.9277	17318.9707	23997.332	29690.6172	17001.4648	17486.0273	14647.0234	25260.8086	30652.1484	15938.4941	25328.8301	18069.0918	21963.1406	14294.3408	19121.6641
0.934	19340.709	15772.9131	18268.207	15622.6787	24685.7578	28674.7988	15500.3994	18708.0547	23950.9629	18806.0098	28209.9551	24047.2051	16643.1797	19578.0273	14358.8945	28426.0742	29303.5977	16359.9912	15257.3379	22621.457	23022.4512	15054.3164	16437.7227	14901.2324	23390.3926	31798.5254	15917.4814	22146.5156	16716.3984	21740.2871	13869.3711	21067.1797
1.0674	16897.2637	18480.0723	17361.3125	17018.8105	21761.1816	31342.127	16099.2422	16910.6562	23004.5137	18032.498	27235.7891	22811.0703	15412.9287	21938.4668	13827.6641	28039.5078	25205.6406	15895.9463	15711.0459	20004.0781	19881.5508	13012.79	14877.2598	14046.5898	20619.2715	29795.6953	16648.5234	18592.6133	15535.2666	18435.916	14355.3711	21312.3555
1.2008	16182.9639	21044.4355	16153.7158	16688.9688	17819.2852	32300.8262	16654.6895	16123.8477	20517.9629	17310.5117	23123.2266	24366.6094	16085.0215	19388.2617	12861.3467	25640.1094	23719.3594	15549.0156	17530.332	16666.5898	18191.1738	12952.0928	14570.7285	12892.498	18254.3242	24229.1973	17504.9316	16228.6562	15649.8008	19107.1152	15148.5566	18746.4355
1.3342	14777.3877	22099.291	14252.0225	16131.0625	16687.7422	27423.4629	15700.3223	17654.2207	18703.2637	17420.1445	21023.6035	26469.5137	17668.502	17882.793	12727.1807	25906.7852	23042.1348	17150.3125	18589.8828	16848.5723	18085.6641	12752.0918	14408.0068	12019.0244	15648.3574	19550.998	16919.3848	15660.1963	15249.9473	19256.1113	16202.7285	18027.916
1.4676	13844.9717	20044.1816	13745.9023	16198.3789	16798.1758	21207.4219	15566.6885	19392.3242	15736.7598	18137.0352	20984.6836	24157.5801	21443.4727	18264.6641	13764.7119	26864.9199	23912.3613	19059.1641	18518.9961	16962.1758	16059.2119	12935.0723	14708.4629	12138.8447	14149.3711	18627.4434	16579.5234	15694.3818	15131.292	20669.4375	14790.6787	16471.666
1.6011	14563.292	20362.8379	14889.2998	14565.5586	18369.6914	18918.1621	16535.6543	21978.1758	16473.2969	20149.1289	22641.5879	21592.8965	22843.1152	20108.1992	13996.9512	28412.8281	22701.2539	18896.2168	17739.207	16892.8906	15335.9893	13846.0303	15316.418	12350.4824	14145.5195	17435.5801	15630.6104	16904.3574	15305.4072	20088.8867	13416.123	16934.1094
1.7345	14851.6592	20715.4824	15441.3379	14127.1602	17900.207	19287.5078	18160.2148	21842.9355	17540.2129	21762.1289	24317.4434	19551.5469	22055.2363	20333.2988	13080.9131	27263.2832	20328.9102	17555.0312	17435.1719	16720.541	13683.5869	13860.167	16261.5693	12251.0273	13348.4404	18006.2305	15445.5566	17153.9629	16189.4912	19798.8223	12828.3809	16808.0078
1.8679	14794.4307	18199.2246	16532.377	14341.8027	18299.6875	18460.5	17064.8145	19549.6758	16136.7354	21873.6777	22152.9355	17143.8633	18896.2051	19483.4258	12188.6162	24245.9531	19993.7383	15668.627	17493.0254	15826.6182	NaN	14963.623	15697.0684	12436.5928	13635.7266	17555.6621	16472.5195	16088.5439	14966.0381	16257.0098	12993.3125	17602.2812
2.0013	15247.833	17225.4766	16544.332	13849.6025	17521.418	17605.9844	15744	17100.2031	15245.2197	19626.2266	20076.6641	14782.4443	16017.6143	19882.5098	13207.7773	22442.5781	17184.125	14848.7393	16152.6084	16186.3643	NaN	15527.9707	14352.0244	11516.0381	12809.6689	16820.8145	16121.8623	15349.3193	14862.1104	14852.1318	12326.9229	17726.6367
2.1347	14814.4775	15426.3838	15203.0371	12808.043	16848.1113	16600.2422	14759.0713	14777.0938	13200.9023	17345.1875	18245.7461	13575.4746	14764.0254	19478.9141	12682.4609	19677.8164	17478.8066	15691.6074	15603.7266	14555.8184	NaN	14279.7451	13601.6064	11142.1279	11856.5908	15174.9189	15251.4014	15222.7969	14840.1162	13207.0068	12298.5283	15245.2334
2.2682	13371.3311	14335.4668	14415.8008	NaN	15970.1846	16154.7139	14055.2373	13429.2949	12312.6094	NaN	16754.4434	14339.9053	13951.7656	22280.1602	NaN	17682.2793	16714.6484	14311.4424	15752.1104	14740.5049	NaN	12911.624	12455.8145	10938.001	12027.5918	14997.666	14207.332	15151.2627	16627.7891	13074.5547	12057.6602	14421.1855
2.4016	12998.6182	14166.6172	14016.7539	NaN	15250.2305	NaN	13678.4658	12868.7695	12399.3643	NaN	16791.4766	16012.4688	NaN	22902.1914	NaN	18036.4922	16150.0156	NaN	15777.7363	14349.4277	NaN	11831.0693	NaN	10850.5	12258.7715	15252.4912	13510.2402	14760.3984	15932.3721	12387.0166	12718.5293	13264.2529
2.535	NaN	12926.1094	13525.5957	NaN	14671.8125	NaN	NaN	13894.251	NaN	NaN	16461.1484	NaN	NaN	20675.084	NaN	17324.7207	NaN	NaN	NaN	14411.8643	NaN	NaN	NaN	10468.9082	11654.915	15069.0264	13263.7871	14481.4912	14916.9951	13451.168	NaN	12746.2715
2.6684	NaN	13831.3301	13043.6162	NaN	13736.335	NaN	NaN	13899.2129	NaN	NaN	16505.9238	NaN	NaN	17998.4062	NaN	NaN	NaN	NaN	NaN	NaN	NaN	NaN	NaN	10401.2324	12339.3652	14841.6484	12786.5469	NaN	NaN	NaN	NaN	13428.0381
2.8019	NaN	13032.0762	13268.5879	NaN	NaN	NaN	NaN	13311.7656	NaN	NaN	17174.5	NaN	NaN	15870.4023	NaN	NaN	NaN	NaN	NaN	NaN	NaN	NaN	NaN	NaN	12349.4912	16305.4941	13015.1104	NaN	NaN	NaN	NaN	13437.3271
2.9353	NaN	NaN	13662.5811	NaN	NaN	NaN	NaN	NaN	NaN	NaN	NaN	NaN	NaN	15516.8506	NaN	NaN	NaN	NaN	NaN	NaN	NaN	NaN	NaN	NaN	NaN	15447.2051	12240.3506	NaN	NaN	NaN	NaN	NaN
3.0687	NaN	NaN	NaN	NaN	NaN	NaN	NaN	NaN	NaN	NaN	NaN	NaN	NaN	NaN	NaN	NaN	NaN	NaN	NaN	NaN	NaN	NaN	NaN	NaN	NaN	NaN	13121.7461	NaN	NaN	NaN	NaN	NaN
3.2021	NaN	NaN	NaN	NaN	NaN	NaN	NaN	NaN	NaN	NaN	NaN	NaN	NaN	NaN	NaN	NaN	NaN	NaN	NaN	NaN	NaN	NaN	NaN	NaN	NaN	NaN	NaN	NaN	NaN	NaN	NaN	NaN
3.3355	NaN	NaN	NaN	NaN	NaN	NaN	NaN	NaN	NaN	NaN	NaN	NaN	NaN	NaN	NaN	NaN	NaN	NaN	NaN	NaN	NaN	NaN	NaN	NaN	NaN	NaN	NaN	NaN	NaN	NaN	NaN	NaN
3.469	NaN	NaN	NaN	NaN	NaN	NaN	NaN	NaN	NaN	NaN	NaN	NaN	NaN	NaN	NaN	NaN	NaN	NaN	NaN	NaN	NaN	NaN	NaN	NaN	NaN	NaN	NaN	NaN	NaN	NaN	NaN	NaN
3.6024	NaN	NaN	NaN	NaN	NaN	NaN	NaN	NaN	NaN	NaN	NaN	NaN	NaN	NaN	NaN	NaN	NaN	NaN	NaN	NaN	NaN	NaN	NaN	NaN	NaN	NaN	NaN	NaN	NaN	NaN	NaN	NaN
3.7358	NaN	NaN	NaN	NaN	NaN	NaN	NaN	NaN	NaN	NaN	NaN	NaN	NaN	NaN	NaN	NaN	NaN	NaN	NaN	NaN	NaN	NaN	NaN	NaN	NaN	NaN	NaN	NaN	NaN	NaN	NaN	NaN
3.8692	NaN	NaN	NaN	NaN	NaN	NaN	NaN	NaN	NaN	NaN	NaN	NaN	NaN	NaN	NaN	NaN	NaN	NaN	NaN	NaN	NaN	NaN	NaN	NaN	NaN	NaN	NaN	NaN	NaN	NaN	NaN	NaN
4.0027	NaN	NaN	NaN	NaN	NaN	NaN	NaN	NaN	NaN	NaN	NaN	NaN	NaN	NaN	NaN	NaN	NaN	NaN	NaN	NaN	NaN	NaN	NaN	NaN	NaN	NaN	NaN	NaN	NaN	NaN	NaN	NaN
4.1361	NaN	NaN	NaN	NaN	NaN	NaN	NaN	NaN	NaN	NaN	NaN	NaN	NaN	NaN	NaN	NaN	NaN	NaN	NaN	NaN	NaN	NaN	NaN	NaN	NaN	NaN	NaN	NaN	NaN	NaN	NaN	NaN
4.2695	NaN	NaN	NaN	NaN	NaN	NaN	NaN	NaN	NaN	NaN	NaN	NaN	NaN	NaN	NaN	NaN	NaN	NaN	NaN	NaN	NaN	NaN	NaN	NaN	NaN	NaN	NaN	NaN	NaN	NaN	NaN	NaN
4.4029	NaN	NaN	NaN	NaN	NaN	NaN	NaN	NaN	NaN	NaN	NaN	NaN	NaN	NaN	NaN	NaN	NaN	NaN	NaN	NaN	NaN	NaN	NaN	NaN	NaN	NaN	NaN	NaN	NaN	NaN	NaN	NaN
4.5363	NaN	NaN	NaN	NaN	NaN	NaN	NaN	NaN	NaN	NaN	NaN	NaN	NaN	NaN	NaN	NaN	NaN	NaN	NaN	NaN	NaN	NaN	NaN	NaN	NaN	NaN	NaN	NaN	NaN	NaN	NaN	NaN
4.6698	NaN	NaN	NaN	NaN	NaN	NaN	NaN	NaN	NaN	NaN	NaN	NaN	NaN	NaN	NaN	NaN	NaN	NaN	NaN	NaN	NaN	NaN	NaN	NaN	NaN	NaN	NaN	NaN	NaN	NaN	NaN	NaN
4.8032	NaN	NaN	NaN	NaN	NaN	NaN	NaN	NaN	NaN	NaN	NaN	NaN	NaN	NaN	NaN	NaN	NaN	NaN	NaN	NaN	NaN	NaN	NaN	NaN	NaN	NaN	NaN	NaN	NaN	NaN	NaN	NaN
4.9366	NaN	NaN	NaN	NaN	NaN	NaN	NaN	NaN	NaN	NaN	NaN	NaN	NaN	NaN	NaN	NaN	NaN	NaN	NaN	NaN	NaN	NaN	NaN	NaN	NaN	NaN	NaN	NaN	NaN	NaN	NaN	NaN
5.07	NaN	NaN	NaN	NaN	NaN	NaN	NaN	NaN	NaN	NaN	NaN	NaN	NaN	NaN	NaN	NaN	NaN	NaN	NaN	NaN	NaN	NaN	NaN	NaN	NaN	NaN	NaN	NaN	NaN	NaN	NaN	NaN
5.2035	NaN	NaN	NaN	NaN	NaN	NaN	NaN	NaN	NaN	NaN	NaN	NaN	NaN	NaN	NaN	NaN	NaN	NaN	NaN	NaN	NaN	NaN	NaN	NaN	NaN	NaN	NaN	NaN	NaN	NaN	NaN	NaN
5.3369	NaN	NaN	NaN	NaN	NaN	NaN	NaN	NaN	NaN	NaN	NaN	NaN	NaN	NaN	NaN	NaN	NaN	NaN	NaN	NaN	NaN	NaN	NaN	NaN	NaN	NaN	NaN	NaN	NaN	NaN	NaN	NaN
5.4703	NaN	NaN	NaN	NaN	NaN	NaN	NaN	NaN	NaN	NaN	NaN	NaN	NaN	NaN	NaN	NaN	NaN	NaN	NaN	NaN	NaN	NaN	NaN	NaN	NaN	NaN	NaN	NaN	NaN	NaN	NaN	NaN
5.6037	NaN	NaN	NaN	NaN	NaN	NaN	NaN	NaN	NaN	NaN	NaN	NaN	NaN	NaN	NaN	NaN	NaN	NaN	NaN	NaN	NaN	NaN	NaN	NaN	NaN	NaN	NaN	NaN	NaN	NaN	NaN	NaN
5.7371	NaN	NaN	NaN	NaN	NaN	NaN	NaN	NaN	NaN	NaN	NaN	NaN	NaN	NaN	NaN	NaN	NaN	NaN	NaN	NaN	NaN	NaN	NaN	NaN	NaN	NaN	NaN	NaN	NaN	NaN	NaN	NaN
5.8706	NaN	NaN	NaN	NaN	NaN	NaN	NaN	NaN	NaN	NaN	NaN	NaN	NaN	NaN	NaN	NaN	NaN	NaN	NaN	NaN	NaN	NaN	NaN	NaN	NaN	NaN	NaN	NaN	NaN	NaN	NaN	NaN
