x	Y_20180130_15101_10_10g	Y_20180130_15101_10_11g	Y_20180130_15101_10_15g	Y_20180130_15101_10_19g	Y_20180130_15101_11_5g	Y_20180130_15101_12_10g	Y_20180130_15101_12_3g	Y_20180130_15101_12_8g	Y_20180130_15101_13_1g	Y_20180130_15101_14_4g	Y_20180130_15101_14_9g	Y_20180130_15101_15_12g	Y_20180130_15101_15_14g	Y_20180130_15101_15_16g	Y_20180130_15101_15_6g	Y_20180130_15101_15_8g	Y_20180130_15101_16_10g	Y_20180130_15101_16_1g	Y_20180130_15101_17_4g	Y_20180130_15101_17_8g	Y_20180130_15101_17_9g	Y_20180130_15101_19_3g	Y_20180130_15101_2_11g	Y_20180130_15101_2_25g	Y_20180130_15101_2_31g	Y_20180130_15101_2_8g	Y_20180130_15101_2_9g	Y_20180130_15101_21_13g	Y_20180130_15101_21_14g	Y_20180130_15101_21_2g	Y_20180130_15101_21_5g	Y_20180130_15101_24_6g	Y_20180130_15101_26_2g	Y_20180130_15101_26_3g	Y_20180130_15101_26_4g	Y_20180130_15101_26_6g	Y_20180130_15101_27_2g	Y_20180130_15101_27_7g	Y_20180130_15101_3_10g	Y_20180130_15101_3_11g	Y_20180130_15101_3_17g	Y_20180130_15101_3_4g	Y_20180130_15101_4_10g	Y_20180130_15101_5_1g	Y_20180130_15101_5_4g	Y_20180130_15101_6_19g	Y_20180130_15101_6_1g	Y_20180130_15101_6_25g	Y_20180130_15101_6_2g	Y_20180130_15101_6_3g	Y_20180130_15101_6_6g	Y_20180130_15101_6_7g	Y_20180130_15101_6_9g	Y_20180130_15101_7_15g	Y_20180130_15101_7_25g	Y_20180130_15101_7_26g	Y_20180130_15101_8_11g	Y_20180130_15101_8_17g	Y_20180130_15101_8_21g	Y_20180130_15101_9_10g	Y_20180130_15101_9_17g	Y_20180130_15101_9_21g	Y_20180130_15101_9_9g
0	12309.758	16671.67	13061.482	14326.11	13502.136	16493.012	13205.756	12825.731	14257.141	14597.7	16904.914	13354.256	17326.488	14732.757	13978.122	14430.388	15039.501	15601.644	14979.395	15527.598	12936.641	15825.4	11932.848	13036.558	13084.007	14575.06	13424.108	12707.639	11854.793	13517.679	16746.164	12043.269	13438.325	15344.354	15310.518	15048.217	16360.854	15194.797	14395.735	15956.258	14018.568	12718.711	13518.064	12708.964	16171.422	14888.351	13879.323	16789.996	12878.218	13644.715	13344.722	13992.261	14656.253	14277.037	14687.667	13323.6	12551.17	15534.958	13611.233	14215.405	14723.604	17283.088	14208.105
0.1334	12489.042	16206.311	13926.312	14788.348	13910.005	16314.223	14612.698	14718.176	15334.501	17439.473	16687.631	13504.925	17597.441	15417.754	14058.51	16548.629	16327.572	16642.875	15652.73	14882.415	13416.29	20552.623	12556.962	13223.384	12883.849	15951.682	14311.475	13157.723	12170.503	13919.451	17505.668	13585.07	13846.447	14574.386	16135.843	15494.478	18584.264	14834.265	15947.943	16140.924	14496.851	13195.216	13423.435	12868.522	17793.816	15905.864	16913.938	18023.109	13836.666	14057.099	13823.31	14725.091	15262.514	16383.479	15965.08	15508.037	13224.796	14880.817	13985.993	14444.623	15353.352	17330.312	14549.297
0.2668	14247.416	17430.963	16535.242	15002.607	14417.891	17910.236	14974.288	17458.176	15741.104	22574.135	17546.9	14311.804	21178.006	16006.412	16043.308	18809.414	17806.289	18747.586	18542.641	16143.705	14772.43	21782.852	13396.064	13294.941	13373.338	20216.348	17347.109	14373.622	12659.256	15678.094	20311.824	14770.017	13893.776	15173.068	17679.92	18089.074	19779.602	15279.833	18547.42	16488.682	16285.321	14041.947	14392.812	14505.83	21820.908	19401.473	20077.805	19996.141	14129.822	14628.791	15399.271	17272.596	18044.877	20385.928	17558.277	18883.07	14515.012	16356.253	15415.493	16853.867	17166.918	19304.9	16877.426
0.4003	15538.978	19346.049	18282.223	17033.459	16644.953	20314.355	17411.139	19088.516	17773.77	28529.861	20330.969	16257.634	26632.256	19022.875	18102.053	23046.199	20567.799	23045.934	19949.676	18949.012	17611.367	26684.197	15404.319	15335.968	14343.088	22926.252	20710.465	17080.166	13703.262	19637.117	23460.83	16321.977	16051.697	17205.105	19672.488	22317.918	21170.291	18954.27	22435.432	18123.758	18578.205	17736.928	14921.386	16235.659	26208.664	22298.35	21739.795	22841.475	15882.159	17345.717	17528.451	19375.615	19960.424	24596.639	21028.799	24222.715	17452.543	18244.971	18377.285	22556.836	19817.08	23188.047	19744.732
0.5337	15235.881	24993.955	21911.096	21567.127	19068.33	28865.008	17525.812	20260.203	21162.406	29660.34	23961.926	18987.094	27466.225	22160.217	23742.5	24474.645	23784.359	23737.521	21320.324	22501.52	19453.207	26884.775	16331.812	17110.463	19130.725	23238.723	23245.502	19565.672	15059.77	21049.469	24289.143	18823.025	17486.752	18800.314	22098.908	23729.186	20482.184	24715.912	22203.723	17279.594	24647.467	22148.898	16492.467	17791.213	31355.494	23874.838	21340.787	24707.539	17832.914	18950.58	21052.447	25435.67	23118.73	26006.361	23106.391	27336.412	19648.266	21543.723	19472.373	26466.656	20986.639	24976.695	20022.852
0.6671	15576.982	31480.734	23470.967	26954.965	18405.141	32060.037	17517.752	20953.76	24248.449	26595.455	25501.518	22499.322	26472.549	25280.535	29722.236	26181.385	25105.67	21433.646	19933.756	27671.643	19244.883	25624.773	15984.278	20563.373	24497.119	23925.408	24879.068	21406.055	14965.634	19144.166	24182.68	21138.23	18337.393	18811.889	22797.883	24665.793	18509.951	26371.432	20935.764	19323.389	28418.289	24933.029	17275.203	17021.254	30723.09	23015.482	19980.227	25723.826	19000.301	20285.068	26398.301	28047.824	22381.043	27191.924	23471.654	27842.053	20388.148	24190.164	19590.766	26555.834	18453.744	25495.926	17939.35
0.8005	15947.062	33360.934	22930.758	29532.561	18643.719	34429.605	16655.865	21859.953	26510.748	24800.711	25029.074	22800.605	25976.283	24964.764	31594.115	23130.525	25400.559	20638.26	18423.504	30828.039	19493.795	25097.434	16702.154	23198.711	27779.041	23652.453	25078.979	22038.545	14251.573	17888.412	24493.188	21471.498	18689.91	18290.631	24244.203	24423.354	17666.318	25041.113	21688.926	18883.172	28823.971	24600.605	17300.797	16940.537	27750.18	21018.607	18016.051	24429.262	19519.955	19065.057	26254.303	27305.533	22433.182	23457.158	22136.281	27784.266	19404.844	24341.619	20122.812	26033.139	18554.645	26384.699	18441.725
0.934	15113.305	34937.352	22889.1	28416.674	18406.082	32394.088	15867.817	22635.65	23724.715	24300.375	23380.604	20364.457	25200.113	25454.422	29412.193	23851.561	24664.057	20307.604	18466.359	30190.229	19324.242	24101.475	17989.199	22880.502	26393.295	24347.648	23241.004	21869.113	14573.423	19613.42	23236	20980.998	18499.201	17739.322	23373.988	24509.389	17426.393	25757.311	20746.398	17560.887	27388.889	22836.24	17929.789	16963.578	25792.102	20592.105	16532.869	23996.971	19349.266	17853.254	27682.84	26163.67	20747.939	20338.977	19978.482	28373.09	18770.223	22832.057	18927.006	26413.76	19811.176	27194.926	18616.484
1.0674	14761.653	34798.406	22814.955	27376.691	17946.137	33666.754	16558.631	24073.451	21120.457	24600.396	22527.01	19387.52	24613.553	23853.484	26642.209	22387.924	22408.535	19990.699	16416.793	28708.777	19767.922	21908.266	18284.572	22846.904	23827.018	23905.781	20789.922	22127.896	13044.274	18492.861	21177.301	18742.924	18133.496	17369.588	21879.211	25097.057	17101.705	23206.586	20079.121	17464.195	27142.652	23405.5	16760.602	19205.826	24444.426	18774.137	15974.037	22828.938	17805.297	18702.553	28459.1	24947.838	19317.828	19745.439	18787.066	28896.105	18238.4	21092.926	17580.717	27450.779	20318.775	26001.525	18374.24
1.2008	15027.969	34363.438	20385.607	25429.957	17139.438	30504.547	16975.762	25090.955	19855.867	23905.195	20264.211	20965.818	23809.809	21707.09	22637.361	21312.152	19440.139	19769.797	16415.043	27336.674	20627.996	21664.84	18780.668	24312.061	25169.453	23397.688	18262.248	21045.125	14032.78	17937.221	20017.543	16424.049	16998.299	17338.551	21743.461	24446.271	20428.533	20825.369	21672.531	16198.621	24553.205	22790.412	16260.206	19544.793	22828.742	17936.654	16415.873	20918.938	16808.475	18585.139	29292.908	22466.885	21524.266	20865.857	18052.504	27011.799	18136.803	20920.355	16763.004	25873.938	19987.549	25097.967	18858.971
1.3342	14950.804	32467.789	18718.914	24569.672	17472.822	27124.699	17761.609	23932.941	17959.662	22570.809	20206.59	21660.135	23183.25	19948.234	20964.297	21646.512	18019.234	19774.203	16802.15	25074.67	21765.645	23366.779	19872.359	23268.289	22789.645	22940.02	17633.176	21037.404	15155.679	17120.793	19919.246	15738.437	17739.504	16379.889	21113.688	24307.082	21287.938	19858.336	23699.662	15624.629	21367.094	22756.852	15724.567	19861.336	18894.051	19106.602	16717.25	19201.613	15613.304	18914.232	28262.682	22222.559	21299.232	21042.281	18115.938	26816.906	21752.617	22627.348	14518.25	25093.229	21006.996	24626.857	19362.611
1.4676	15361.479	30868.154	17024.092	24974.754	16187.93	29695.268	17552.076	22552.275	18713.895	21662.412	19794.324	23340.439	23027.875	19403.773	19465.699	23564.002	17489.795	20434.932	15758.733	24390.104	22206.309	21858.594	19501.51	22606.406	22790.756	23232.918	16688.832	23230.459	15699.017	15909.834	18667.227	16619.027	19049.381	16024.344	19513.637	21749.623	22167.613	21130.004	22689.094	15860.144	20010.879	22916.762	15583.816	19352.16	17485.676	18473.611	14622.201	18753.201	15980.693	17586.861	24537.43	24703.055	21385.572	20803.758	18056.971	26432.357	25176.115	22134.348	14158.732	22050.867	21767.086	21281.941	19498.182
1.6011	13793.111	27258.182	15422.354	26195.512	15393.044	27497.76	16075.727	22190.145	18817.064	19628.641	18791.855	22899.369	21334.467	18781.797	18351.064	23402.686	17820.891	21292.836	16792.176	23617.824	21970.221	20124.072	17068.9	21817.998	24099.016	21064.092	16937.049	24595.146	16117.201	14596.82	17610.125	17161.658	19959.465	16165.223	19145.73	20641.975	21117.121	22571.27	19859.592	15288.056	18751.104	21803.121	14752.112	18676.934	17301.562	18688.475	14039.229	19966.562	15838.467	16868.883	20594.469	25990.072	18233.064	18125.1	18168.773	24579.314	26003.877	18653.146	15438.678	19266.922	19878.564	19625.375	18079.051
1.7345	13507.487	21861.951	14339.674	23187.254	14314.599	26088.953	15081.603	20562.283	18101.486	18687.08	16628.801	20750.51	20037.418	16601.789	17335.998	20898.91	17157.1	20398.355	17173.781	23788.494	21951.361	18030.682	18762.105	20710.93	23875.449	18449.174	17485.965	26825.684	16227.848	13452.941	15220.889	15883.448	22098.824	16972.746	18806.838	18891.211	18796.834	21489.926	16802.246	14866.792	17373.379	18823.529	14753.494	18295.584	15235.004	21217.674	13483.452	20006.93	16505.746	15896.506	17951.596	25921.652	16349.449	16967.543	16786.236	21911.307	22723.732	18553.902	14614.016	18155.838	16133.414	19326.279	16559.852
1.8679	12533.139	19255.172	13820.572	19539.156	13355.319	24732.338	14382.097	21875.996	17983.623	16094.545	15324.139	18798.252	17922.488	15348.263	16444.578	18836.531	16502.703	17171.045	15938.132	22341.223	22964.238	16185.984	17155.896	19227.471	23680.443	16074.542	17046.836	23248.09	16738.738	12789.976	13540.19	15779.295	22446.668	15673.076	17047.914	17072.867	15158.612	19639.26	14666.021	13907.829	16759.34	16585.926	15117.979	17442.068	13609.233	25136.715	13187.276	17653.02	15457.723	14179.8	16772.564	21775.416	14581.321	15782.819	15380.643	19109.234	19218.234	17384.662	14530.984	15904.72	14555.474	18137.012	15692.237
2.0013	12109.727	18092.326	12343.435	17012.881	12860.084	22674.119	14115.304	21669.65	17389.578	13436.125	14837.206	17459.588	15775.875	14190.089	15144.68	15961.42	16038.921	16265.721	14271.904	18182.236	21228.277	15223.834	16183.527	16340.852	18791.436	15448.895	16591.121	19832.16	15960.881	12474.873	13516.619	14433.864	21310.062	14552.682	14388.978	15194.699	13088.418	16129.893	14505.067	13621.349	15125.701	14067.397	15217.065	14744.561	12964.277	24764.057	13222.784	16631.625	14331.794	13258.918	15364.04	18817.291	14130.041	14650.387	14534.872	16113.899	15994.175	15603.096	13786.428	14492.408	14636.842	17889.314	15069.759
2.1348	13099.563	16999.719	12146.195	14740.299	12667.657	18014.697	13996.442	19914.445	15704.742	13813.672	13381.409	16948.91	15455.021	14056.265	14189.047	14249.144	15117.27	15584.188	13422.209	16839.418	21084.021	14274.638	15438.545	14081.447	16495.688	14190.472	17211.654	16706.125	14184.063	11850.076	13424.13	12866.765	20803.441	13722.824	13831.942	14192.771	13273.716	14447.163	13563.22	NaN	13596.589	12449.172	15352.568	14650.322	11956.389	20963.131	12844.057	14778.386	12874.803	12435.24	13999.139	15190.763	13455.616	13913.13	14274.733	14463.664	14066.919	14235.387	14014.821	13841.979	13614.996	16987.201	14522.9
2.2682	NaN	15096.205	11661.251	13484.94	12492.519	15902.861	13332.979	17943.414	14747.96	13085.886	14107.488	17086.082	14560.579	13510.51	13667.979	13911.082	14157.071	NaN	12421.01	14667.764	21152.109	13161.571	14288.868	13386.256	15065.488	13626.488	17071.91	13986.103	13916.385	11484.49	12792.637	12373.314	19833.688	13241.707	13672.842	14001.457	13010.252	13593.03	13633.785	NaN	13631.042	12115.889	14074.987	14096.501	11760.956	16175.096	NaN	14711.593	12955.018	12960.733	13456.125	14096.865	13228.697	12730.113	13490.436	13670.172	13152.696	14107.041	13203.771	13962.411	NaN	15241.66	15630.361
2.4016	NaN	13409.777	11958.143	13349.032	12108.482	14412.324	13480.95	17230.08	14020.443	13172.004	14047.81	15345.649	13309.075	12917.12	13009.865	14571.399	14529.792	NaN	12610.379	13875.183	21420.428	13970.54	14820.562	12981.46	14258.653	13455.52	16249.609	12837.611	13206.332	NaN	NaN	12682.446	19515.119	12648.934	13871.533	13922.333	NaN	13098.635	13309.355	NaN	12970.595	12405.544	12644.621	NaN	NaN	14195.127	NaN	13742.76	12990.536	12612.697	12970.619	14029.46	12895.24	13061.596	13445.159	13161.6	13506.814	13430.699	13396.238	13505.657	NaN	13331.219	14993.641
2.535	NaN	12438.846	NaN	12830.626	NaN	13326.792	NaN	15717.132	13136.201	12418.512	13790.378	15008.422	NaN	12855.278	13013.047	13780.057	14108.525	NaN	12308.497	13475.496	21309.559	13073.561	NaN	12635.566	14332.383	NaN	15177.894	12801.812	NaN	NaN	NaN	12628.588	19187.08	11526.54	13282.305	14114.167	NaN	12613.494	NaN	NaN	12834.512	12537.129	12191.906	NaN	NaN	NaN	NaN	13278.027	12008.739	NaN	NaN	NaN	13703.88	12399.273	14227.068	NaN	NaN	12329.447	13570.165	13715.681	NaN	12948.154	15296.349
2.6684	NaN	12650.951	NaN	11915.862	NaN	13590.381	NaN	14534.833	12810.16	NaN	NaN	15179.543	NaN	12892.635	NaN	NaN	NaN	NaN	NaN	13814.584	17926.27	NaN	NaN	12448.617	14197.284	NaN	NaN	12678.518	NaN	NaN	NaN	12163.414	18357.479	NaN	13836.516	14163.839	NaN	NaN	NaN	NaN	12658.725	NaN	12657.424	NaN	NaN	NaN	NaN	NaN	12996.543	NaN	NaN	NaN	NaN	NaN	14629.307	NaN	NaN	NaN	NaN	NaN	NaN	13225.716	NaN
2.8019	NaN	12857.536	NaN	11988.093	NaN	12560.518	NaN	13945.561	NaN	NaN	NaN	14695.282	NaN	NaN	NaN	NaN	NaN	NaN	NaN	NaN	15729.479	NaN	NaN	NaN	14572.372	NaN	NaN	NaN	NaN	NaN	NaN	NaN	17406.439	NaN	NaN	13526.506	NaN	NaN	NaN	NaN	NaN	NaN	NaN	NaN	NaN	NaN	NaN	NaN	12586.291	NaN	NaN	NaN	NaN	NaN	NaN	NaN	NaN	NaN	NaN	NaN	NaN	NaN	NaN
2.9353	NaN	12874.803	NaN	NaN	NaN	NaN	NaN	13874.144	NaN	NaN	NaN	NaN	NaN	NaN	NaN	NaN	NaN	NaN	NaN	NaN	14150.236	NaN	NaN	NaN	NaN	NaN	NaN	NaN	NaN	NaN	NaN	NaN	15403.247	NaN	NaN	NaN	NaN	NaN	NaN	NaN	NaN	NaN	NaN	NaN	NaN	NaN	NaN	NaN	NaN	NaN	NaN	NaN	NaN	NaN	NaN	NaN	NaN	NaN	NaN	NaN	NaN	NaN	NaN
3.0687	NaN	NaN	NaN	NaN	NaN	NaN	NaN	NaN	NaN	NaN	NaN	NaN	NaN	NaN	NaN	NaN	NaN	NaN	NaN	NaN	13496.091	NaN	NaN	NaN	NaN	NaN	NaN	NaN	NaN	NaN	NaN	NaN	12860.231	NaN	NaN	NaN	NaN	NaN	NaN	NaN	NaN	NaN	NaN	NaN	NaN	NaN	NaN	NaN	NaN	NaN	NaN	NaN	NaN	NaN	NaN	NaN	NaN	NaN	NaN	NaN	NaN	NaN	NaN
3.2021	NaN	NaN	NaN	NaN	NaN	NaN	NaN	NaN	NaN	NaN	NaN	NaN	NaN	NaN	NaN	NaN	NaN	NaN	NaN	NaN	12828.321	NaN	NaN	NaN	NaN	NaN	NaN	NaN	NaN	NaN	NaN	NaN	11956.793	NaN	NaN	NaN	NaN	NaN	NaN	NaN	NaN	NaN	NaN	NaN	NaN	NaN	NaN	NaN	NaN	NaN	NaN	NaN	NaN	NaN	NaN	NaN	NaN	NaN	NaN	NaN	NaN	NaN	NaN
3.3356	NaN	NaN	NaN	NaN	NaN	NaN	NaN	NaN	NaN	NaN	NaN	NaN	NaN	NaN	NaN	NaN	NaN	NaN	NaN	NaN	12578.612	NaN	NaN	NaN	NaN	NaN	NaN	NaN	NaN	NaN	NaN	NaN	11116.22	NaN	NaN	NaN	NaN	NaN	NaN	NaN	NaN	NaN	NaN	NaN	NaN	NaN	NaN	NaN	NaN	NaN	NaN	NaN	NaN	NaN	NaN	NaN	NaN	NaN	NaN	NaN	NaN	NaN	NaN
3.469	NaN	NaN	NaN	NaN	NaN	NaN	NaN	NaN	NaN	NaN	NaN	NaN	NaN	NaN	NaN	NaN	NaN	NaN	NaN	NaN	NaN	NaN	NaN	NaN	NaN	NaN	NaN	NaN	NaN	NaN	NaN	NaN	11420.826	NaN	NaN	NaN	NaN	NaN	NaN	NaN	NaN	NaN	NaN	NaN	NaN	NaN	NaN	NaN	NaN	NaN	NaN	NaN	NaN	NaN	NaN	NaN	NaN	NaN	NaN	NaN	NaN	NaN	NaN
3.6024	NaN	NaN	NaN	NaN	NaN	NaN	NaN	NaN	NaN	NaN	NaN	NaN	NaN	NaN	NaN	NaN	NaN	NaN	NaN	NaN	NaN	NaN	NaN	NaN	NaN	NaN	NaN	NaN	NaN	NaN	NaN	NaN	12145.451	NaN	NaN	NaN	NaN	NaN	NaN	NaN	NaN	NaN	NaN	NaN	NaN	NaN	NaN	NaN	NaN	NaN	NaN	NaN	NaN	NaN	NaN	NaN	NaN	NaN	NaN	NaN	NaN	NaN	NaN
3.7358	NaN	NaN	NaN	NaN	NaN	NaN	NaN	NaN	NaN	NaN	NaN	NaN	NaN	NaN	NaN	NaN	NaN	NaN	NaN	NaN	NaN	NaN	NaN	NaN	NaN	NaN	NaN	NaN	NaN	NaN	NaN	NaN	13072.131	NaN	NaN	NaN	NaN	NaN	NaN	NaN	NaN	NaN	NaN	NaN	NaN	NaN	NaN	NaN	NaN	NaN	NaN	NaN	NaN	NaN	NaN	NaN	NaN	NaN	NaN	NaN	NaN	NaN	NaN
3.8692	NaN	NaN	NaN	NaN	NaN	NaN	NaN	NaN	NaN	NaN	NaN	NaN	NaN	NaN	NaN	NaN	NaN	NaN	NaN	NaN	NaN	NaN	NaN	NaN	NaN	NaN	NaN	NaN	NaN	NaN	NaN	NaN	13368.14	NaN	NaN	NaN	NaN	NaN	NaN	NaN	NaN	NaN	NaN	NaN	NaN	NaN	NaN	NaN	NaN	NaN	NaN	NaN	NaN	NaN	NaN	NaN	NaN	NaN	NaN	NaN	NaN	NaN	NaN
4.0027	NaN	NaN	NaN	NaN	NaN	NaN	NaN	NaN	NaN	NaN	NaN	NaN	NaN	NaN	NaN	NaN	NaN	NaN	NaN	NaN	NaN	NaN	NaN	NaN	NaN	NaN	NaN	NaN	NaN	NaN	NaN	NaN	12771.938	NaN	NaN	NaN	NaN	NaN	NaN	NaN	NaN	NaN	NaN	NaN	NaN	NaN	NaN	NaN	NaN	NaN	NaN	NaN	NaN	NaN	NaN	NaN	NaN	NaN	NaN	NaN	NaN	NaN	NaN
