X,Y
0.00000,30582.617
0.13342,33083.629
0.26684,32578.842
0.40027,31547.471
0.53369,31089.967
0.66711,32300.402
0.80053,31022.047
0.93395,30601.863
1.06737,30880.740
1.20080,30871.545
1.33422,31213.018
1.46764,32161.535
1.60106,35439.824
1.73448,38988.012
1.86791,41723.914
2.00133,37660.027
2.13475,34827.797
