0.00000,12091.606
0.13342,12758.860
0.26684,14409.174
0.40027,17567.734
0.53369,18757.631
0.66711,15498.382
0.80053,14590.987
0.93395,14482.127
1.06737,14253.493
1.20080,14615.843
1.33422,14618.193
1.46764,14724.973
1.60106,15021.755
1.73448,14693.221
1.86791,15383.692
2.00133,15252.661
2.13475,15544.167
2.26817,15766.296
2.40159,14870.853
2.53502,13990.468
2.66844,13502.816
2.80186,12447.654
2.93528,12251.415
3.06870,12763.187
3.20212,12503.157
3.33555,12713.264
