0.0000	30956.1973
0.1334	31006.9688
0.2668	30541.4297
0.4003	31695.5605
0.5337	32801.0781
0.6671	30812.6777
0.8005	33426.9258
0.9340	38011.8672
1.0674	45886.5156
1.2008	63706.0391
1.3342	91442.4922
1.4676	96934.6562
1.6011	67363.0078
1.7345	46417.0273
1.8679	38417.3633
2.0013	36383.1602
2.1347	35046.1953
2.2682	32647.1660
2.4016	32269.1211
