0.00000,34850.250
0.13342,35005.863
0.26684,36788.918
0.40027,35767.449
0.53369,36392.199
0.66711,36714.090
0.80053,37058.141
0.93395,37890.949
1.06737,38323.391
1.20080,38668.762
1.33422,40102.230
1.46764,46990.652
1.60106,61951.355
1.73448,86158.383
1.86791,89151.664
2.00133,66070.797
2.13475,50373.945
2.26817,44420.242
