x	Y_20180514_15100_1_4g	Y_20180514_15100_11_1g	Y_20180514_15100_11_7g	Y_20180514_15100_13_4g	Y_20180514_15100_16_4g	Y_20180514_15100_17_1g	Y_20180514_15100_17_4g	Y_20180514_15100_17_5g	Y_20180514_15100_21_4g	Y_20180514_15100_21_8g	Y_20180514_15100_30_1g	Y_20180514_15100_30_4g	Y_20180514_15100_31_1g	Y_20180514_15100_6_5g	Y_20180514_15100_7_8g
0	15522.4414	13693.4551	13737.9971	16556.3008	14871.835	14830.4824	13069.8369	12239.1143	15141.6797	13703.3096	14997.8135	14273.6094	14100.0312	12842.0586	12836.5186
0.1334	16122.9873	14012.6406	14300.8379	17385.8223	15807.6338	15583.0859	13868.9131	12666.0215	16134.4404	13695.9062	17825.1895	14842.0586	14348.623	13429.9951	13663.1504
0.2668	19848.4746	14782.6963	15362.6533	18344.4434	19058.7676	18595.4277	15549.2061	15615.0352	18575.8613	14224.6836	21495.5742	18060.2109	14568.1377	15032.8828	14049.7744
0.4003	23636.3145	16289.1973	17906.1484	22055.0723	23826.9473	23322.5703	18122.207	18875.6953	21359.2715	15008.1143	21037.2324	20551.3301	16444.8633	17436.1777	14106.1641
0.5337	24553.8652	19177.5977	18892.1113	24943.9316	22861.9609	26030.2344	20266.6309	21225.0742	26521.8926	17735.9355	18984.6738	19640.0234	19483.5059	20444.9375	15197.2725
0.6671	23063.9414	23853.4863	18354.9336	28600.9219	18900.7598	22155.207	17911.4844	17928.7832	25384.6699	19972.3242	16296.916	16516.3281	22559.416	20190.8828	18149.6836
0.8005	21710.3105	24335.707	16732.9785	26500.6094	17187.0781	19613.5488	16374.665	15431.5762	20316.0254	21333.5098	15916.2461	15918.2939	23726.8203	19712.2598	19562.8828
0.934	19259.2578	21812.8008	16626.5762	21763.8613	16218.8643	17753.7695	14634.6836	13866.9053	17252.7578	19414.2168	15222.3389	14655.0664	22103.8418	20658.5566	18125.4062
1.0674	16543.543	17813.6035	16369.4609	20909.1758	16089.8945	17187.9941	13607.6787	13901.9229	16591.3379	17968.6055	14828.6152	13451.292	19338.4961	20910.9062	18016.2051
1.2008	16041.126	17235.9863	15528.3359	18390.2754	16943.6836	15222.8809	13734.459	13367.6045	15732.5898	16798.2188	14520.1133	13713.8008	17998.7227	19717.1465	17663.7441
1.3342	13947.1953	17616.875	14590.7129	16787.459	16728.1211	14447.6982	13224.5059	13270.2158	15794.126	16929.334	14396.1123	13964.7637	17080.0098	20495.375	16497.8145
1.4676	13953.832	17178.3184	14854.6729	17715.834	15086.2549	13416.5645	13364.5352	13817.7686	16715.1797	16280.8906	14694.5859	16460.9121	17344.7422	20442.9238	16046.5068
1.6011	14625.0225	17660.5039	14214.9668	15685.2305	15724.5332	12933.7988	14963.2031	13885.4346	16659.9473	17267.9355	14575.5918	16669.6855	17577.2676	19663.0605	15807.2129
1.7345	15348.5039	19118.1738	14389.7734	16096.9219	15426.0801	13974.3418	14763.7041	13032.4443	18744.2871	17003	14890.3887	16938.375	19255.4453	19104.2402	15065.2148
1.8679	18736.0078	19841.9395	15360.0781	12726.7979	15690.3818	13986.7637	15053.8779	13665.0557	21488.2754	16974.0293	15429.584	15586.2949	19329.8438	17751.1387	15209.3672
2.0013	21572.5918	18097.9219	16238.4717	13944.707	14416.6631	14043.084	14675.083	13709.3779	21993.7207	16584.4453	15692.6709	14849.6953	20818.2012	17352.957	15276.6592
2.1347	21149.8027	16338.9229	15606.8115	14745.3516	14773.1787	13900.8818	14840.8242	13400.1182	19839.3574	16326.541	14952.3818	13268.0088	21158.2578	16609.0996	16713.0781
2.2682	18121.3359	16581.0137	14980.0176	14761.5264	14198.5977	13901.1221	14668.2471	12126.4189	17174.873	15590.7949	13799.874	13716.7031	19696.1035	15859.7344	17992.457
2.4016	15128.0049	15926.7109	14256.7412	16428.1777	13633.9941	14345.6924	14376.123	12348.4385	16346.6553	15851.375	13082.2979	12662.2354	18658.4785	15081.4736	16719.4902
2.535	14135.5957	15694.207	13707.1523	17203.7109	13447.2383	14204.0449	14192.251	13665.9893	15429.5557	14479.4746	12871.8057	13189.9033	17503.9727	14567.4561	15948.0752
2.6684	13222.1719	16187.752	13546.3848	16515.0371	13879.502	14134.5664	13132.0059	13795.5088	14457.5166	13470.0732	12912.668	12956.3857	16315.1611	14366.748	15553.9648
2.8019	14375.7637	15535.9688	13271.7471	15618.5381	13710.6162	13879.6943	12497.9844	13854.043	14537.2578	13113.2188	12960.2109	12667.9951	14704.1689	12701.3477	16425.7285
2.9353	13928.7119	16195.8262	13282.4834	15059.6855	12372.3525	14522.5518	12438.498	13845.0068	13901.2783	12689.5332	NaN	12649.8389	13511.8271	12481.5391	NaN
3.0687	14141.9756	15608.6982	13516.2363	14681.2373	13279.9404	13761.7539	12650.9707	NaN	13565.6641	13181.4727	NaN	12853.5859	13172.4443	NaN	NaN
3.2021	13256.0469	14193.3418	12814.2783	14723.5752	13216.2715	13620.5879	12018.79	NaN	13831.9775	12881.5059	NaN	12591.9395	13528.9307	NaN	NaN
3.3355	NaN	NaN	13482.5293	13654.5469	13432.7373	13809.9473	NaN	NaN	13902.6436	12673.0293	NaN	NaN	13491.0078	NaN	NaN
3.469	NaN	NaN	14122.0811	NaN	12960.3271	NaN	NaN	NaN	NaN	13401.3516	NaN	NaN	13343.2549	NaN	NaN
3.6024	NaN	NaN	NaN	NaN	NaN	NaN	NaN	NaN	NaN	NaN	NaN	NaN	NaN	NaN	NaN
3.7358	NaN	NaN	NaN	NaN	NaN	NaN	NaN	NaN	NaN	NaN	NaN	NaN	NaN	NaN	NaN
3.8692	NaN	NaN	NaN	NaN	NaN	NaN	NaN	NaN	NaN	NaN	NaN	NaN	NaN	NaN	NaN
4.0027	NaN	NaN	NaN	NaN	NaN	NaN	NaN	NaN	NaN	NaN	NaN	NaN	NaN	NaN	NaN
4.1361	NaN	NaN	NaN	NaN	NaN	NaN	NaN	NaN	NaN	NaN	NaN	NaN	NaN	NaN	NaN
4.2695	NaN	NaN	NaN	NaN	NaN	NaN	NaN	NaN	NaN	NaN	NaN	NaN	NaN	NaN	NaN
4.4029	NaN	NaN	NaN	NaN	NaN	NaN	NaN	NaN	NaN	NaN	NaN	NaN	NaN	NaN	NaN
4.5363	NaN	NaN	NaN	NaN	NaN	NaN	NaN	NaN	NaN	NaN	NaN	NaN	NaN	NaN	NaN
4.6698	NaN	NaN	NaN	NaN	NaN	NaN	NaN	NaN	NaN	NaN	NaN	NaN	NaN	NaN	NaN
4.8032	NaN	NaN	NaN	NaN	NaN	NaN	NaN	NaN	NaN	NaN	NaN	NaN	NaN	NaN	NaN
4.9366	NaN	NaN	NaN	NaN	NaN	NaN	NaN	NaN	NaN	NaN	NaN	NaN	NaN	NaN	NaN
5.07	NaN	NaN	NaN	NaN	NaN	NaN	NaN	NaN	NaN	NaN	NaN	NaN	NaN	NaN	NaN
