0.00000,35427.602
0.13342,37153.211
0.26684,35104.129
0.40027,36064.613
0.53369,35581.781
0.66711,37132.320
0.80053,38942.430
0.93395,41068.027
1.06737,51099.480
1.20080,76888.531
1.33422,116518.609
1.46764,126407.039
1.60106,86337.117
1.73448,58051.980
1.86791,46155.676
