x	Y_20180514_15323_1_5g	Y_20180514_15323_1_9g	Y_20180514_15323_10_10g	Y_20180514_15323_12_6g	Y_20180514_15323_14_7g	Y_20180514_15323_15_1g	Y_20180514_15323_15_9g	Y_20180514_15323_16_14g	Y_20180514_15323_16_2g	Y_20180514_15323_16_4g	Y_20180514_15323_16_6g	Y_20180514_15323_16_9g	Y_20180514_15323_17_2g	Y_20180514_15323_17_9g	Y_20180514_15323_19_12g	Y_20180514_15323_19_7g	Y_20180514_15323_2_2g	Y_20180514_15323_2_6g	Y_20180514_15323_2_7g	Y_20180514_15323_20_13g	Y_20180514_15323_20_16g	Y_20180514_15323_20_18g	Y_20180514_15323_20_19g	Y_20180514_15323_20_1g	Y_20180514_15323_20_22g	Y_20180514_15323_20_23g	Y_20180514_15323_20_6g	Y_20180514_15323_20_8g	Y_20180514_15323_20_9g	Y_20180514_15323_21_14g	Y_20180514_15323_21_3g	Y_20180514_15323_21_9g	Y_20180514_15323_22_15g	Y_20180514_15323_22_6g	Y_20180514_15323_23_10g	Y_20180514_15323_24_10g	Y_20180514_15323_24_6g	Y_20180514_15323_25_11g	Y_20180514_15323_25_18g	Y_20180514_15323_25_19g	Y_20180514_15323_25_1g	Y_20180514_15323_25_7g	Y_20180514_15323_26_16g	Y_20180514_15323_27_4g	Y_20180514_15323_27_5g	Y_20180514_15323_27_7g	Y_20180514_15323_27_9g	Y_20180514_15323_28_4g	Y_20180514_15323_28_9g	Y_20180514_15323_29_1g	Y_20180514_15323_29_5g	Y_20180514_15323_3_8g	Y_20180514_15323_30_3g	Y_20180514_15323_30_4g	Y_20180514_15323_30_5g	Y_20180514_15323_5_9g	Y_20180514_15323_6_16g	Y_20180514_15323_6_2g	Y_20180514_15323_6_8g	Y_20180514_15323_7_10g	Y_20180514_15323_7_6g	Y_20180514_15323_7_7g	Y_20180514_15323_8_6g	Y_20180514_15323_9_15g	Y_20180514_15323_9_1g	Y_20180514_15323_9_2g	Y_20180514_15323_9_6g
0	14586.9258	14518.2588	11325.2002	11176.7617	12062.3701	14080.5156	13219.6396	10629.8789	10515.4922	14205.4766	13353.3096	12101.8281	13545.3154	15833.8262	11933.3516	13578.584	12326.7617	14195.375	12218.9062	12348.1094	10585.0703	11615.5469	14373.4893	11918.4033	11004.0938	15918.8438	11605.1377	11439.4287	12608.8828	12058.125	12203.8613	12311.8828	11532.6758	12697.3564	10378.4854	13963.002	15733.9062	11412.5283	13444.9697	11710.4307	20158.1094	12986.9902	11807.1211	12935.2422	12661.2715	10584.6357	12218.624	11499.9326	15387.543	12222.1592	12537.4209	11319.5264	12141.6377	12959.4473	10951.6758	15053.4697	12097.4961	13943.9648	13392.8135	12204.4561	11808.1885	13250.0674	12067.6475	12340.1719	12120.084	13000.8867	14808.167
0.1334	14926.7246	15037.8916	11744.8311	12013.9541	12575.0967	14607.5586	13968.668	10660.9561	11818.2607	14603.6113	13664.7061	12955.6357	13340.0977	17163.502	12011.9844	14696.457	12091.4893	16305.6416	13367.7979	12126.123	11579.0518	12479.3945	13668.6367	12055.79	12094.8457	18193.9062	12944.5752	12421.1201	12713.5488	13548.8457	12779.6807	12847.3428	13939.7949	12933.5771	11080.1182	13524.6543	14878.5615	11253.6777	13317.0879	11622.4756	18046.0215	11755.415	11788.4395	15041.9316	13511.4209	11013.6631	11943.4023	12891.5605	19166.3066	12133.4697	13474.1484	11304.3936	13848.8945	13294.0244	11772.8184	15857.1582	12423.335	13552.8838	13870.0371	13515.4648	13484.7178	13637.3262	13880.7559	14237.5176	13111.0664	12565.4043	16427.1211
0.2668	16432.9141	18240.6914	11705.3818	14995.7295	13514.7383	17595.625	16171.1758	11434.0127	13401.332	14351.0732	14817.3838	13547.1309	15784.3945	22524.3223	12856.4434	17611.3633	12238.9746	21036.6914	14364.1367	13798.1152	12245.2939	13305.8105	13126.3291	11758.3428	14400.4688	25672.8262	15675.3203	13409.9932	13286.0918	14132.2549	14333.2295	13717.502	17494.6895	14774.0156	12334.2021	16236.001	15652.7266	11631.1914	15469.4238	12093.874	17732.1445	11679.0186	12718.8809	21182.9531	17353.3379	11352.4951	11765.3633	16916.9004	26139.0781	14395.2412	12766.8623	12041.749	15369.999	14102.9062	13045.2949	15834.5098	11659.2432	13552.1152	15314.7461	14524.6816	16022.2314	14421.3037	17014.9141	17401.2227	15482.9756	13245.4521	20856.7266
0.4003	17943.0098	22484.6035	14434.9424	21889.4531	15553.1982	20487.457	21844.2812	14021.4189	17426.2793	17890.5371	18037.209	16064.4639	20910.9648	30395.7344	13948.9648	20814.459	12701.0596	29218.5254	16552.877	15427.1895	12900.5312	15813.1211	14194.6045	12307.3057	19105.1367	30174.9082	20679.4336	16129.1309	14978.6553	15465.1611	15523.0518	14415.623	23048.4277	21247.5938	15302.5557	21904.2285	17658.8555	13195.2061	21013.582	13739.1416	23030.3223	12286.0586	13724.7119	29573.4004	23497.7578	12666.3223	13238.0156	20991.7832	29399.6719	17161.9805	14458.5918	13265.4502	19953.1934	15321.2871	15172.5283	17024.4473	11549.832	13377.9102	16883.8418	21658.3867	23774.3223	17366.6562	25051.0527	21847.8457	20311.8438	14082.5059	28169.2227
0.5337	20246.1895	31211.377	18622.1816	35777.8281	21955.8691	30239.6152	25866.0176	19989.0078	28708.9922	27175.1309	23033.0508	20641.7598	27535.0859	32836.2383	19382.3945	28108.7324	13622.4854	41774.043	21484.9238	17953.6074	13925.0068	21975.7656	16418.9434	14915.873	27315.0137	28578.2734	28518.0625	21735.9785	18624.0547	17915.7227	18561.7148	16644.5566	25570.5605	27858.9395	22758.4453	32246.2051	21214.6758	16218.0664	25705.7051	18534.6621	37258.8125	13216.4033	16934.9141	30416.9629	29247.5273	16203.3242	17460.416	20091.998	29051.9062	22671.1562	18692.7871	15606.8154	27109.5332	18987.6934	22091.6367	19657.0391	12622.8633	14615.501	23206.5156	29756.668	33091.0781	21117.9102	28765.9785	27179.1484	24396.5195	15761.71	32358.6191
0.6671	28004.3242	39198.5508	29693.2559	41881.5469	28591.9004	36933.8711	25400.7754	25412.3105	40879.3555	39506.0234	21207.4785	23258.4453	26951.2734	28519.4609	29111.2285	29945.916	14941.2354	39751.0508	28315.9648	19538.9316	15448.1826	28893.1777	20536.0176	21581.2793	43890.2539	22692.0762	26656.6895	27718.6387	27618.5312	23381.1855	21904.2559	20160.7598	24780.4434	31851.8438	31000.4023	38560.5898	23613.8848	22669.7285	31652.6953	23918.4902	52264.5625	15463.1758	23010.2598	27638.8379	30287.1152	25067.0781	28290.375	18179.5762	25998.9902	32608.6562	25411.6641	20841.6523	33812.6641	24032.1445	27681.5898	21616.5176	13946.3633	17318.6523	27389.6387	35694.8203	31696.8105	28325.8086	26047.582	28443.6133	24129.9062	19687.4707	27377.0645
0.8005	34515.1445	34311.4766	40533.8438	36762.7578	30449.1875	35470.6602	20815.3301	26079.3574	41482.8867	44428.4141	19106.0977	22412.8613	22814.8262	24905	36595.8281	26393.8477	18450.0762	30404.7266	30255.4043	18204.6113	16572.6855	29566.1953	23617.2363	28447.6465	53542.3945	19715.002	19575.3203	34681.582	33651.3789	31742.918	25410.4551	28064.9648	18807.2754	29004.6348	31704.2363	33578.5938	22309.707	29088.4824	28313.6016	25651.8418	50123.4648	17582.9785	26479.3301	24958.6816	25499.5	36748.4844	41071.2266	16513.209	24593.2129	45524.6406	26679.3164	28942.5039	30587.582	27978.6797	26953.584	23113.9961	20150.6387	23981.1211	25532.5059	37571.375	25683.6172	33351.6172	22230.9473	22513.918	19318.4453	27772.4043	22609.623
0.934	28050.418	27037.7812	37418.1016	30339.0117	27303.0918	31570.0293	17652.6914	23186.832	31727.6367	36197.7305	17616.1797	19028.4199	19652.1777	22278.5293	35391.3672	22651.2246	23881.6191	24468.25	26848.4512	17230.6152	21043.9512	24245.6172	20995.1777	28568.043	48962.4648	18243.0938	17060.1113	37620.6289	31153.5605	32778.7227	24417.6348	36266.2227	16972.6914	27940.7402	28611.3418	26074.9414	19529.9492	29155.0938	26593.1523	22151.248	39658.2773	18491.7871	23634.8281	22986.3125	21799.7266	39970.2266	38177.7422	18164.9941	24977.7051	41489.8477	21895.3105	32082.2988	24955.4629	27517.5879	23580.6133	21145.2637	29901.7773	28331.1758	23038.6699	31666.4395	22549.0645	29362.5469	18619.2168	19059.0723	17303.6875	32463.9688	19523.4844
1.0674	23076.791	22453.3438	29234.082	26794.6113	26011.6016	29796.0996	17464.4434	21321.6523	24173.9277	27215.0449	15990	16572.4238	20662.1621	20909.2559	31438.6992	21604.668	31783.7539	21806.5391	23653.7637	15862.0273	29898.377	19277.0391	19869.7129	21693.5977	36650.0625	18596.2129	14653.4863	37689.2891	24838.1113	29044.5723	21536.1543	36026.9805	17002.1836	25984.1152	23651.9062	23486.1621	17376.8984	23986.1621	22693.8945	21538.9805	30899.2031	17150.7441	20024.5488	22966.541	20835.8164	31573.8887	28701.3184	18609.7129	23207.123	29603.5625	18238.6621	29498.9824	22237.291	25995.6055	20843.916	18296.6328	41226.7227	25561.8633	20962.6465	22867.9414	20704.8555	23883.4297	17416.5605	18066.9414	16536.3984	26815.5547	18570.1953
1.2008	21011.8672	21528.7148	24040.7285	25993.9473	24079.7695	24659.3418	16374.9092	21084.5527	21992.7363	22795.0898	15466.7119	15553.1064	20988.8242	19575.4277	25424.3926	21071.4238	37882.5938	18883.8262	21904.6738	15799.1055	34329.1719	17773.0762	18535.084	18557.0977	27345.5762	17931.0215	12847.8379	30464.0996	22960	24557.8145	21974.6113	28801.5508	17748.1855	25606.7168	21061.1309	23226.459	15067.0469	19841.7207	21169.5762	23145.6699	26598.5527	16638.1816	18351.5059	23234.6777	20465.9785	25373.8867	23315.5605	18935.1973	20777.5215	20318.5039	16104.8896	23956.8535	22610.5996	24685.0664	19541.5332	17499.1719	39957.1055	22421.7383	18706.0566	19197.1035	19391.2832	20738.2656	17371.5293	17931.8438	16211.9199	20341.3125	17653.0938
1.3342	21628.5059	21831.5352	21370.7539	23207.7969	23022.3047	22080.9141	15657.376	21597.4473	22264	20660.0254	15519.8984	15284.9883	20069.8398	19268.6895	22738.6992	21521.332	36733.6641	18288.2754	21314.9785	15714.6191	27408.541	18048.2578	17635.377	19279.5176	24197.9121	17068.8047	13095.3115	25506.7441	21553.8203	22782.8223	19617.3496	24089.5566	18208.2051	26312.7246	17291.3496	25465.0859	15050.6592	18721.4863	21782.9551	20591.2852	23154.1191	15892.3486	16380.7168	23475.7656	19285.582	22964.7949	22273.6113	18956.1289	18380.1797	18865.3789	15710.5723	21218.6348	21558.6738	22542.6035	19028.2559	18119.5723	30782.9688	22889.5059	17696.1914	18239.6055	18017.1113	19657.7031	17014.2285	16650.6543	15639.1709	18729.4258	17073.2227
1.4676	21797.0703	20328.1914	18523.8262	20333.7969	22742.3555	22401.5762	14947.6689	21507.8535	23875.125	18434.8418	15905.1738	15256.6738	19029.6172	19101.7383	20909.6094	21793.7695	29726.5996	16205.3418	22279.207	15132.9014	21063.8047	17060.9492	15464.1729	18798.8711	24713.4453	17609.2812	12754.5977	21650.2227	20071.5293	21488.1641	19824.4297	22427.0312	17743.0605	27513.9805	16463.6309	27736.9062	15136.4102	17234.5312	22253.3008	18367.4297	22122.1309	15627.7676	14957.7539	22910.6797	17742.6719	21386.7285	20026.1895	18775.2051	16310.4844	17802.9961	15685.8525	21386.5625	20055.9004	21986.0879	19039.8125	18928.7422	25739.6719	25196.627	16558.1738	18974.6172	17812.5703	19158.959	17197.2637	17955.9492	15730.043	18001.4961	16845.9453
1.6011	19973.5762	20659.7852	19019.6094	18783.7383	22354.6348	21430.1309	14394.9385	22391.0273	25423.5137	17916.7344	15907.5947	15350.0234	18113.168	17744.9922	19544.6211	20306.7754	27576.5176	15891.7158	21882.1523	14186.7861	18764.4766	16112.4141	16817.4805	17888.8359	25122.9043	17157.2891	12498.75	23294.7754	18505.002	21213.6035	17089.334	22303.0742	16771.4004	29958.8535	15927.1865	27083.5957	15872.5996	17029.957	22096.9844	18092.4219	20513.5762	15715.0801	13749.5205	22775.8047	17010.5508	20211.4688	20582.1719	20122.8242	15904.9404	17482.5801	15692.6611	20982.0723	19280.3672	21329.3555	18083.9688	20872.1055	23903.041	22250.0957	17416.5742	17817.6777	17616.8672	18761.6777	17230.668	16870.8125	15384.1924	16352.7725	16860.791
1.7345	17199.1348	18962.4023	16917.8594	17805.832	21574.8477	20495.3867	13753.9941	21327.5215	25106.5742	17563.4219	16197.6953	15688.7588	16843.3906	15692.0908	17660.5332	17973.7676	23641.498	15609.4385	22237.5273	13815.4082	18088.4023	15987.915	16068.7588	17059.4531	25475.8418	18074.7812	12474.4082	22450.9844	18331.5098	23843.0605	17377.6172	20996.7461	16651.3887	26440.9316	16198.7236	25014.3984	16567.1895	18900.6523	21558.0195	18280.1328	18529.2051	15057.6191	13873.1973	20796.3867	17592.3184	21321.3262	19642.7305	19176.1953	15333.4932	18325.0723	15429.6426	18591.4863	19258.082	22209.4141	17797.3008	23566.2227	21997.3164	20117.043	18266.7949	17547.5957	18436.4414	18463.6895	17707.0723	17309.6016	15635.6055	15402.1025	16955.4336
1.8679	16641.9023	19080.0488	15882.0312	16358.3936	21955.8301	19034.0156	13630.6357	19705.4043	23597.1328	16953.668	15877.9297	14641.251	18554.8203	14646.7549	17117.3105	17262.7441	23923.5957	15902.4238	21787.7695	14367.9365	17034.7246	15370.8467	16980.5898	16470	25016.1621	18545.8027	11873.2041	22374.873	19033.1348	23267.5039	15485.0781	21764.3145	16808.9062	23744.418	16120.7363	23932.2168	18437.8965	19015.4375	22693.7969	17446.1211	17783.4473	15338.4365	13865.2256	20499.6484	18248.7734	20530.123	19582.9004	20691.1191	14869.1797	16919.3652	15297.9443	18284.8418	18639.9688	22264.8516	17695.3262	32592.1641	21512.8457	19172.4766	17330.1562	16744.1484	19422.541	17621.0957	17067.0391	15982.5898	13991.1094	15110.2812	17619.1152
2.0013	16676.9141	19914.4102	15051.833	15139.6631	21651.7559	19901.9062	13253.8164	18177.1484	20739.9512	17627.416	16041.8076	15749.8037	18341.041	13671.5645	17398.8828	16713.4961	22068.6914	17173.0098	22235.9707	13665.6387	15702.0361	15303.2002	16202.9795	15212.9756	24921.2109	18449.668	11750.4531	19577.125	18991.918	22102.6992	15383.6445	20660.4883	16860.3379	21462.2148	17520.8301	23171.0176	18126.1797	18544.9941	18870.459	16808.8809	18117.8711	15089.5508	14739.7168	22961.4453	18032.125	19659.3281	18521.7539	21691.9355	14948.6035	16579.5859	14116.7646	18834.2793	18224.4277	22188.0918	16132.2471	40643.6289	21408.332	18212.4219	18719.0586	16191.0244	18493.0801	17620.4277	16386.9336	14702.2637	12969.0996	15276.9365	17670.8789
2.1347	18250.0957	18789.7188	15424.252	15238.8652	20867.3125	18862.9004	12576.0859	17616.3828	20250.8281	15954.0732	16255.627	15962.3926	17151.5078	14109.833	15424.5771	16128.9756	20737.2539	17730.4688	21453.6348	13105.6396	14610.4854	14782.9971	15053.1113	15095.4277	23864.6895	16778.5566	12159.0244	18243.4121	18854.9082	19098.7344	14962.3848	19721.5	16204.1182	19628.8418	18958.8652	22046.375	18130.1543	18339.0508	19172.7949	15466.9316	18356.4453	16686.2031	13524.9297	23472.2852	17374.7148	19549.7188	17917.8945	21671.9473	15282.1934	16850.9102	14188.4932	18605.7969	18401.4316	20213.4219	16339.2832	40000.7969	21698.4336	18000.582	18458.1484	15929.3643	19275.5762	18131.4805	15889.5693	14529.4082	12592.3047	14107.2764	17350.2734
2.2682	17663.4883	20875.0488	14817.9004	15195.4326	20801.0137	18781.293	13231.0469	16332.4863	19216.1914	15462.3574	16622.0273	14705.8809	16955.4922	14384.2764	14868.8252	15708.8408	19304.498	20629.8926	21993.4492	12946.373	15094.3926	15054.7529	14423.8457	14579.6641	22966.1777	16039.2207	12496.8584	17592.1621	18382.2246	17649.1758	14070.6152	18366.4121	15994.252	18144.9277	19666.668	19939.877	19173.6602	19277.5312	16611.9141	14299.9082	20103.3125	16536.5352	13083.8359	22586.9277	15369.8887	19551.3477	17565.0898	19590.3711	16362.4551	15876.3105	14885.915	18470.502	18988.9336	18707.752	15935.9238	30437.9922	21805.5234	18369.7832	17381.0605	17041.0371	19749.123	19976.8066	15824.793	15001.7754	12523.5879	13699.4209	16767.0117
2.4016	18229.1465	22145.7695	15462.8936	15712.4658	20008.3125	18691.3145	13534.7646	15440.375	19426.5684	15793.4492	17101.1836	14504.668	17592.2461	13718.0137	14941.0908	15094.502	20012.6543	24641.0723	20616.3633	13129.4121	16403.7363	14518.2295	15414.6445	13981.5947	20241.5859	16227.1318	13047.7178	16701.7578	18392.0703	16147.6855	13006.0244	17440.9648	15212.3535	17368.2266	18521.3047	17290.125	17135.5215	19173.502	16301.6035	13422.502	19631.625	17080.0566	12767.0859	21056.1699	14097.4062	19775.3477	19059.1328	18508.5781	15687.5176	15691.8223	15238.4443	19375.0938	17523.627	17305.4023	16574.6602	23732.3145	21212.7168	18463.793	16681.6934	17027.918	19415.252	21401.916	15198.4502	13195.6445	12331.9033	13578.708	16468.3984
2.535	17840.7988	22634.0332	16239.4297	15255.7178	20512.4473	18644.0742	13823.3838	14496.2461	19617.832	17597.7754	17726.4102	15241.1104	18251.3203	14800.8623	14475	14085.9111	19843.1484	27640.5488	20552.9902	12968.1689	15026.54	13802.7705	15786.8174	14266.4336	18180.6426	16334.0088	13141.667	15802.3174	17751.2188	15609.2803	13692.585	17275.2266	13934.626	16857.6191	17980.2129	16783.3848	15852.0752	17059.6211	15011.542	13913.7979	18399.498	16433.7695	12929.4941	19514.6387	13503.4326	17468.8887	19524.4316	18114.373	14953.168	15044.7168	14773.5225	18547.7617	15089.0898	15878.3457	16903.2988	18927.5977	21415.5781	19129.4648	15289.9375	14996.0352	19965.3477	19527.8008	14814.6992	14559.6143	13094.1055	13947.0186	16219.0967
2.6684	19779.8496	23365.4434	16667.5605	14492.5967	20214.1367	17326.082	15587.709	13817.4375	17553.1621	20723.6641	17480.9414	16587.7871	20259.7656	15468.1582	14419.8467	14884.4775	19314.9629	27726.4668	19810.8867	12638.9268	15357.1641	14123.5996	16708.2207	13537.8018	16649.9434	17258.8555	12744.1279	15369.1768	16659.6387	15329.2246	13603.708	18277.7793	13490.6494	15528.0469	16510.7148	16533.7148	15341.2188	17251.9785	14572.7246	15296.1123	16563.5801	17773.8652	12277.1074	18685.0898	13662.3379	16375.6094	20403.6719	17605.9805	15182.2764	14578.75	14613.9453	19274.8945	13979.5752	16023.875	15942.0322	17338.9668	20980.5566	18946.5195	14787.8594	14707.6846	20374.3223	18638.1309	15607.6465	15899.2031	12894.1172	14485.0547	14651.96
2.8019	22263.7871	22602.4277	15360.4346	14249.8643	19842.2129	16558.416	15894.3398	13209.2031	15671.3359	22220.1875	16048.8525	17009.2148	19582.8066	15942.207	14402.9072	14369.6875	18598.25	27816.793	19829.3008	13015.877	15592.2988	14565.3877	16014.0459	13997.3809	15643.3877	17179.4277	14097.3564	15944.4043	15999.4219	15538.7012	13493.5967	17241.4492	12816.0752	14294.5908	15940.709	16898.9121	14549.415	15880.0479	14452.7705	15086.2988	15406.2949	20490.1328	14082.5566	17515.334	14824.3584	15910.6533	20055.543	16651.8555	14501.2168	14675.7461	13598.8262	18625.3906	12462.4238	14882.4639	15223.6445	15672.8916	21723.1562	18507.8438	13438.6514	14490.166	20705.3281	17584.9785	15612.0479	16533.5078	13543.6328	14880.5449	14132.7725
2.9353	24484.3809	20473.3906	16029.5303	14041.6025	17886.3965	15774.6123	15510.5811	12243.6152	14229.9814	21870.5957	15616.8809	16033.0059	17963.6934	16023.2188	13731.9004	13950.834	18689.6602	26247.4102	19705.4902	13515.5488	15953.9463	16380.6465	15250.5322	14585.5273	15906.3184	16316.4971	14697.6641	15755.7705	15307.6006	15083.2529	14147.9893	16683.875	12018.0986	13934.1377	17181.9316	16408.4844	13754.2324	15017.9229	14913.0215	15740.6572	14579.4727	24322.7969	15330.4141	16746.1387	16300.8799	14615.6855	19787.3945	16422.6426	14223.5889	14451.3477	13516.2461	19422.832	12544.3887	14364.0391	14375.1582	15455.6387	20575.6172	16197.3154	13037.7412	14618.501	19085.1934	17187.0977	14968.7734	16659.8301	13282.9316	14113.2061	13336.2441
3.0687	26037.377	18962.248	17400.5566	15137.4443	17707.3984	14867.2178	15837.4932	12727.6191	13075.9414	20576.0195	14774.8867	15144.6768	17031.0566	15318.5625	13190.292	14171.7012	18836.0234	22494.9219	19869.6113	13980.8145	15425.9375	17655.2754	14464.7783	14542.3945	16403.7773	15312.2275	16091.8018	14760.8008	16749.668	14232.6475	14826.6621	14583.3193	12920.4814	13006.9648	19344.4199	15282.3545	13493.5293	14961.4316	16059.8887	15704.9033	14259.9736	24730.8047	15568.9189	16534.5137	18447.8574	14051.0957	19954.8066	14575.9531	15118.6836	15251.7861	14308.5293	19562.373	12997.7793	14605.6572	13381.1709	15222.3447	20002.3613	15802.2373	12864.2812	15100.252	15914.4385	15500.7295	14429.9795	14791.9082	13469.6943	14148.8516	13159.666
3.2021	25955.7773	17814.6289	17155.4863	14361.0068	17056.9434	14030.418	15817.4531	13173.8057	12507.6934	18467.793	13915.0713	14907.2852	18285.3223	14489.6836	13484.3926	14887.0293	18806.6133	17837.1602	20778.8809	14031.3252	14971.0977	17655.1504	12604.1416	14082.0732	18208.9199	14767.2383	17105.6777	14328.7412	17589.6523	15577.1387	14867.791	13425.8154	13251.6934	12159.2979	17447.1758	13643.7686	13338.4277	14691.7949	15448.7002	16301.043	14528.4912	19236.2832	14703.458	16567.8164	17710.1133	13929.8271	20700.5586	13537.498	14929.7637	13595.2051	14070.5723	18504.6055	14511.709	14696.0225	13229.168	15527.4033	18192.4629	16791.793	13052.0127	15370.2539	15927.333	15590.1777	14331.6436	16920.8848	13941.2637	13911.3799	13184.1182
3.3355	26882.3945	16840.1426	15697.2119	13792.5742	16340.4707	13881.5557	15829.3799	13736.4609	12414.9678	15165.0781	12790.9961	14088.9688	17538.873	14205.1973	12918.8193	13689.6895	19078.7852	14962.6855	19561.6016	15100.7471	15110.3008	16531.3027	12380.6064	13640.835	19392.2285	15727.8652	16841.1191	13927.1094	17056.6523	15840.0605	14128.5947	13838.1318	12699.2305	12150.917	15851.1309	13241.7012	12808.7363	15240.2881	14447.4121	17031.7188	14340.9033	15976.5059	15113.458	15884.1846	15531.499	13323.4014	18955.9863	12479.2041	15681.9014	14659.6465	14524.7803	16452.6152	14390.665	14494.1533	13276.5205	14932.8691	18081.123	16598.2656	13550.8809	15331.0215	15917.4229	15529.1865	14227.7637	16154.3936	13967.6387	13867.9443	12627.7402
3.469	22787.6484	17317.123	14701.4746	12942.7383	15704.1445	14736.6973	16976.9102	13928.7471	12231.5938	14253.8955	12731.2422	13641.0527	14719.5986	14356.8057	13123.0947	13504.1162	17742.5176	13873.834	16910.5449	15825.8828	14350.4111	15537.9121	13160.6768	13368.8887	17992.166	16934.2852	16073.5342	13902.8301	16363.1318	16052.6455	16229.915	13682.4893	12531.959	12854.1309	15078.625	13184.9043	12614.0947	13759.3721	14600.0762	17550.7227	13576.5029	15307.5088	14845.0059	15874.8604	13996.7393	13610.665	16900.9512	12886.0391	NaN	16141.9482	16774.8535	14519.166	14897.5176	15129.29	13446.417	NaN	15791.2793	16658.6934	13889.8623	15124.292	15488.8828	14760.5674	14322.4199	15572.1631	14375.9922	14892.5244	12137.9678
3.6024	19236.5586	15575.9854	14351.7529	12458.0693	17447.6211	13020.1318	NaN	14780.0684	12175.0361	NaN	12802.3506	NaN	13951.7275	12903.2197	13371.3281	13764.0908	16820.7812	13593.7393	16270.2773	14792.1045	14287.9443	14125.5645	13226.7891	13341.9209	15424.8027	16629.1953	NaN	14648.7656	16227.7051	15021.79	17856.3652	13643.9814	13135.3867	NaN	NaN	13218.9102	12938.29	13285.5352	15357.2246	17198.9551	NaN	14283.0977	13919.2588	15055.6475	12725.6562	13027.2617	15289.1289	13175.043	NaN	15916.2451	15636.0537	12571.1885	15044.291	14714.6172	12857.8945	NaN	14479.3154	16545.9238	13655.3877	15948.6602	15591.3213	13848.5889	13666.3721	17327.5176	13631.9746	15329.2891	11902.6475
3.7358	17878.1309	15509.2158	13726.0732	12445.1152	19679.1406	14599.0986	NaN	NaN	12792.9912	NaN	NaN	NaN	13811.7188	12832.168	12712.5439	NaN	16526.5176	13675.9561	NaN	14201.1709	14010.0879	13164.7207	13428.9199	12941.0391	14123.002	NaN	NaN	14701.9248	15962.9277	14579.6084	17343.1777	13990.4629	12052.79	NaN	NaN	13271.7012	13191.085	12539.1914	16750.1953	15539.0107	NaN	14884.2188	13501.4531	14422.2559	13153.7354	13406.2568	14495.2734	13507.2891	NaN	15925.75	15090.9883	12030.5859	14461.915	14724.1982	13261.1221	NaN	13739.4053	NaN	13812.6885	16237.4863	NaN	13028.9395	13990.4912	NaN	NaN	14948.252	12688.2607
3.8692	16772.0312	15274.3057	13591.6738	12541.1416	22511.6387	14140.8643	NaN	NaN	NaN	NaN	NaN	NaN	13408.4199	NaN	12444.6553	NaN	15478.8447	13419.1641	NaN	14963.7188	15153.0127	13324.2178	14077.6455	12013.9912	NaN	NaN	NaN	14958.2266	15083.1631	13977.3271	18827.4199	13685.2686	12502.0547	NaN	NaN	13249.5176	NaN	12956.6797	NaN	15172.8291	NaN	15110.7217	12994.8779	13649.8291	13452.7773	12911.1689	14084.8926	NaN	NaN	16081.6289	14665.7217	12914.9404	14671.2998	13691.0146	13486.6689	NaN	13617.6943	NaN	14079.6445	17217.2754	NaN	NaN	14407.5879	NaN	NaN	14385.2217	NaN
4.0027	16720.3242	16298.543	12915.4805	NaN	NaN	14589.5371	NaN	NaN	NaN	NaN	NaN	NaN	NaN	NaN	NaN	NaN	14462.0244	NaN	NaN	NaN	15858.2559	12808.9258	NaN	NaN	NaN	NaN	NaN	14700.4092	NaN	13714.5352	NaN	14059.9062	12645.7393	NaN	NaN	13695.3857	NaN	12784.0381	NaN	NaN	NaN	15628.415	NaN	12996.4912	NaN	13344.6201	14072.501	NaN	NaN	NaN	14799.8467	NaN	NaN	14717.5664	NaN	NaN	14059.7812	NaN	NaN	NaN	NaN	NaN	NaN	NaN	NaN	14383.0586	NaN
4.1361	NaN	16846.7363	13780.4785	NaN	NaN	NaN	NaN	NaN	NaN	NaN	NaN	NaN	NaN	NaN	NaN	NaN	14856.0762	NaN	NaN	NaN	16081.2754	12097.1445	NaN	NaN	NaN	NaN	NaN	14303.0449	NaN	13438.9492	NaN	NaN	12218.0234	NaN	NaN	NaN	NaN	13106.0498	NaN	NaN	NaN	15619.6846	NaN	NaN	NaN	NaN	14092.0596	NaN	NaN	NaN	NaN	NaN	NaN	NaN	NaN	NaN	14398.458	NaN	NaN	NaN	NaN	NaN	NaN	NaN	NaN	NaN	NaN
4.2695	NaN	NaN	12984.0615	NaN	NaN	NaN	NaN	NaN	NaN	NaN	NaN	NaN	NaN	NaN	NaN	NaN	13423.3242	NaN	NaN	NaN	NaN	NaN	NaN	NaN	NaN	NaN	NaN	14526.8496	NaN	NaN	NaN	NaN	NaN	NaN	NaN	NaN	NaN	12191.1846	NaN	NaN	NaN	14536.0615	NaN	NaN	NaN	NaN	13700.6826	NaN	NaN	NaN	NaN	NaN	NaN	NaN	NaN	NaN	NaN	NaN	NaN	NaN	NaN	NaN	NaN	NaN	NaN	NaN	NaN
4.4029	NaN	NaN	13382.9229	NaN	NaN	NaN	NaN	NaN	NaN	NaN	NaN	NaN	NaN	NaN	NaN	NaN	13208.4717	NaN	NaN	NaN	NaN	NaN	NaN	NaN	NaN	NaN	NaN	NaN	NaN	NaN	NaN	NaN	NaN	NaN	NaN	NaN	NaN	13140.9746	NaN	NaN	NaN	NaN	NaN	NaN	NaN	NaN	NaN	NaN	NaN	NaN	NaN	NaN	NaN	NaN	NaN	NaN	NaN	NaN	NaN	NaN	NaN	NaN	NaN	NaN	NaN	NaN	NaN
4.5363	NaN	NaN	NaN	NaN	NaN	NaN	NaN	NaN	NaN	NaN	NaN	NaN	NaN	NaN	NaN	NaN	13079.7607	NaN	NaN	NaN	NaN	NaN	NaN	NaN	NaN	NaN	NaN	NaN	NaN	NaN	NaN	NaN	NaN	NaN	NaN	NaN	NaN	12728.4668	NaN	NaN	NaN	NaN	NaN	NaN	NaN	NaN	NaN	NaN	NaN	NaN	NaN	NaN	NaN	NaN	NaN	NaN	NaN	NaN	NaN	NaN	NaN	NaN	NaN	NaN	NaN	NaN	NaN
4.6698	NaN	NaN	NaN	NaN	NaN	NaN	NaN	NaN	NaN	NaN	NaN	NaN	NaN	NaN	NaN	NaN	14553.3467	NaN	NaN	NaN	NaN	NaN	NaN	NaN	NaN	NaN	NaN	NaN	NaN	NaN	NaN	NaN	NaN	NaN	NaN	NaN	NaN	NaN	NaN	NaN	NaN	NaN	NaN	NaN	NaN	NaN	NaN	NaN	NaN	NaN	NaN	NaN	NaN	NaN	NaN	NaN	NaN	NaN	NaN	NaN	NaN	NaN	NaN	NaN	NaN	NaN	NaN
4.8032	NaN	NaN	NaN	NaN	NaN	NaN	NaN	NaN	NaN	NaN	NaN	NaN	NaN	NaN	NaN	NaN	13844.4512	NaN	NaN	NaN	NaN	NaN	NaN	NaN	NaN	NaN	NaN	NaN	NaN	NaN	NaN	NaN	NaN	NaN	NaN	NaN	NaN	NaN	NaN	NaN	NaN	NaN	NaN	NaN	NaN	NaN	NaN	NaN	NaN	NaN	NaN	NaN	NaN	NaN	NaN	NaN	NaN	NaN	NaN	NaN	NaN	NaN	NaN	NaN	NaN	NaN	NaN
4.9366	NaN	NaN	NaN	NaN	NaN	NaN	NaN	NaN	NaN	NaN	NaN	NaN	NaN	NaN	NaN	NaN	12934.7109	NaN	NaN	NaN	NaN	NaN	NaN	NaN	NaN	NaN	NaN	NaN	NaN	NaN	NaN	NaN	NaN	NaN	NaN	NaN	NaN	NaN	NaN	NaN	NaN	NaN	NaN	NaN	NaN	NaN	NaN	NaN	NaN	NaN	NaN	NaN	NaN	NaN	NaN	NaN	NaN	NaN	NaN	NaN	NaN	NaN	NaN	NaN	NaN	NaN	NaN
5.07	NaN	NaN	NaN	NaN	NaN	NaN	NaN	NaN	NaN	NaN	NaN	NaN	NaN	NaN	NaN	NaN	NaN	NaN	NaN	NaN	NaN	NaN	NaN	NaN	NaN	NaN	NaN	NaN	NaN	NaN	NaN	NaN	NaN	NaN	NaN	NaN	NaN	NaN	NaN	NaN	NaN	NaN	NaN	NaN	NaN	NaN	NaN	NaN	NaN	NaN	NaN	NaN	NaN	NaN	NaN	NaN	NaN	NaN	NaN	NaN	NaN	NaN	NaN	NaN	NaN	NaN	NaN
5.2035	NaN	NaN	NaN	NaN	NaN	NaN	NaN	NaN	NaN	NaN	NaN	NaN	NaN	NaN	NaN	NaN	NaN	NaN	NaN	NaN	NaN	NaN	NaN	NaN	NaN	NaN	NaN	NaN	NaN	NaN	NaN	NaN	NaN	NaN	NaN	NaN	NaN	NaN	NaN	NaN	NaN	NaN	NaN	NaN	NaN	NaN	NaN	NaN	NaN	NaN	NaN	NaN	NaN	NaN	NaN	NaN	NaN	NaN	NaN	NaN	NaN	NaN	NaN	NaN	NaN	NaN	NaN
5.3369	NaN	NaN	NaN	NaN	NaN	NaN	NaN	NaN	NaN	NaN	NaN	NaN	NaN	NaN	NaN	NaN	NaN	NaN	NaN	NaN	NaN	NaN	NaN	NaN	NaN	NaN	NaN	NaN	NaN	NaN	NaN	NaN	NaN	NaN	NaN	NaN	NaN	NaN	NaN	NaN	NaN	NaN	NaN	NaN	NaN	NaN	NaN	NaN	NaN	NaN	NaN	NaN	NaN	NaN	NaN	NaN	NaN	NaN	NaN	NaN	NaN	NaN	NaN	NaN	NaN	NaN	NaN
5.4703	NaN	NaN	NaN	NaN	NaN	NaN	NaN	NaN	NaN	NaN	NaN	NaN	NaN	NaN	NaN	NaN	NaN	NaN	NaN	NaN	NaN	NaN	NaN	NaN	NaN	NaN	NaN	NaN	NaN	NaN	NaN	NaN	NaN	NaN	NaN	NaN	NaN	NaN	NaN	NaN	NaN	NaN	NaN	NaN	NaN	NaN	NaN	NaN	NaN	NaN	NaN	NaN	NaN	NaN	NaN	NaN	NaN	NaN	NaN	NaN	NaN	NaN	NaN	NaN	NaN	NaN	NaN
5.6037	NaN	NaN	NaN	NaN	NaN	NaN	NaN	NaN	NaN	NaN	NaN	NaN	NaN	NaN	NaN	NaN	NaN	NaN	NaN	NaN	NaN	NaN	NaN	NaN	NaN	NaN	NaN	NaN	NaN	NaN	NaN	NaN	NaN	NaN	NaN	NaN	NaN	NaN	NaN	NaN	NaN	NaN	NaN	NaN	NaN	NaN	NaN	NaN	NaN	NaN	NaN	NaN	NaN	NaN	NaN	NaN	NaN	NaN	NaN	NaN	NaN	NaN	NaN	NaN	NaN	NaN	NaN
5.7371	NaN	NaN	NaN	NaN	NaN	NaN	NaN	NaN	NaN	NaN	NaN	NaN	NaN	NaN	NaN	NaN	NaN	NaN	NaN	NaN	NaN	NaN	NaN	NaN	NaN	NaN	NaN	NaN	NaN	NaN	NaN	NaN	NaN	NaN	NaN	NaN	NaN	NaN	NaN	NaN	NaN	NaN	NaN	NaN	NaN	NaN	NaN	NaN	NaN	NaN	NaN	NaN	NaN	NaN	NaN	NaN	NaN	NaN	NaN	NaN	NaN	NaN	NaN	NaN	NaN	NaN	NaN
5.8706	NaN	NaN	NaN	NaN	NaN	NaN	NaN	NaN	NaN	NaN	NaN	NaN	NaN	NaN	NaN	NaN	NaN	NaN	NaN	NaN	NaN	NaN	NaN	NaN	NaN	NaN	NaN	NaN	NaN	NaN	NaN	NaN	NaN	NaN	NaN	NaN	NaN	NaN	NaN	NaN	NaN	NaN	NaN	NaN	NaN	NaN	NaN	NaN	NaN	NaN	NaN	NaN	NaN	NaN	NaN	NaN	NaN	NaN	NaN	NaN	NaN	NaN	NaN	NaN	NaN	NaN	NaN
6.004	NaN	NaN	NaN	NaN	NaN	NaN	NaN	NaN	NaN	NaN	NaN	NaN	NaN	NaN	NaN	NaN	NaN	NaN	NaN	NaN	NaN	NaN	NaN	NaN	NaN	NaN	NaN	NaN	NaN	NaN	NaN	NaN	NaN	NaN	NaN	NaN	NaN	NaN	NaN	NaN	NaN	NaN	NaN	NaN	NaN	NaN	NaN	NaN	NaN	NaN	NaN	NaN	NaN	NaN	NaN	NaN	NaN	NaN	NaN	NaN	NaN	NaN	NaN	NaN	NaN	NaN	NaN
6.1374	NaN	NaN	NaN	NaN	NaN	NaN	NaN	NaN	NaN	NaN	NaN	NaN	NaN	NaN	NaN	NaN	NaN	NaN	NaN	NaN	NaN	NaN	NaN	NaN	NaN	NaN	NaN	NaN	NaN	NaN	NaN	NaN	NaN	NaN	NaN	NaN	NaN	NaN	NaN	NaN	NaN	NaN	NaN	NaN	NaN	NaN	NaN	NaN	NaN	NaN	NaN	NaN	NaN	NaN	NaN	NaN	NaN	NaN	NaN	NaN	NaN	NaN	NaN	NaN	NaN	NaN	NaN
6.2708	NaN	NaN	NaN	NaN	NaN	NaN	NaN	NaN	NaN	NaN	NaN	NaN	NaN	NaN	NaN	NaN	NaN	NaN	NaN	NaN	NaN	NaN	NaN	NaN	NaN	NaN	NaN	NaN	NaN	NaN	NaN	NaN	NaN	NaN	NaN	NaN	NaN	NaN	NaN	NaN	NaN	NaN	NaN	NaN	NaN	NaN	NaN	NaN	NaN	NaN	NaN	NaN	NaN	NaN	NaN	NaN	NaN	NaN	NaN	NaN	NaN	NaN	NaN	NaN	NaN	NaN	NaN
6.4042	NaN	NaN	NaN	NaN	NaN	NaN	NaN	NaN	NaN	NaN	NaN	NaN	NaN	NaN	NaN	NaN	NaN	NaN	NaN	NaN	NaN	NaN	NaN	NaN	NaN	NaN	NaN	NaN	NaN	NaN	NaN	NaN	NaN	NaN	NaN	NaN	NaN	NaN	NaN	NaN	NaN	NaN	NaN	NaN	NaN	NaN	NaN	NaN	NaN	NaN	NaN	NaN	NaN	NaN	NaN	NaN	NaN	NaN	NaN	NaN	NaN	NaN	NaN	NaN	NaN	NaN	NaN
6.5377	NaN	NaN	NaN	NaN	NaN	NaN	NaN	NaN	NaN	NaN	NaN	NaN	NaN	NaN	NaN	NaN	NaN	NaN	NaN	NaN	NaN	NaN	NaN	NaN	NaN	NaN	NaN	NaN	NaN	NaN	NaN	NaN	NaN	NaN	NaN	NaN	NaN	NaN	NaN	NaN	NaN	NaN	NaN	NaN	NaN	NaN	NaN	NaN	NaN	NaN	NaN	NaN	NaN	NaN	NaN	NaN	NaN	NaN	NaN	NaN	NaN	NaN	NaN	NaN	NaN	NaN	NaN
6.6711	NaN	NaN	NaN	NaN	NaN	NaN	NaN	NaN	NaN	NaN	NaN	NaN	NaN	NaN	NaN	NaN	NaN	NaN	NaN	NaN	NaN	NaN	NaN	NaN	NaN	NaN	NaN	NaN	NaN	NaN	NaN	NaN	NaN	NaN	NaN	NaN	NaN	NaN	NaN	NaN	NaN	NaN	NaN	NaN	NaN	NaN	NaN	NaN	NaN	NaN	NaN	NaN	NaN	NaN	NaN	NaN	NaN	NaN	NaN	NaN	NaN	NaN	NaN	NaN	NaN	NaN	NaN
