x	Y_20180130_15100b_1_13g	Y_20180130_15100b_1_15g	Y_20180130_15100b_1_1g	Y_20180130_15100b_1_5g	Y_20180130_15100b_1_8g	Y_20180130_15100b_10_13g	Y_20180130_15100b_10_14g	Y_20180130_15100b_10_2g	Y_20180130_15100b_10_3g	Y_20180130_15100b_10_4g	Y_20180130_15100b_10_7g	Y_20180130_15100b_11_12g	Y_20180130_15100b_11_13g	Y_20180130_15100b_11_9g	Y_20180130_15100b_12_12g	Y_20180130_15100b_12_13g	Y_20180130_15100b_12_16g	Y_20180130_15100b_12_1g	Y_20180130_15100b_12_6g	Y_20180130_15100b_12_7g	Y_20180130_15100b_12_8g	Y_20180130_15100b_13_13g	Y_20180130_15100b_13_2g	Y_20180130_15100b_13_3g	Y_20180130_15100b_13_4g	Y_20180130_15100b_13_5g	Y_20180130_15100b_13_9g	Y_20180130_15100b_15_10g	Y_20180130_15100b_15_13g	Y_20180130_15100b_15_15_1g	Y_20180130_15100b_15_2g	Y_20180130_15100b_15_7g	Y_20180130_15100b_15_8g	Y_20180130_15100b_15_9g	Y_20180130_15100b_16_12g	Y_20180130_15100b_16_1g	Y_20180130_15100b_16_4g	Y_20180130_15100b_17_11g	Y_20180130_15100b_17_4g	Y_20180130_15100b_18_10g	Y_20180130_15100b_18_11g	Y_20180130_15100b_18_24g	Y_20180130_15100b_18_4g	Y_20180130_15100b_18_6g	Y_20180130_15100b_18_7_1g	Y_20180130_15100b_18_8g	Y_20180130_15100b_18_9g	Y_20180130_15100b_19_11g	Y_20180130_15100b_19_7g	Y_20180130_15100b_19_8g	Y_20180130_15100b_2_2g	Y_20180130_15100b_2_5g	Y_20180130_15100b_2_6g	Y_20180130_15100b_2_8g	Y_20180130_15100b_20_11_2g	Y_20180130_15100b_20_12g	Y_20180130_15100b_20_14g	Y_20180130_15100b_20_1g	Y_20180130_15100b_20_2g	Y_20180130_15100b_20_5_1g	Y_20180130_15100b_20_5_2g	Y_20180130_15100b_20_9g	Y_20180130_15100b_21_1g	Y_20180130_15100b_21_7g	Y_20180130_15100b_22_11g	Y_20180130_15100b_22_14g	Y_20180130_15100b_22_6g	Y_20180130_15100b_23_10g	Y_20180130_15100b_23_8g	Y_20180130_15100b_24_14_1g	Y_20180130_15100b_24_15g	Y_20180130_15100b_24_7g	Y_20180130_15100b_3_14g	Y_20180130_15100b_3_5g	Y_20180130_15100b_4_17g	Y_20180130_15100b_4_1g	Y_20180130_15100b_4_20g	Y_20180130_15100b_4_21g	Y_20180130_15100b_4_22g	Y_20180130_15100b_4_6g	Y_20180130_15100b_4_7g	Y_20180130_15100b_5_11g	Y_20180130_15100b_5_12g	Y_20180130_15100b_5_15g	Y_20180130_15100b_5_16g	Y_20180130_15100b_5_18g	Y_20180130_15100b_5_1g	Y_20180130_15100b_5_5g	Y_20180130_15100b_5_7g	Y_20180130_15100b_6_10g	Y_20180130_15100b_6_2g	Y_20180130_15100b_6_9g	Y_20180130_15100b_7_13g	Y_20180130_15100b_7_16g	Y_20180130_15100b_8_3g	Y_20180130_15100b_8_8g	Y_20180130_15100b_9_12g	Y_20180130_15100b_9_1g	Y_20180130_15100b_9_2g	Y_20180130_15100b_9_3g	Y_20180130_15100b_9_5g
0	34218.344	40100.66	35956.551	33597.699	36095.898	38139.988	36008.117	39345.25	33997.09	36157.004	33974.762	33155.207	34959.227	38261.637	34530.723	37127.305	36604.777	33602.434	36161.332	33079.938	33178.906	36978.402	33692.602	39329.617	36575.262	35939.711	34596.766	33331.836	32458.771	39284.895	34127.758	36639.129	38821.223	36898.098	39107.746	33621.367	33493.297	41723.543	36645.562	35404.637	34412.086	36459.848	36539.898	37926.703	37926.684	38459.988	34061.637	31727.521	32263.092	31876.1	36673.23	36898.926	36591.344	40546.273	34493.688	36836.371	35363.887	32269.031	39086.359	35601.199	36513.621	35944.066	34213.41	38285.484	34535.75	37005.801	39600.746	37765.676	35815.773	41553.586	39188.738	36423.941	38359.785	39118.309	37459.648	36859.973	38395.871	33773.941	32584.158	35518.75	38072.48	32516.566	36364.547	35178.531	37489.551	39074.133	35207.684	34872.488	39427.309	38337.332	34842.039	39384.582	34524.727	39829.48	38746.562	34938.809	39011.461	36906.676	37285.789	34070.5	35231.172
0.1334	34882.883	39426.629	36340.684	32241.037	36877.117	38820.898	36573.48	39084.668	32998.805	37004.211	33695.016	34089.09	34313.383	38860.484	32777.746	38162.461	35683.223	32359.984	36207.859	35083.898	33596.633	39215.375	34079.215	40734.836	36004.418	35097.426	33547.004	33206.176	33183.621	38567.801	32481.924	36896.637	38295.188	36451.461	39281.703	33027.336	32031.748	41854.766	36079.574	35493.258	36107.832	35474.496	37006.789	39036.258	38689.203	37296.887	34790.855	32502.24	31069.717	32337.252	36851.051	35466.918	38390.473	38704.043	34576.879	36135.859	37351.176	34844.266	37927.355	35483.262	36677.574	36335.457	34564.219	38454.613	33736.523	36739.922	38617.23	38657.27	35682.812	41226.973	37540.531	35362.699	37272.758	37434.148	37617.617	35588.746	37896.566	32550.363	32745.771	35917.383	38231.203	32164.094	37041.098	33730.324	38533.375	39795.059	34796.867	35755.062	37042.395	37031.617	35686.5	38199.438	34459.738	39482.52	37242.074	36119.352	39482.66	36801.082	39073.062	33448.91	33223.645
0.2668	33001.766	39526.398	36833.32	33275.547	35882.648	35751.809	36602.789	40699.141	32303.762	35389.82	34084.762	34749.344	35285.148	38972.871	32488.34	36966.66	35285.488	33839.941	38072.633	34875.254	35084.875	36879.992	33777.586	41365.41	36289.398	35880.863	34827.984	33886.613	32217.986	39055.148	32589.227	37039.898	37066.855	37149.602	40782.695	32145.824	31670.877	40380.344	33707.766	35436.234	35038.25	36637.262	34572.051	40989.832	39653.773	36571.574	34775.172	33277.363	30974.604	32744.947	37438.363	35454.441	37230.348	38238.453	35235.848	34566.965	38281.734	34172.098	37424.129	36108.152	36230.867	36997.555	34436.238	38746.605	34158.801	38202.289	39994.551	40410.57	36735.273	39560.801	37285.898	33925.371	37903.23	37779.707	36515.164	37423.203	37262.18	32521.688	32547.82	37178.355	38324.531	32189.691	36810.645	35247.43	39486.551	38499.684	35311.645	37633.215	37856.801	36282.812	36340.355	37408.68	37154.754	39314.246	36955.23	36319.57	41272.285	35975.895	38028.973	33551.273	33469.414
0.4003	34648.121	38800.703	37173.965	34698.152	37236.375	37167.707	36108.016	39480.055	31362.688	36692.457	34524.516	35755.16	35689.043	37861.109	32722.84	38067.5	35413.836	31944.885	37711	33759.98	34419.824	37834.914	34337.609	43158.453	36259.547	37676.891	34695	32152.117	31788.814	39028.668	33413.199	37542.766	36834.324	37671.852	39946.391	31397.168	33292.395	39751.969	34049.68	35812.598	34952.945	35631.449	34669.852	40412.879	37667.191	36885.938	33500.48	31541.773	30777.936	33556.051	36168.906	35106.234	35901.926	38430.168	34033.227	34814.492	37930.695	33344.922	36985.812	35414.816	36080.848	36733.461	35725.566	38195.852	34846.727	36286.809	40009.961	41160.227	34804.863	39257.168	36962.512	36243.332	37878.938	36872.133	35485.477	37496.371	38140.262	32811.859	31711.09	36165.926	38011.926	31979.018	35692.852	33916.98	39027.191	40233.227	34099.625	38667.02	40214.5	38277.266	34959.82	39432.816	35831.086	37711.34	35539.734	35669.914	40201.934	35467.066	36985.613	34447.562	33197.027
0.5337	35058.512	39032.402	36507.785	32540.691	38123.5	35121.062	36571.887	40188.516	31388.111	36548.094	33280.727	36128.215	34519.523	36917.586	31981.344	37791.227	35847.41	31678.502	37479.797	33049.523	35365.676	36176.359	36195.766	40501.238	35002.316	35152.484	34417.324	33162.02	33517.59	37817.777	33273.59	36100.246	39129.059	35754.527	40382.355	31248.932	33388.93	40168.945	33990.203	37793.223	35153.07	35365.508	35046.18	39671.109	37381.586	37962.27	34510.477	31581.137	31264.139	31745.172	34601.172	34966.066	34852.316	36887.242	34546.773	34897.539	38299.914	34114.684	37192.473	38199.945	36492.703	36171.051	35533.59	37675.414	34833.785	36572.102	38126.844	40738.723	34281.109	37782.238	36994.305	34827.68	37860.367	35886.426	36966.289	37340.48	38383.281	33293.621	32236.197	35378.043	37506.691	32607.275	37331.344	34981.441	38025.387	40138.438	35231.57	38125.09	39162.297	36017.172	36335.453	39080.633	36880.453	36934.137	35823.566	35031.816	40321.957	36260.531	35716.582	35078.246	34788.152
0.6671	34260.418	39407.809	37088.262	31938.055	35920.664	35654.926	38065.309	39130.77	32805.059	37286.605	34018.539	34427.121	34796.734	37877.145	32699.566	37294.18	34461.785	33242.84	36772.473	33282.516	33779.445	37048.109	35297.004	40806.285	34824.496	35536.504	35384.66	33693.969	33317.938	39059.906	31929.824	36447.102	37422.203	35121.512	40471.633	32625.027	33039.121	39194.047	34577.789	35947.305	34042.703	35752.695	36908.977	38276.875	38083.934	37942.699	33398.242	31825.389	31096.453	33663.324	35585.977	35927.434	35516.035	36825.402	33588.719	33440.043	38705.988	33925.145	36247.41	36623.035	35944.836	37263.332	34597.195	37332.953	36005.262	36706.406	38298.699	39216.641	35395.336	38325.527	36055.496	33808.207	40251.75	36054.051	35970.953	38584.914	35832.633	33720.395	30851.811	35858.863	37526.254	31975.83	39277.562	34414.492	37605.156	39917.219	34450.18	37467.957	38754.676	35726.895	36479.758	38633.855	33655.805	35996.477	36204.465	35011.531	39591.605	35589.715	36014.758	37284.367	35763.387
0.8005	33605.301	39376.32	38437.273	34397.91	37619.805	36848.906	38450.938	37748.582	33032.492	38431.133	33257.008	33423.277	35438.398	37977.152	33524.492	38383.789	34799.277	32909.566	36729.621	32911.293	34428.488	35998.504	34443.141	39630.555	34851.199	34407.684	35880.137	34203.375	34048.566	39171.629	31805.617	35318.582	37275.949	35589.402	39586.266	31911.52	32878.504	38996.355	36253.133	36234.363	33685.117	34461.027	37018.441	40025.922	38592.715	37493.984	35100.246	32384.418	30915.289	31414.1	36191.824	36810.395	35706.699	39425.934	35052.371	35154.184	37700.145	35532.734	37252.035	37217.375	37623.844	37236.574	35129.816	40847.062	35809.949	35596.891	38270.102	40636.934	35906.504	39503.402	37561.914	35491.703	39954.688	37212.883	37478.184	39206.918	37835.125	33644.777	30661.646	36504.391	37420.766	34206.004	42802.008	34989.246	39456.098	39762.812	35518.633	36806.777	40124.691	36375.051	36774.977	38762.348	34175.758	36405.215	36351.262	33932.102	40047.289	35118.984	35146.32	38476.188	38744.645
0.934	33907.297	41159.875	37618.438	34380.586	37368.906	36419.066	37519.699	38033.902	34475.871	39238.883	33457.207	35350.262	35317.164	38062.102	32894.617	38486.688	35528.297	33369.828	36646.832	33801.02	33908.789	38572.809	36689.383	40099.863	35426.543	34991.734	36636.777	34879.812	36220.707	37499.617	31278.625	36260.367	37959.758	37838.891	39609.441	32960.645	33615.629	38875.293	35710.59	37063.309	33483.281	34748.035	37768.25	39923.582	38825.914	37481.094	34768.266	33884.219	32667.656	32169.266	38960.777	36766.523	34525.34	39414.984	35737.77	37000.887	35854.711	38233.66	37544.809	37197.809	37047.215	37360.734	35746.766	41083.715	34481.398	37376.223	39170.801	40733.605	35488.414	41998.336	38914.965	39598.301	41500.898	36539.867	38542.352	39454.891	38744.469	32183.074	32854.023	36794.934	36535.355	36714.727	47217.637	34941.141	40971.082	41569.055	36718.473	36797.512	40411.145	38975.188	39478.621	38564.961	33235.594	37512.875	36013.613	35228.008	40478.633	36107.441	37253.195	41941.555	38526.832
1.0674	33044.18	44346.199	36194.625	35252.266	35852.895	36298.445	38291.508	36449.785	35369.176	43300.086	34152.504	36307.246	38055.844	42219.121	31687.713	38923.562	36716.781	32379.346	38912.488	32738.98	34779.125	37846.152	35233.484	40530.621	36411.324	37328.176	38544.93	38383.996	40110.77	39105.887	31647.234	38072.105	39411.43	39305.562	39856.332	32885.422	34705.312	39122.004	37446.535	36336.254	34257.473	36012.684	40681.309	40170.586	36782.168	37135.461	34501.262	37647.832	32153.305	34866.277	39859.711	36513.02	35058.863	38908.711	38444.562	37694.812	37862.977	41878.062	37354.012	38783.336	37791.242	38181.535	35248.961	42687.062	34226.973	36427.703	40291.371	46896.93	34993.059	46521.66	38566.09	44732.203	46332.828	36242.059	38434.172	39869.508	38427.156	35230.141	32749.27	37304.355	35985.797	43763.828	62473.406	36042.793	45904.637	43262.324	38174.578	39204.703	42594.109	44634.66	39776.195	38372.867	31950.152	39348.691	37369	37308.598	45273.562	36515.305	40912.812	49624.352	43317.84
1.2008	33120.039	52946.113	39742.805	38326.762	37333.488	38255.906	40265.805	37960.996	41031.785	48341.078	35088.996	38502.109	39009.152	47240.559	31182.752	42024.781	43597.449	32852.039	41773.648	34842.723	37232.242	41417.367	36641.266	42115.301	35896.203	37630.266	43318.906	44499.684	52146.352	40211.262	32923.309	40560.172	41213.852	42808.617	41320.906	35000.645	36511.914	41632.27	37313.797	36469.617	35815.441	34831.262	48889.727	40206.926	36451.859	37084.719	33903.93	47232.219	32121.033	34566.352	41806.219	36393.988	37644.402	38262.23	43481.191	37145.266	41074.156	55035.035	44195.75	41086.152	37615.215	38775.316	36697.391	50507.105	36640.578	38716.598	40372.277	53528.535	36443.492	54216.727	39923.273	50974.781	65544.047	37606.125	40993.379	43973.902	41251.07	39263.484	33110.555	36685.91	37890.133	51433.43	97419.25	37705.676	58050.328	49337.895	45346.727	44191.383	46390.438	61761.754	40892.816	38392.129	34402.871	40178.195	37299.98	44698.992	51678.465	39263.836	46710.227	69614.453	60033.973
1.3342	34833.777	65796.016	41872.945	57587.789	40784.047	37647.023	44644.238	38572.277	50122.246	62194.992	35458.953	42741.539	45164.531	67730.148	34707.918	51344.883	59976.086	36801.082	48018.801	41111.777	35331.727	49141.727	40021.324	45936.027	37841.082	44950.25	53113.391	58572.531	79032.375	44473.918	35689.082	42159.52	47084.059	57085.824	41360.672	39107.117	40367.277	47592.223	43082.527	38536.465	35688.398	37051.316	67295.688	41533.895	37860.711	39172.219	36193.52	61948.02	33578.648	36944.008	52331.828	36863.527	40283.188	38347.934	56086.844	43204.938	46733.734	79386.586	58611.918	43439.691	40038.555	42778.82	36768.723	65914.727	40550.766	42909.773	45984.926	80154.859	36541.961	74051.227	42704.598	67952.453	91539.375	37580.242	44019.926	55450.473	46029.461	52886.711	34186	38745.391	37752.906	55198.152	145503.406	39551.832	82649.625	64275.484	52511.203	56029.297	58708.801	73330.148	46507.945	41552.09	35304.547	42536.332	38341.906	62209.711	68749.297	44245.535	66224.922	105641.969	88082.312
1.4676	41622.066	111191.531	46493.547	87432.875	49247.723	44088.789	59239.754	40666.383	75008.414	90755.289	40177.746	54274.613	58512.02	105926.047	40921.312	70399.422	100076.656	39454.285	61870.535	54863.762	40923.062	57090.922	46635.18	64344.582	38679.453	64985.562	82315.789	89521.133	125044.094	47545.391	43383.805	51343.152	64708.41	86595.945	43532.543	47841.887	48566.289	60309.23	59381.934	43174.902	39087.172	38922.578	94623.141	45904.152	40533.207	42831.496	36750.562	72066.141	37950.5	44663.75	77036.328	38353.953	50149.523	44593.844	68370.211	53679.676	53095.816	90786.758	81905.25	52550.375	46051.875	52408.34	38568.867	100991.789	46240.812	54781.02	54950.324	124729.234	39278.82	125814.391	52780.379	100050.539	92354.664	39860.07	53789.695	73948.133	59294.848	78459.812	37146.336	44693.234	39657.434	67936.875	146081.797	43297.727	118604.594	89934.641	75436.336	87698.766	85622.992	62525.934	62281.578	52545.188	36013.73	50614.34	41964.32	70315.398	107700.375	56189.875	95476.562	112858.438	100612.242
1.6011	52534.062	168240.875	59415.832	127249.148	71588.258	54446.262	86122.984	46633.547	88817.773	126718.969	54611.352	88333.812	82528.055	119755.383	55603.082	108077.742	144739.656	49836.512	93526.664	81009.414	49561.773	86663.141	61740.934	95835.578	41372.121	96753.305	120757.344	138361.734	136682.766	61158.566	60866.324	68062.367	94925.875	116709.844	49777.449	69644.109	62445.172	86323.258	89615.75	53034.184	43321.281	41996.508	107830.695	56583.758	48695.648	54576.059	40702.004	57143.234	50976.434	67087.75	120907.641	48521.715	68785.031	55738.266	59400.59	59508.453	74639.273	73200.438	96251.25	76248.875	56531.074	74356.547	40262.199	127536.68	58808.762	78852.883	78576.039	144887.406	43525.652	161234.625	76184.234	141057.297	68159.266	45832.285	74603.109	90946.211	82901.227	95323.586	48258.258	52319.496	46544.043	88205.867	94871.25	54057.898	121799.93	91907.539	109153.453	113948.531	111554.812	48619.867	99167.625	75172.195	40238.199	64218.562	48330.574	61722.762	162261.688	82739.094	104621.336	84207.023	77537.18
1.7345	66368.547	184085.781	82587.188	104401.742	110396.75	66894.562	134795.094	57530.766	79020.82	118482.938	80487.023	143071.125	88287.977	94553.234	60099.18	128499.328	128637.703	62893.363	126484.172	99990.477	65938.836	132703.875	99070.008	119375.812	51112.637	108277.211	131640.25	156123.109	101695.969	97357.359	97020.695	103794.625	110398	95014.969	63496.113	80883.711	69825.328	107045.703	107583.539	63793.418	53918.539	53549.094	82172.336	75647.008	61239.027	69189.82	48252.605	43430.699	69011.117	78344.281	123715.719	70421.695	106563.242	79560.609	46467.871	52549.629	120804.953	49596.254	86616.539	114087.609	67316.391	82597.023	52384.859	112356.914	67121.867	80482.195	117906.789	103551.039	55618.77	129946.82	129186.711	137481.594	50718.25	58073.871	110214.734	74019.328	90460.484	76876.523	75517.641	68721.344	56497.93	77228.102	59338.516	80588.609	88722.82	67311.289	110435.414	101111.148	102850.133	40124.648	114626.984	93956.484	54881.07	97950.008	60397.699	46440.492	165848.281	113057.312	86909.711	54555.645	54331.355
1.8679	71415.336	123182.758	100365.32	61866.672	126553.867	66372.188	147667.672	75635.578	57323.574	77420.391	104694.344	140109.719	64214.676	58244.422	53639.422	101399.555	84121.305	74192.016	109649.531	81355.609	88894.094	146221.031	118257.258	95613.992	74059.109	80776.172	91937.078	125410.305	62486.301	145599.734	115498.938	133606.484	87736.375	60333.273	86316.844	63420.871	57186.617	90976.102	84346.484	60252.047	69227.859	67951.594	53908.867	103299.25	62963.102	68048.961	68497	NaN	62593.879	59633.359	90827.039	112454.766	132628.766	113421.32	38595.594	42923.023	143513.219	41084.898	65841.359	125108.93	59242.312	64751.852	70249.656	72827.648	60101.141	60853.559	130025.727	63184.754	67785.492	74960.609	172109.578	87414.398	42938.73	76759.578	119537.297	53793.797	65850.422	52251.594	106363.109	77963.938	82911.484	56297.805	45348.469	93520.711	59451.309	50365.023	78904.172	69129.047	70036.906	36986.781	89345.898	82757.953	88138.492	124230.883	79270.172	40241.168	112460.125	111367.094	65109.746	NaN	42725.289
2.0013	54819.699	75610.367	82316.906	43871.539	84268.219	48775.004	104210.242	73821.953	44775.223	52487.535	91512.945	91864.352	49097.656	NaN	41873.949	65716.078	53739.984	63250.477	72219.062	55610.32	85081.812	101645.719	93569.492	63571.672	78633.922	53500.34	59634.512	77791.961	NaN	128349.117	90093.273	108019.188	59828.438	44911.973	93939.289	47946.309	44737.832	63073.57	57970.746	47314.438	65471.438	64210.34	46937.102	105228.234	50670.125	55414.988	82460.32	NaN	49392.559	45354.309	60587.098	144327.656	103286.969	114941.625	NaN	NaN	105654.906	37282.137	52387.965	89126.031	47899.312	50635.777	76464.234	53812.68	47179.195	47661.199	97133.391	47406.926	66712.289	49622.48	149478.641	53221.008	NaN	75563.773	86661.961	42280.363	46918.793	43066.781	101144.766	62553.48	103084.016	42765.66	NaN	77479.898	49600.461	NaN	55542.266	49732.992	50315.145	NaN	58376.766	59495.805	116225.742	103584.07	76620.547	NaN	71704.227	72481.641	52101.465	NaN	NaN
2.1348	42891.391	56144.461	58568.082	NaN	52009.871	41173.07	65147.688	56480.25	39629.195	45090.578	61716.234	57401.949	41587.703	NaN	38022.652	48841.215	NaN	52528.75	52971.234	43090.473	56775.664	63645.324	55965.574	49004.57	60628.754	NaN	47480.562	52490.273	NaN	79434.43	60753.324	71073.914	46940.75	NaN	70225.883	39083.676	37445.355	48433.785	NaN	NaN	51749.762	49970.07	41257.711	82815.938	40775.652	46550.824	69450.406	NaN	41563.539	39100.605	49005.199	119953.43	65747.195	82829.453	NaN	NaN	65618.281	NaN	NaN	56081.918	NaN	42299.828	61512.277	45682.777	39843.477	44393.137	63489.043	42252.293	51362.961	41881.766	115110.922	40698.203	NaN	57681.547	62916.125	NaN	40414.961	38251.758	69273.328	48091.973	85052.867	NaN	NaN	61504.613	44898.051	NaN	44878.988	NaN	42534.676	NaN	NaN	47299.129	100158.234	68364.477	58455.848	NaN	52121.293	51143.211	NaN	NaN	NaN
2.2682	38260.512	NaN	44378.539	NaN	41687.844	NaN	48075.461	NaN	NaN	NaN	43956.121	45066.605	NaN	NaN	33753.094	NaN	NaN	NaN	44511.203	37069.676	45342.758	48634.93	NaN	NaN	47589.801	NaN	NaN	41934.129	NaN	57353.914	44521.906	51667.219	NaN	NaN	51148.02	NaN	35026.027	44388.855	NaN	NaN	42841.516	41301.883	NaN	62648.129	37079.105	40570.746	52712.637	NaN	34535.141	NaN	NaN	77690.219	46958.254	57535.742	NaN	NaN	48884.238	NaN	NaN	43755.375	NaN	NaN	44872.738	NaN	NaN	42776.578	47563.129	NaN	42450.457	39469.984	NaN	40766.152	NaN	46883.203	NaN	NaN	NaN	NaN	48872.617	43070.527	60534.598	NaN	NaN	49933.355	NaN	NaN	41184.27	NaN	NaN	NaN	NaN	42146.652	64418.828	49840.406	46310.281	NaN	NaN	43291.398	NaN	NaN	NaN
2.4016	36980.758	NaN	NaN	NaN	39471.043	NaN	NaN	NaN	NaN	NaN	38479.133	40026.32	NaN	NaN	NaN	NaN	NaN	NaN	NaN	NaN	41553.453	43588.836	NaN	NaN	NaN	NaN	NaN	NaN	NaN	49899.719	NaN	NaN	NaN	NaN	44735.547	NaN	NaN	NaN	NaN	NaN	NaN	NaN	NaN	50863.57	NaN	39050.605	44364.844	NaN	33884.172	NaN	NaN	NaN	39465.211	48347.883	NaN	NaN	41876.359	NaN	NaN	NaN	NaN	NaN	40645.129	NaN	NaN	38795.059	43025.117	NaN	39456.457	NaN	NaN	NaN	NaN	42528.473	NaN	NaN	NaN	NaN	40911.379	40053.871	48853.992	NaN	NaN	NaN	NaN	NaN	NaN	NaN	NaN	NaN	NaN	NaN	46395.125	NaN	NaN	NaN	NaN	39593.582	NaN	NaN	NaN
2.535	NaN	NaN	NaN	NaN	NaN	NaN	NaN	NaN	NaN	NaN	NaN	NaN	NaN	NaN	NaN	NaN	NaN	NaN	NaN	NaN	NaN	NaN	NaN	NaN	NaN	NaN	NaN	NaN	NaN	NaN	NaN	NaN	NaN	NaN	NaN	NaN	NaN	NaN	NaN	NaN	NaN	NaN	NaN	44804.285	NaN	NaN	NaN	NaN	NaN	NaN	NaN	NaN	38414.125	44705.777	NaN	NaN	NaN	NaN	NaN	NaN	NaN	NaN	36061.336	NaN	NaN	NaN	39862.035	NaN	NaN	NaN	NaN	NaN	NaN	NaN	NaN	NaN	NaN	NaN	NaN	NaN	NaN	NaN	NaN	NaN	NaN	NaN	NaN	NaN	NaN	NaN	NaN	NaN	38262.043	NaN	NaN	NaN	NaN	NaN	NaN	NaN	NaN
2.6684	NaN	NaN	NaN	NaN	NaN	NaN	NaN	NaN	NaN	NaN	NaN	NaN	NaN	NaN	NaN	NaN	NaN	NaN	NaN	NaN	NaN	NaN	NaN	NaN	NaN	NaN	NaN	NaN	NaN	NaN	NaN	NaN	NaN	NaN	NaN	NaN	NaN	NaN	NaN	NaN	NaN	NaN	NaN	NaN	NaN	NaN	NaN	NaN	NaN	NaN	NaN	NaN	38129.348	NaN	NaN	NaN	NaN	NaN	NaN	NaN	NaN	NaN	35328.699	NaN	NaN	NaN	NaN	NaN	NaN	NaN	NaN	NaN	NaN	NaN	NaN	NaN	NaN	NaN	NaN	NaN	NaN	NaN	NaN	NaN	NaN	NaN	NaN	NaN	NaN	NaN	NaN	NaN	NaN	NaN	NaN	NaN	NaN	NaN	NaN	NaN	NaN
2.8019	NaN	NaN	NaN	NaN	NaN	NaN	NaN	NaN	NaN	NaN	NaN	NaN	NaN	NaN	NaN	NaN	NaN	NaN	NaN	NaN	NaN	NaN	NaN	NaN	NaN	NaN	NaN	NaN	NaN	NaN	NaN	NaN	NaN	NaN	NaN	NaN	NaN	NaN	NaN	NaN	NaN	NaN	NaN	NaN	NaN	NaN	NaN	NaN	NaN	NaN	NaN	NaN	NaN	NaN	NaN	NaN	NaN	NaN	NaN	NaN	NaN	NaN	NaN	NaN	NaN	NaN	NaN	NaN	NaN	NaN	NaN	NaN	NaN	NaN	NaN	NaN	NaN	NaN	NaN	NaN	NaN	NaN	NaN	NaN	NaN	NaN	NaN	NaN	NaN	NaN	NaN	NaN	NaN	NaN	NaN	NaN	NaN	NaN	NaN	NaN	NaN
2.9353	NaN	NaN	NaN	NaN	NaN	NaN	NaN	NaN	NaN	NaN	NaN	NaN	NaN	NaN	NaN	NaN	NaN	NaN	NaN	NaN	NaN	NaN	NaN	NaN	NaN	NaN	NaN	NaN	NaN	NaN	NaN	NaN	NaN	NaN	NaN	NaN	NaN	NaN	NaN	NaN	NaN	NaN	NaN	NaN	NaN	NaN	NaN	NaN	NaN	NaN	NaN	NaN	NaN	NaN	NaN	NaN	NaN	NaN	NaN	NaN	NaN	NaN	NaN	NaN	NaN	NaN	NaN	NaN	NaN	NaN	NaN	NaN	NaN	NaN	NaN	NaN	NaN	NaN	NaN	NaN	NaN	NaN	NaN	NaN	NaN	NaN	NaN	NaN	NaN	NaN	NaN	NaN	NaN	NaN	NaN	NaN	NaN	NaN	NaN	NaN	NaN
3.0687	NaN	NaN	NaN	NaN	NaN	NaN	NaN	NaN	NaN	NaN	NaN	NaN	NaN	NaN	NaN	NaN	NaN	NaN	NaN	NaN	NaN	NaN	NaN	NaN	NaN	NaN	NaN	NaN	NaN	NaN	NaN	NaN	NaN	NaN	NaN	NaN	NaN	NaN	NaN	NaN	NaN	NaN	NaN	NaN	NaN	NaN	NaN	NaN	NaN	NaN	NaN	NaN	NaN	NaN	NaN	NaN	NaN	NaN	NaN	NaN	NaN	NaN	NaN	NaN	NaN	NaN	NaN	NaN	NaN	NaN	NaN	NaN	NaN	NaN	NaN	NaN	NaN	NaN	NaN	NaN	NaN	NaN	NaN	NaN	NaN	NaN	NaN	NaN	NaN	NaN	NaN	NaN	NaN	NaN	NaN	NaN	NaN	NaN	NaN	NaN	NaN
3.2021	NaN	NaN	NaN	NaN	NaN	NaN	NaN	NaN	NaN	NaN	NaN	NaN	NaN	NaN	NaN	NaN	NaN	NaN	NaN	NaN	NaN	NaN	NaN	NaN	NaN	NaN	NaN	NaN	NaN	NaN	NaN	NaN	NaN	NaN	NaN	NaN	NaN	NaN	NaN	NaN	NaN	NaN	NaN	NaN	NaN	NaN	NaN	NaN	NaN	NaN	NaN	NaN	NaN	NaN	NaN	NaN	NaN	NaN	NaN	NaN	NaN	NaN	NaN	NaN	NaN	NaN	NaN	NaN	NaN	NaN	NaN	NaN	NaN	NaN	NaN	NaN	NaN	NaN	NaN	NaN	NaN	NaN	NaN	NaN	NaN	NaN	NaN	NaN	NaN	NaN	NaN	NaN	NaN	NaN	NaN	NaN	NaN	NaN	NaN	NaN	NaN
3.3356	NaN	NaN	NaN	NaN	NaN	NaN	NaN	NaN	NaN	NaN	NaN	NaN	NaN	NaN	NaN	NaN	NaN	NaN	NaN	NaN	NaN	NaN	NaN	NaN	NaN	NaN	NaN	NaN	NaN	NaN	NaN	NaN	NaN	NaN	NaN	NaN	NaN	NaN	NaN	NaN	NaN	NaN	NaN	NaN	NaN	NaN	NaN	NaN	NaN	NaN	NaN	NaN	NaN	NaN	NaN	NaN	NaN	NaN	NaN	NaN	NaN	NaN	NaN	NaN	NaN	NaN	NaN	NaN	NaN	NaN	NaN	NaN	NaN	NaN	NaN	NaN	NaN	NaN	NaN	NaN	NaN	NaN	NaN	NaN	NaN	NaN	NaN	NaN	NaN	NaN	NaN	NaN	NaN	NaN	NaN	NaN	NaN	NaN	NaN	NaN	NaN
3.469	NaN	NaN	NaN	NaN	NaN	NaN	NaN	NaN	NaN	NaN	NaN	NaN	NaN	NaN	NaN	NaN	NaN	NaN	NaN	NaN	NaN	NaN	NaN	NaN	NaN	NaN	NaN	NaN	NaN	NaN	NaN	NaN	NaN	NaN	NaN	NaN	NaN	NaN	NaN	NaN	NaN	NaN	NaN	NaN	NaN	NaN	NaN	NaN	NaN	NaN	NaN	NaN	NaN	NaN	NaN	NaN	NaN	NaN	NaN	NaN	NaN	NaN	NaN	NaN	NaN	NaN	NaN	NaN	NaN	NaN	NaN	NaN	NaN	NaN	NaN	NaN	NaN	NaN	NaN	NaN	NaN	NaN	NaN	NaN	NaN	NaN	NaN	NaN	NaN	NaN	NaN	NaN	NaN	NaN	NaN	NaN	NaN	NaN	NaN	NaN	NaN
3.6024	NaN	NaN	NaN	NaN	NaN	NaN	NaN	NaN	NaN	NaN	NaN	NaN	NaN	NaN	NaN	NaN	NaN	NaN	NaN	NaN	NaN	NaN	NaN	NaN	NaN	NaN	NaN	NaN	NaN	NaN	NaN	NaN	NaN	NaN	NaN	NaN	NaN	NaN	NaN	NaN	NaN	NaN	NaN	NaN	NaN	NaN	NaN	NaN	NaN	NaN	NaN	NaN	NaN	NaN	NaN	NaN	NaN	NaN	NaN	NaN	NaN	NaN	NaN	NaN	NaN	NaN	NaN	NaN	NaN	NaN	NaN	NaN	NaN	NaN	NaN	NaN	NaN	NaN	NaN	NaN	NaN	NaN	NaN	NaN	NaN	NaN	NaN	NaN	NaN	NaN	NaN	NaN	NaN	NaN	NaN	NaN	NaN	NaN	NaN	NaN	NaN
3.7358	NaN	NaN	NaN	NaN	NaN	NaN	NaN	NaN	NaN	NaN	NaN	NaN	NaN	NaN	NaN	NaN	NaN	NaN	NaN	NaN	NaN	NaN	NaN	NaN	NaN	NaN	NaN	NaN	NaN	NaN	NaN	NaN	NaN	NaN	NaN	NaN	NaN	NaN	NaN	NaN	NaN	NaN	NaN	NaN	NaN	NaN	NaN	NaN	NaN	NaN	NaN	NaN	NaN	NaN	NaN	NaN	NaN	NaN	NaN	NaN	NaN	NaN	NaN	NaN	NaN	NaN	NaN	NaN	NaN	NaN	NaN	NaN	NaN	NaN	NaN	NaN	NaN	NaN	NaN	NaN	NaN	NaN	NaN	NaN	NaN	NaN	NaN	NaN	NaN	NaN	NaN	NaN	NaN	NaN	NaN	NaN	NaN	NaN	NaN	NaN	NaN
3.8692	NaN	NaN	NaN	NaN	NaN	NaN	NaN	NaN	NaN	NaN	NaN	NaN	NaN	NaN	NaN	NaN	NaN	NaN	NaN	NaN	NaN	NaN	NaN	NaN	NaN	NaN	NaN	NaN	NaN	NaN	NaN	NaN	NaN	NaN	NaN	NaN	NaN	NaN	NaN	NaN	NaN	NaN	NaN	NaN	NaN	NaN	NaN	NaN	NaN	NaN	NaN	NaN	NaN	NaN	NaN	NaN	NaN	NaN	NaN	NaN	NaN	NaN	NaN	NaN	NaN	NaN	NaN	NaN	NaN	NaN	NaN	NaN	NaN	NaN	NaN	NaN	NaN	NaN	NaN	NaN	NaN	NaN	NaN	NaN	NaN	NaN	NaN	NaN	NaN	NaN	NaN	NaN	NaN	NaN	NaN	NaN	NaN	NaN	NaN	NaN	NaN
4.0027	NaN	NaN	NaN	NaN	NaN	NaN	NaN	NaN	NaN	NaN	NaN	NaN	NaN	NaN	NaN	NaN	NaN	NaN	NaN	NaN	NaN	NaN	NaN	NaN	NaN	NaN	NaN	NaN	NaN	NaN	NaN	NaN	NaN	NaN	NaN	NaN	NaN	NaN	NaN	NaN	NaN	NaN	NaN	NaN	NaN	NaN	NaN	NaN	NaN	NaN	NaN	NaN	NaN	NaN	NaN	NaN	NaN	NaN	NaN	NaN	NaN	NaN	NaN	NaN	NaN	NaN	NaN	NaN	NaN	NaN	NaN	NaN	NaN	NaN	NaN	NaN	NaN	NaN	NaN	NaN	NaN	NaN	NaN	NaN	NaN	NaN	NaN	NaN	NaN	NaN	NaN	NaN	NaN	NaN	NaN	NaN	NaN	NaN	NaN	NaN	NaN
4.1361	NaN	NaN	NaN	NaN	NaN	NaN	NaN	NaN	NaN	NaN	NaN	NaN	NaN	NaN	NaN	NaN	NaN	NaN	NaN	NaN	NaN	NaN	NaN	NaN	NaN	NaN	NaN	NaN	NaN	NaN	NaN	NaN	NaN	NaN	NaN	NaN	NaN	NaN	NaN	NaN	NaN	NaN	NaN	NaN	NaN	NaN	NaN	NaN	NaN	NaN	NaN	NaN	NaN	NaN	NaN	NaN	NaN	NaN	NaN	NaN	NaN	NaN	NaN	NaN	NaN	NaN	NaN	NaN	NaN	NaN	NaN	NaN	NaN	NaN	NaN	NaN	NaN	NaN	NaN	NaN	NaN	NaN	NaN	NaN	NaN	NaN	NaN	NaN	NaN	NaN	NaN	NaN	NaN	NaN	NaN	NaN	NaN	NaN	NaN	NaN	NaN
4.2695	NaN	NaN	NaN	NaN	NaN	NaN	NaN	NaN	NaN	NaN	NaN	NaN	NaN	NaN	NaN	NaN	NaN	NaN	NaN	NaN	NaN	NaN	NaN	NaN	NaN	NaN	NaN	NaN	NaN	NaN	NaN	NaN	NaN	NaN	NaN	NaN	NaN	NaN	NaN	NaN	NaN	NaN	NaN	NaN	NaN	NaN	NaN	NaN	NaN	NaN	NaN	NaN	NaN	NaN	NaN	NaN	NaN	NaN	NaN	NaN	NaN	NaN	NaN	NaN	NaN	NaN	NaN	NaN	NaN	NaN	NaN	NaN	NaN	NaN	NaN	NaN	NaN	NaN	NaN	NaN	NaN	NaN	NaN	NaN	NaN	NaN	NaN	NaN	NaN	NaN	NaN	NaN	NaN	NaN	NaN	NaN	NaN	NaN	NaN	NaN	NaN
4.4029	NaN	NaN	NaN	NaN	NaN	NaN	NaN	NaN	NaN	NaN	NaN	NaN	NaN	NaN	NaN	NaN	NaN	NaN	NaN	NaN	NaN	NaN	NaN	NaN	NaN	NaN	NaN	NaN	NaN	NaN	NaN	NaN	NaN	NaN	NaN	NaN	NaN	NaN	NaN	NaN	NaN	NaN	NaN	NaN	NaN	NaN	NaN	NaN	NaN	NaN	NaN	NaN	NaN	NaN	NaN	NaN	NaN	NaN	NaN	NaN	NaN	NaN	NaN	NaN	NaN	NaN	NaN	NaN	NaN	NaN	NaN	NaN	NaN	NaN	NaN	NaN	NaN	NaN	NaN	NaN	NaN	NaN	NaN	NaN	NaN	NaN	NaN	NaN	NaN	NaN	NaN	NaN	NaN	NaN	NaN	NaN	NaN	NaN	NaN	NaN	NaN
4.5363	NaN	NaN	NaN	NaN	NaN	NaN	NaN	NaN	NaN	NaN	NaN	NaN	NaN	NaN	NaN	NaN	NaN	NaN	NaN	NaN	NaN	NaN	NaN	NaN	NaN	NaN	NaN	NaN	NaN	NaN	NaN	NaN	NaN	NaN	NaN	NaN	NaN	NaN	NaN	NaN	NaN	NaN	NaN	NaN	NaN	NaN	NaN	NaN	NaN	NaN	NaN	NaN	NaN	NaN	NaN	NaN	NaN	NaN	NaN	NaN	NaN	NaN	NaN	NaN	NaN	NaN	NaN	NaN	NaN	NaN	NaN	NaN	NaN	NaN	NaN	NaN	NaN	NaN	NaN	NaN	NaN	NaN	NaN	NaN	NaN	NaN	NaN	NaN	NaN	NaN	NaN	NaN	NaN	NaN	NaN	NaN	NaN	NaN	NaN	NaN	NaN
4.6698	NaN	NaN	NaN	NaN	NaN	NaN	NaN	NaN	NaN	NaN	NaN	NaN	NaN	NaN	NaN	NaN	NaN	NaN	NaN	NaN	NaN	NaN	NaN	NaN	NaN	NaN	NaN	NaN	NaN	NaN	NaN	NaN	NaN	NaN	NaN	NaN	NaN	NaN	NaN	NaN	NaN	NaN	NaN	NaN	NaN	NaN	NaN	NaN	NaN	NaN	NaN	NaN	NaN	NaN	NaN	NaN	NaN	NaN	NaN	NaN	NaN	NaN	NaN	NaN	NaN	NaN	NaN	NaN	NaN	NaN	NaN	NaN	NaN	NaN	NaN	NaN	NaN	NaN	NaN	NaN	NaN	NaN	NaN	NaN	NaN	NaN	NaN	NaN	NaN	NaN	NaN	NaN	NaN	NaN	NaN	NaN	NaN	NaN	NaN	NaN	NaN
4.8032	NaN	NaN	NaN	NaN	NaN	NaN	NaN	NaN	NaN	NaN	NaN	NaN	NaN	NaN	NaN	NaN	NaN	NaN	NaN	NaN	NaN	NaN	NaN	NaN	NaN	NaN	NaN	NaN	NaN	NaN	NaN	NaN	NaN	NaN	NaN	NaN	NaN	NaN	NaN	NaN	NaN	NaN	NaN	NaN	NaN	NaN	NaN	NaN	NaN	NaN	NaN	NaN	NaN	NaN	NaN	NaN	NaN	NaN	NaN	NaN	NaN	NaN	NaN	NaN	NaN	NaN	NaN	NaN	NaN	NaN	NaN	NaN	NaN	NaN	NaN	NaN	NaN	NaN	NaN	NaN	NaN	NaN	NaN	NaN	NaN	NaN	NaN	NaN	NaN	NaN	NaN	NaN	NaN	NaN	NaN	NaN	NaN	NaN	NaN	NaN	NaN
4.9366	NaN	NaN	NaN	NaN	NaN	NaN	NaN	NaN	NaN	NaN	NaN	NaN	NaN	NaN	NaN	NaN	NaN	NaN	NaN	NaN	NaN	NaN	NaN	NaN	NaN	NaN	NaN	NaN	NaN	NaN	NaN	NaN	NaN	NaN	NaN	NaN	NaN	NaN	NaN	NaN	NaN	NaN	NaN	NaN	NaN	NaN	NaN	NaN	NaN	NaN	NaN	NaN	NaN	NaN	NaN	NaN	NaN	NaN	NaN	NaN	NaN	NaN	NaN	NaN	NaN	NaN	NaN	NaN	NaN	NaN	NaN	NaN	NaN	NaN	NaN	NaN	NaN	NaN	NaN	NaN	NaN	NaN	NaN	NaN	NaN	NaN	NaN	NaN	NaN	NaN	NaN	NaN	NaN	NaN	NaN	NaN	NaN	NaN	NaN	NaN	NaN
5.07	NaN	NaN	NaN	NaN	NaN	NaN	NaN	NaN	NaN	NaN	NaN	NaN	NaN	NaN	NaN	NaN	NaN	NaN	NaN	NaN	NaN	NaN	NaN	NaN	NaN	NaN	NaN	NaN	NaN	NaN	NaN	NaN	NaN	NaN	NaN	NaN	NaN	NaN	NaN	NaN	NaN	NaN	NaN	NaN	NaN	NaN	NaN	NaN	NaN	NaN	NaN	NaN	NaN	NaN	NaN	NaN	NaN	NaN	NaN	NaN	NaN	NaN	NaN	NaN	NaN	NaN	NaN	NaN	NaN	NaN	NaN	NaN	NaN	NaN	NaN	NaN	NaN	NaN	NaN	NaN	NaN	NaN	NaN	NaN	NaN	NaN	NaN	NaN	NaN	NaN	NaN	NaN	NaN	NaN	NaN	NaN	NaN	NaN	NaN	NaN	NaN
5.2035	NaN	NaN	NaN	NaN	NaN	NaN	NaN	NaN	NaN	NaN	NaN	NaN	NaN	NaN	NaN	NaN	NaN	NaN	NaN	NaN	NaN	NaN	NaN	NaN	NaN	NaN	NaN	NaN	NaN	NaN	NaN	NaN	NaN	NaN	NaN	NaN	NaN	NaN	NaN	NaN	NaN	NaN	NaN	NaN	NaN	NaN	NaN	NaN	NaN	NaN	NaN	NaN	NaN	NaN	NaN	NaN	NaN	NaN	NaN	NaN	NaN	NaN	NaN	NaN	NaN	NaN	NaN	NaN	NaN	NaN	NaN	NaN	NaN	NaN	NaN	NaN	NaN	NaN	NaN	NaN	NaN	NaN	NaN	NaN	NaN	NaN	NaN	NaN	NaN	NaN	NaN	NaN	NaN	NaN	NaN	NaN	NaN	NaN	NaN	NaN	NaN
5.3369	NaN	NaN	NaN	NaN	NaN	NaN	NaN	NaN	NaN	NaN	NaN	NaN	NaN	NaN	NaN	NaN	NaN	NaN	NaN	NaN	NaN	NaN	NaN	NaN	NaN	NaN	NaN	NaN	NaN	NaN	NaN	NaN	NaN	NaN	NaN	NaN	NaN	NaN	NaN	NaN	NaN	NaN	NaN	NaN	NaN	NaN	NaN	NaN	NaN	NaN	NaN	NaN	NaN	NaN	NaN	NaN	NaN	NaN	NaN	NaN	NaN	NaN	NaN	NaN	NaN	NaN	NaN	NaN	NaN	NaN	NaN	NaN	NaN	NaN	NaN	NaN	NaN	NaN	NaN	NaN	NaN	NaN	NaN	NaN	NaN	NaN	NaN	NaN	NaN	NaN	NaN	NaN	NaN	NaN	NaN	NaN	NaN	NaN	NaN	NaN	NaN
