id,lb,ub
EDD,0,inf
EDA,0,inf
MALt3r,0,inf
FUMtr,-inf,inf
FRUpts,-inf,inf
FRUK,0,inf
EX_gal_e,0,0
GALt2,0,inf
GALKr,-inf,inf
UDPG4E,-inf,inf
PGMT,-inf,inf
UGLT,-inf,inf
EX_glcn_e,0,0
GLCNt2r,-inf,inf
GNK,-inf,inf
EX_glyc_e,0,0
GLYCt,-inf,inf
GLYK,0,inf
G3PT,0,inf
G3PD2,-inf,inf