Glc,N1,N2,Vit1,Vit2,Measured,Point,Replicate,Include
-1,-1,-1,-1,1,1.7426686482478857,Factorial,1,no
1,-1,-1,-1,-1,0.12621177943179873,Factorial,1,no
-1,1,-1,-1,-1,1.484609220532505,Factorial,1,no
1,1,-1,-1,1,-0.013043349457277031,Factorial,1,no
-1,-1,1,-1,-1,120.20706355985536,Factorial,1,no
1,-1,1,-1,1,140.30832460419566,Factorial,1,no
-1,1,1,-1,1,181.0040837979774,Factorial,1,no
1,1,1,-1,-1,39.97108851561184,Factorial,1,no
-1,-1,-1,1,-1,5.800668517874598,Factorial,1,no
1,-1,-1,1,1,1.4432778200964265,Factorial,1,no
-1,1,-1,1,1,1.4546625267488764,Factorial,1,no
1,1,-1,1,-1,0.6386312505422183,Factorial,1,no
-1,-1,1,1,1,106.37422830409741,Factorial,1,no
1,-1,1,1,-1,90.94338364431131,Factorial,1,no
-1,1,1,1,-1,129.05646463725634,Factorial,1,no
1,1,1,1,1,131.54552211242418,Factorial,1,no
0,0,0,0,0,80.99657836024768,Center,1,yes
0,0,0,0,0,84.07505685782333,Center,1,yes
0,0,0,0,0,77.78950319532667,Center,1,yes
0,0,0,0,0,82.4528892172572,Center,1,yes
0,0,0,0,0,82.32939324597558,Center,1,yes
0,0,0,0,0,79.05621205073147,Center,1,yes
-1,0,0,0,0,86.44739495841638,Axial,1,yes
1,0,0,0,0,76.0968528052369,Axial,1,yes
0,-1,0,0,0,69.19517627529508,Axial,1,yes
0,1,0,0,0,94.01550676926749,Axial,1,yes
0,0,-1,0,0,29.02494522688582,Axial,1,yes
0,0,1,0,0,136.50195116327333,Axial,1,yes
0,0,0,-1,0,95.24423166313542,Axial,1,yes
0,0,0,1,0,83.13747697487138,Axial,1,yes
0,0,0,0,-1,86.6431640149005,Axial,1,yes
0,0,0,0,1,77.81534403734992,Axial,1,yes
-1,-1,-1,-1,1,35.67724593074945,Factorial,2,yes
1,-1,-1,-1,-1,67.88206017459493,Factorial,2,yes
-1,1,-1,-1,-1,27.081063212557837,Factorial,2,yes
1,1,-1,-1,1,80.12072353236844,Factorial,2,yes
-1,-1,1,-1,-1,143.38795908479318,Factorial,2,yes
1,-1,1,-1,1,116.29552179489534,Factorial,2,yes
-1,1,1,-1,1,216.64892974149404,Factorial,2,yes
1,1,1,-1,-1,47.4847203953271,Factorial,2,yes
-1,-1,-1,1,-1,41.35094462719766,Factorial,2,yes
1,-1,-1,1,1,5.702047392041493,Factorial,2,yes
-1,1,-1,1,1,84.87061203380053,Factorial,2,yes
1,1,-1,1,-1,8.932554972648418,Factorial,2,yes
-1,-1,1,1,1,117.48009381894695,Factorial,2,yes
1,-1,1,1,-1,104.45976164106271,Factorial,2,yes
-1,1,1,1,-1,157.82320965137419,Factorial,2,yes
1,1,1,1,1,143.3323150170906,Factorial,2,yes
