names,projections,bmin,bmax,islog,p0
SosKcat,0.000000,0.000010,100000.000000,1,0.00390
SosKm,0.000001,0.000010,100000.000000,1,7685.99327
reaction_20_Kcat,0.000000,0.000010,100000.000000,1,0.00594
reaction_20_Km,0.000001,0.000010,100000.000000,1,303.94849
reaction_21_Kcat,0.000000,0.000010,100000.000000,1,13.33214
reaction_21_Km,0.000001,0.000010,100000.000000,1,4177.34168
reaction_24_Kcat,0.000000,0.000010,100000.000000,1,0.29730
reaction_24_Km,0.000001,0.000010,100000.000000,1,1675.71439
reaction_25_Kcat,0.000000,0.000010,100000.000000,1,3.50025
reaction_25_Km,0.000001,0.000010,100000.000000,1,6036.70564
reaction_26_V,0.000000,0.000010,100000.000000,1,5295.41498
reaction_26_Km,0.000001,0.000010,100000.000000,1,1494.85820
reaction_27_Kcat,0.000000,0.000010,100000.000000,1,2.65460
reaction_27_Km,0.000001,0.000010,100000.000000,1,11643.94110
reaction_28_Kcat,0.000000,0.000010,100000.000000,1,4.93741
reaction_28_Km,0.000001,0.000010,100000.000000,1,2604.35390
reaction_30_k1,0.000000,0.000010,100000.000000,1,0.00012
