names,      projections  , bmin  , bmax , islog, p0
 d1,               1,         1e-4, 1e-1,   1,  0.03
 d1tag,            1,         1e-4, 1e-1,   1,  0.03 
 kd1,              1.00001,      1, 100,    1,  1   
 kL1,              1,       0.0001, 0.5,    1,  0.01
 n1,               0,            0,  10,    0,  2
 k12TF1,           0,         0.01, 100,    1,  5  
 Km12TF1,          0,          0.1,	1e4,    1,  500   
 Km21TF1,          1e8,        0.1,	1e4,    1,  500  
 k2aTF1,           0,         0.01, 100,    1,  5    
 Km2aTF1,          1e8,        0.1,	1e4,    1,  500
 Kma2TF1,          0,          0.1,	1e4,    1,  500   
 d2,               1,         1e-4, 1e-1,   1,  5e-3
 d2tag,            1,         1e-4, 1e-1,   1,  0.03   
 kd2,              1.0001        1, 100,    1,  1  
 kL2,              1,       0.0001, 0.5,    1,  0.01 
 n2,               0,            0,  10,    0,  2 
 k12TF2,           0,         0.01, 100,    1,  5   
 Km12TF2,          0,          0.1,	1e4,    1,  500
 Km21TF2,          1e8,        0.1,	1e4,    1,  500
 k2aTF2,           0,         0.01, 100,    1,  5    
 Km2aTF2,          1e8,        0.1,	1e4,    1,  500
 Kma2TF2,          0,          0.1,	1e4,    1,  500 
 k12FP,            0,         0.01, 100,    1,  5   
 Km12FP,           0,          0.1,	1e4,    1,  500
 Km21FP,           1e8,        0.1,	1e4,    1,  500
 k2aFP,            0,         0.01, 100,    1,  5   
 Km2aFP,           1e8,        0.1,	1e4,    1,  500
 Kma2FP,           0,          0.1,	1e4,    1,  500
 kLa,               ,       0.0001, 0.5,    1,  0.01    
 na,                ,            0,  10,    0,  2
 nad,              0,            0,   4,    0,  2
 Kmad,           1e8,          1, 1e3,    1,  10 
 Kdtet,          1e8,          0.1, 1e2,    1, 15 
 nMperUnit,      0.1,        0.001, 1000,   1,  0.1
 tc,               0,          0.1, 1e3,    1,  10  
 kact_induced,     0,         0.01, 100,    1,  5   