    km_pop;   1.00000;       NaN;  -0.09230;   0.77255;       NaN;   0.00000;       NaN;   0.00000;   0.00000;       NaN;   0.00000;   0.00000;   0.00000;   0.00000;   0.00000
    kp_pop;       NaN;       NaN;       NaN;       NaN;       NaN;       NaN;       NaN;       NaN;       NaN;       NaN;       NaN;       NaN;       NaN;       NaN;       NaN
    gp_pop;  -0.09230;       NaN;   1.00000;  -0.67098;       NaN;   0.00000;       NaN;   0.00000;   0.00000;       NaN;   0.00000;   0.00000;   0.00000;   0.00000;   0.00000
    gm_pop;   0.77255;       NaN;  -0.67098;   1.00000;       NaN;   0.00000;       NaN;   0.00000;   0.00000;       NaN;   0.00000;   0.00000;   0.00000;   0.00000;   0.00000
  ltau_pop;       NaN;       NaN;       NaN;       NaN;       NaN;       NaN;       NaN;       NaN;       NaN;       NaN;       NaN;       NaN;       NaN;       NaN;       NaN
  omega_km;   0.00000;       NaN;   0.00000;   0.00000;       NaN;   1.00000;       NaN;   0.00688;   0.59850;       NaN;  -0.06332;   0.52371;   0.27926;  -0.00214;  -0.00209
  omega_kp;       NaN;       NaN;       NaN;       NaN;       NaN;       NaN;       NaN;       NaN;       NaN;       NaN;       NaN;       NaN;       NaN;       NaN;       NaN
  omega_gp;   0.00000;       NaN;   0.00000;   0.00000;       NaN;   0.00688;       NaN;   1.00000;   0.44646;       NaN;  -0.07687;  -0.45011;  -0.47410;  -0.00345;  -0.00635
  omega_gm;   0.00000;       NaN;   0.00000;   0.00000;       NaN;   0.59850;       NaN;   0.44646;   1.00000;       NaN;  -0.67692;   0.50404;  -0.53137;  -0.00455;  -0.00468
omega_ltau;       NaN;       NaN;       NaN;       NaN;       NaN;       NaN;       NaN;       NaN;       NaN;       NaN;       NaN;       NaN;       NaN;       NaN;       NaN
corr_km_gp;   0.00000;       NaN;   0.00000;   0.00000;       NaN;  -0.06332;       NaN;  -0.07687;  -0.67692;       NaN;   1.00000;  -0.64013;   0.81246;   0.00182;   0.00063
corr_km_gm;   0.00000;       NaN;   0.00000;   0.00000;       NaN;   0.52371;       NaN;  -0.45011;   0.50404;       NaN;  -0.64013;   1.00000;  -0.07737;   0.00023;   0.00259
corr_gp_gm;   0.00000;       NaN;   0.00000;   0.00000;       NaN;   0.27926;       NaN;  -0.47410;  -0.53137;       NaN;   0.81246;  -0.07737;   1.00000;   0.00262;   0.00273
         a;   0.00000;       NaN;   0.00000;   0.00000;       NaN;  -0.00214;       NaN;  -0.00345;  -0.00455;       NaN;   0.00182;   0.00023;   0.00262;   1.00000;  -0.38118
         b;   0.00000;       NaN;   0.00000;   0.00000;       NaN;  -0.00209;       NaN;  -0.00635;  -0.00468;       NaN;   0.00063;   0.00259;   0.00273;  -0.38118;   1.00000
