    ID	      eta_km_mean	     eta_kp_mean	     eta_gp_mean	     eta_gm_mean	     eta_ltau_mean	     eta_km_sd	     eta_kp_sd	     eta_gp_sd	     eta_gm_sd	     eta_ltau_sd	
     1	         -0.24059	               0	         0.63051	        -0.65334	                 0	      0.071932	             0	       0.19294	       0.19687	               0	
     2	          -0.4026	               0	         0.22817	        -0.75883	                 0	      0.039605	             0	       0.12191	       0.13047	               0	
     3	         -0.92093	               0	       -0.073613	        -0.82316	                 0	      0.038403	             0	       0.17737	        0.1793	               0	
     4	          -0.1175	               0	         0.28433	        -0.39669	                 0	      0.048027	             0	       0.10932	       0.13544	               0	
     5	         -0.98197	               0	         0.11143	         -1.0272	                 0	    7.1463e-08	             0	    1.4901e-08	    1.4901e-08	               0	
     6	          -0.7936	               0	         0.39197	         -1.2642	                 0	      0.070512	             0	       0.16331	       0.15863	               0	
     7	         -0.88817	               0	         -0.3746	        -0.70806	                 0	    1.4901e-08	             0	     0.0042332	    0.00071065	               0	
     8	         -0.67425	               0	         0.30013	         -1.0361	                 0	      0.045491	             0	       0.19102	        0.1931	               0	
     9	         -0.81855	               0	        -0.16716	        -0.53986	                 0	      0.067405	             0	       0.39815	       0.38843	               0	
    10	        0.0090846	               0	         0.72507	        -0.93492	                 0	      0.047947	             0	      0.088424	      0.087326	               0	
    11	          0.10088	               0	         0.60022	        -0.49828	                 0	      0.042803	             0	      0.085106	      0.096962	               0	
    12	         -0.98094	               0	         0.30348	          -1.412	                 0	      0.022215	             0	      0.046495	      0.032558	               0	
    13	         -0.36368	               0	         0.48437	        -0.95174	                 0	      0.046593	             0	       0.13028	       0.13203	               0	
    14	         -0.49318	               0	         0.48122	         -1.0269	                 0	      0.041428	             0	      0.073002	      0.076401	               0	
    15	         -0.86827	               0	         0.25894	         -1.1717	                 0	    1.0694e-07	             0	    3.3939e-08	    1.3494e-07	               0	
    16	         -0.90571	               0	        -0.30146	         -0.6802	                 0	     0.0085247	             0	      0.010213	     0.0056847	               0	
    17	         -0.55252	               0	         0.36571	         -1.0692	                 0	      0.043423	             0	      0.091822	      0.092733	               0	
    18	         -0.13291	               0	         0.53564	        -0.76109	                 0	      0.042941	             0	       0.14359	       0.15751	               0	
    19	         -0.87136	               0	         0.16034	         -1.1755	                 0	      0.038327	             0	       0.10556	      0.097783	               0	
    20	         -0.32619	               0	         0.46982	         -0.8762	                 0	      0.005144	             0	     0.0069416	    1.2688e-07	               0	
    21	         -0.51124	               0	         -0.4154	       -0.099262	                 0	      0.071906	             0	      0.092986	       0.12435	               0	
    22	          -0.5142	               0	         0.53025	        -0.84775	                 0	      0.051257	             0	       0.12218	       0.12142	               0	
    23	         -0.51766	               0	         0.39192	        -0.84967	                 0	      0.048853	             0	       0.14257	       0.13697	               0	
    24	         -0.83535	               0	         0.28557	         -1.1892	                 0	      0.046932	             0	       0.13975	       0.13273	               0	
    25	         -0.11428	               0	         0.54625	        -0.69756	                 0	       0.06102	             0	       0.19227	       0.19504	               0	
    26	         -0.51133	               0	        -0.42217	        -0.21723	                 0	      0.046224	             0	       0.07207	      0.085918	               0	
    27	          -1.0635	               0	         0.19029	          -1.258	                 0	      0.047169	             0	       0.12718	        0.1322	               0	
    28	          -0.7756	               0	         0.27929	        -0.97916	                 0	       0.04214	             0	      0.079564	       0.08808	               0	
    29	         -0.58686	               0	         0.57501	         -1.0348	                 0	        0.0834	             0	       0.10927	      0.095086	               0	
    30	         -0.90281	               0	        -0.28082	        -0.68125	                 0	      0.012785	             0	      0.021905	      0.015127	               0	
    31	         -0.78281	               0	         0.40523	         -1.1595	                 0	      0.064654	             0	       0.18693	        0.1831	               0	
    32	         -0.95451	               0	         0.42791	         -1.2827	                 0	    1.6152e-07	             0	    1.4901e-08	    1.4901e-08	               0	
    33	         -0.42762	               0	         0.41499	        -0.88537	                 0	      0.063864	             0	       0.11374	       0.12196	               0	
    34	         -0.35836	               0	         0.89787	         -1.2757	                 0	       0.21246	             0	        0.2483	       0.18006	               0	
    35	         -0.41266	               0	        -0.64098	        0.059567	                 0	       0.05653	             0	      0.072199	       0.06676	               0	
    36	         -0.43988	               0	          0.3605	         -0.8007	                 0	      0.071939	             0	       0.18812	       0.19288	               0	
    37	          0.46424	               0	         -0.1028	         0.53678	                 0	       0.18713	             0	      0.080513	       0.24761	               0	
    38	          -1.2809	               0	         0.11994	         -1.5593	                 0	     0.0067294	             0	     0.0054761	     0.0033429	               0	
    39	          0.51349	               0	          0.6916	         -0.2774	                 0	      0.083914	             0	       0.16411	       0.20492	               0	
    40	         -0.11606	               0	         0.43884	        -0.54338	                 0	       0.10374	             0	       0.21904	       0.22053	               0	
    41	        -0.010289	               0	         0.41164	        -0.52908	                 0	       0.10163	             0	       0.24623	       0.30031	               0	
    42	           1.0454	               0	        -0.47906	          1.4349	                 0	       0.41586	             0	      0.087691	       0.44817	               0	
    43	         -0.43805	               0	         0.32524	        -0.70217	                 0	         0.124	             0	       0.22639	       0.31556	               0	
    44	         -0.48272	               0	        0.069537	         -0.4906	                 0	       0.14366	             0	       0.29038	       0.37978	               0	
    45	           0.1946	               0	         0.85244	        -0.74224	                 0	      0.091917	             0	       0.17664	       0.17324	               0	
    46	           0.2598	               0	         0.56544	        -0.48004	                 0	      0.089858	             0	       0.11106	       0.17401	               0	
    47	          0.82667	               0	        -0.82229	          1.7549	                 0	       0.47518	             0	       0.11664	       0.48961	               0	
    48	          0.17103	               0	        -0.28246	         0.58968	                 0	        0.6429	             0	       0.36144	       0.89201	               0	
    49	         -0.27797	               0	        0.071458	        -0.27986	                 0	       0.31301	             0	       0.33848	       0.56216	               0	
    50	           0.4235	               0	          -1.148	          1.3288	                 0	       0.53091	             0	       0.15818	       0.57721	               0	
    51	          0.39062	               0	         0.30031	         0.19362	                 0	       0.36991	             0	       0.30967	       0.65648	               0	
    52	          0.97335	               0	         -0.4556	            1.42	                 0	       0.72478	             0	       0.12224	       0.73553	               0	
    53	            0.922	               0	        -0.11921	           1.236	                 0	       0.24987	             0	      0.088749	       0.26713	               0	
    54	           0.7939	               0	        -0.73098	          1.3789	                 0	       0.17775	             0	       0.10178	       0.19141	               0	
    55	           0.0197	               0	         0.18084	        -0.10395	                 0	       0.31879	             0	       0.27854	        0.5175	               0	
    56	          0.58402	               0	         0.67815	        -0.18509	                 0	       0.10522	             0	       0.11608	        0.1341	               0	
    57	          0.23736	               0	         0.51262	         -0.3205	                 0	       0.22838	             0	       0.22486	       0.41119	               0	
    58	           0.2027	               0	       -0.021757	         0.41136	                 0	       0.36091	             0	       0.12384	       0.36547	               0	
    59	        -0.089878	               0	         0.34574	         -0.4544	                 0	       0.25704	             0	       0.23779	       0.44294	               0	
    60	          0.27253	               0	         0.33493	        -0.17541	                 0	       0.22014	             0	       0.12148	       0.27084	               0	
    61	           0.8314	               0	         -0.4323	          1.2377	                 0	       0.38692	             0	       0.10734	       0.41273	               0	
    62	          0.56306	               0	        -0.44668	         0.81525	                 0	       0.31294	             0	       0.10046	        0.3225	               0	
    63	         -0.35241	               0	         0.42048	        -0.79547	                 0	       0.10197	             0	      0.056238	       0.08765	               0	
    64	          0.11747	               0	         0.31777	        -0.19463	                 0	       0.27563	             0	       0.14846	       0.34624	               0	
    65	         -0.34978	               0	         0.37359	        -0.61451	                 0	       0.36737	             0	       0.30876	       0.59341	               0	
    66	          0.83819	               0	         0.12866	         0.71064	                 0	        0.2884	             0	       0.11398	        0.2904	               0	
    67	          0.60511	               0	         0.19365	         0.25043	                 0	       0.33519	             0	       0.12533	       0.28648	               0	
    68	         0.049365	               0	         0.99957	        -0.86675	                 0	       0.22175	             0	       0.28702	       0.26589	               0	
    69	         -0.13121	               0	         0.40407	        -0.53875	                 0	       0.18707	             0	       0.16113	       0.22544	               0	
    70	          0.77321	               0	        -0.16692	         0.82524	                 0	       0.64701	             0	       0.19595	       0.65636	               0	
    71	          0.41069	               0	       -0.040615	         0.41346	                 0	       0.42172	             0	       0.10768	       0.38936	               0	
    72	            1.008	               0	        -0.57889	          1.4485	                 0	       0.60019	             0	       0.18883	       0.52625	               0	
    73	          0.38014	               0	       -0.072279	         0.38302	                 0	       0.49174	             0	       0.13559	       0.49466	               0	
    74	          0.45255	               0	           0.642	       -0.016742	                 0	       0.20862	             0	        0.2379	       0.36401	               0	
    75	         0.068327	               0	         0.49403	         -0.4412	                 0	       0.14523	             0	       0.13173	       0.19016	               0	
    76	          0.95574	               0	        -0.69423	          1.6848	                 0	       0.54341	             0	       0.32301	       0.56768	               0	
    77	          0.33285	               0	         0.75216	        -0.51535	                 0	        0.1815	             0	       0.14989	       0.14632	               0	
    78	          0.29673	               0	         0.49901	        -0.28475	                 0	       0.24288	             0	       0.22321	        0.3245	               0	
    79	          0.44615	               0	         0.54687	        -0.24059	                 0	       0.24611	             0	       0.19271	       0.22818	               0	
    80	         -0.57843	               0	         0.12021	        -0.83698	                 0	       0.27243	             0	       0.32185	       0.48477	               0	
    81	         0.011406	               0	         0.42311	        -0.44908	                 0	        0.3092	             0	       0.24481	       0.34074	               0	
    82	          0.91003	               0	          0.2457	         0.55071	                 0	       0.32765	             0	       0.15109	       0.25523	               0	
    83	          0.34301	               0	         0.19243	         0.22048	                 0	       0.27683	             0	       0.20265	       0.26084	               0	
    84	           0.5961	               0	        -0.36502	          1.1518	                 0	       0.37799	             0	       0.29617	       0.49513	               0	
    85	          0.19423	               0	         0.60615	        -0.51494	                 0	        0.2874	             0	        0.2511	       0.27228	               0	
    86	          0.75801	               0	        -0.62714	          1.2654	                 0	       0.53379	             0	       0.20531	       0.58742	               0	
    87	         -0.66857	               0	         0.86649	         -1.2595	                 0	       0.08399	             0	       0.12538	       0.13747	               0	
    88	         -0.14936	               0	       -0.086861	      -0.0011152	                 0	      0.057591	             0	      0.079281	       0.11027	               0	
    89	         -0.49671	               0	          1.2708	         -1.7074	                 0	       0.09341	             0	      0.080354	      0.070879	               0	
    90	        -0.053825	               0	        -0.50381	         0.63942	                 0	       0.12162	             0	      0.081518	       0.16529	               0	
    91	         -0.49218	               0	         0.70816	          -1.099	                 0	      0.092359	             0	       0.33399	       0.34856	               0	
    92	         -0.36971	               0	        -0.39753	        0.012146	                 0	      0.080676	             0	      0.097872	       0.14245	               0	
    93	          0.38034	               0	        -0.54988	          1.0403	                 0	       0.15189	             0	        0.0636	       0.18242	               0	
    94	          -1.0576	               0	         0.27425	          -1.296	                 0	      0.083521	             0	       0.24793	       0.24361	               0	
    95	          -1.0308	               0	         0.56363	         -1.6309	                 0	       0.12786	             0	       0.23109	       0.22222	               0	
    96	          -1.2142	               0	         0.44754	         -1.4297	                 0	      0.045835	             0	       0.10092	       0.12496	               0	
    97	         -0.77627	               0	          0.4982	         -1.0149	                 0	       0.07319	             0	       0.15425	        0.1389	               0	
    98	         -0.27923	               0	        -0.74231	         0.41341	                 0	       0.23883	             0	       0.11957	       0.30169	               0	
    99	          0.52993	               0	        -0.59555	          1.0669	                 0	       0.35654	             0	      0.074068	       0.38172	               0	
   100	          0.34977	               0	        -0.33819	         0.74297	                 0	       0.17833	             0	      0.064266	       0.19864	               0	
   101	          -1.4161	               0	         0.26872	         -1.5484	                 0	       0.11163	             0	       0.24923	       0.24445	               0	
   102	          0.81725	               0	        -0.82867	          1.5408	                 0	       0.42568	             0	      0.074142	       0.43362	               0	
   103	           1.0889	               0	        -0.39082	          1.7799	                 0	        0.2975	             0	      0.081874	       0.28183	               0	
   104	          0.60085	               0	        -0.67627	          1.4405	                 0	       0.33212	             0	      0.093675	        0.3278	               0	
   105	          -0.3838	               0	         0.60474	         -0.7117	                 0	       0.11318	             0	       0.17162	        0.2245	               0	
   106	          0.47126	               0	        -0.41437	         0.99746	                 0	       0.61912	             0	         0.105	       0.65878	               0	
   107	         -0.21583	               0	         0.27281	         -0.3244	                 0	       0.19057	             0	       0.18793	       0.32923	               0	
   108	          0.21691	               0	       -0.065195	         0.54833	                 0	       0.35213	             0	      0.097489	       0.34728	               0	
   109	          0.79837	               0	        -0.05199	         0.91357	                 0	       0.30522	             0	       0.07925	       0.32912	               0	
   110	         0.015887	               0	        -0.56026	         0.75128	                 0	       0.25185	             0	      0.088998	       0.25816	               0	
   111	         -0.13105	               0	        -0.16842	         0.16789	                 0	       0.34983	             0	       0.12594	       0.38256	               0	
   112	         -0.72256	               0	        -0.25014	        0.067215	                 0	       0.17269	             0	       0.15589	        0.1621	               0	
   113	         -0.28957	               0	          1.2523	         -1.4691	                 0	        0.2394	             0	       0.13939	       0.11237	               0	
   114	          0.61604	               0	        -0.55016	          1.1358	                 0	        0.4037	             0	       0.13907	       0.41163	               0	
   115	          0.49657	               0	        -0.60887	          1.3021	                 0	       0.49206	             0	       0.14937	       0.50103	               0	
   116	          0.14491	               0	         -0.7168	         0.96193	                 0	        0.2438	             0	       0.17264	       0.18424	               0	
   117	          0.22124	               0	         0.15936	         0.12503	                 0	       0.26102	             0	       0.14509	        0.3051	               0	
   118	         -0.54895	               0	        0.010224	        -0.49193	                 0	       0.79265	             0	       0.61003	        1.3659	               0	
   119	         -0.34579	               0	         0.56525	         -0.7834	                 0	       0.33247	             0	       0.37093	       0.56942	               0	
   120	         -0.32134	               0	         0.23422	        -0.43784	                 0	       0.65481	             0	       0.62754	        1.2017	               0	
   121	         -0.28643	               0	         0.64076	        -0.73153	                 0	    2.4711e-08	             0	    1.4901e-08	    1.4901e-08	               0	
   122	         -0.51177	               0	        -0.24444	        -0.21347	                 0	       0.28497	             0	        1.0744	        1.4484	               0	
   123	          -0.3114	               0	         -0.1107	        0.075767	                 0	       0.42034	             0	       0.50313	       0.91777	               0	
   124	           1.3898	               0	         -1.3693	          2.6109	                 0	       0.18574	             0	       0.16424	       0.20653	               0	
   125	        -0.053652	               0	        -0.43621	         0.41998	                 0	       0.52064	             0	       0.22899	       0.59258	               0	
   126	           0.1407	               0	        -0.54448	          0.7356	                 0	       0.53393	             0	       0.25105	       0.60066	               0	
   127	          0.47302	               0	         -1.1144	          1.4347	                 0	       0.39205	             0	       0.17896	       0.38184	               0	
   128	          0.58483	               0	        -0.91251	          1.3892	                 0	       0.35047	             0	       0.24556	       0.28788	               0	
   129	         -0.49222	               0	        0.062874	        -0.45764	                 0	       0.93148	             0	         1.059	        1.9906	               0	
   130	           0.2225	               0	        -0.01141	         0.29716	                 0	       0.49953	             0	       0.26785	          0.62	               0	
   131	           -0.771	               0	        -0.21688	        -0.69993	                 0	     0.0054464	             0	      0.019434	     0.0066693	               0	
   132	         -0.29283	               0	        0.042123	        -0.36814	                 0	      0.045834	             0	      0.098652	       0.12101	               0	
   133	        -0.064117	               0	         0.56251	        -0.81808	                 0	     0.0081421	             0	      0.010419	      0.033326	               0	
   134	         -0.52112	               0	         0.52408	         -1.0641	                 0	      0.041907	             0	      0.089183	       0.10253	               0	
   135	         -0.30885	               0	         0.44648	        -0.86086	                 0	    0.00042044	             0	     0.0091284	     0.0044015	               0	
   136	         -0.90314	               0	         0.19822	         -1.2465	                 0	      0.040084	             0	      0.078546	      0.079607	               0	
   137	         -0.59393	               0	         0.40571	         -1.1422	                 0	      0.033689	             0	      0.057299	      0.067538	               0	
   138	         -0.36137	               0	         0.40527	        -0.69138	                 0	      0.052996	             0	       0.14759	       0.15759	               0	
   139	          0.35372	               0	        -0.47169	         0.66275	                 0	      0.081223	             0	      0.062645	       0.10992	               0	
   140	         -0.84576	               0	          0.3494	         -1.1562	                 0	      0.061706	             0	       0.13023	       0.12592	               0	
   141	         -0.42683	               0	         0.38354	        -0.82916	                 0	    5.8429e-08	             0	     0.0011048	    1.4901e-08	               0	
   142	          -1.2599	               0	         0.15676	         -1.5289	                 0	     0.0066867	             0	      0.015748	      0.018192	               0	
   143	         -0.88442	               0	         0.33698	         -1.2384	                 0	       0.08232	             0	      0.072375	      0.083494	               0	
   144	         -0.32744	               0	        -0.20412	        -0.25191	                 0	      0.056547	             0	      0.094796	       0.12041	               0	
   145	         -0.36579	               0	         0.49396	        -0.76833	                 0	      0.010318	             0	      0.036997	      0.019135	               0	
   146	         -0.37159	               0	         0.34359	        -0.86389	                 0	    4.8572e-08	             0	    2.7878e-08	    1.4901e-08	               0	
   147	          -1.3528	               0	         -0.4359	          -1.312	                 0	      0.010645	             0	      0.013657	     0.0014385	               0	
   148	          -1.6067	               0	         0.20226	         -1.5155	                 0	      0.056333	             0	       0.18907	       0.23538	               0	
   149	          -0.4719	               0	         0.22046	        -0.75135	                 0	     0.0023836	             0	      0.014015	     0.0084693	               0	
   150	         -0.48886	               0	        -0.31195	       -0.099186	                 0	      0.051441	             0	       0.07274	      0.083763	               0	
   151	         -0.27262	               0	         0.55483	        -0.84058	                 0	      0.042894	             0	       0.10495	       0.10852	               0	
   152	         -0.48036	               0	          0.3566	         -1.1028	                 0	      0.042996	             0	      0.080064	      0.077094	               0	
   153	         -0.61503	               0	         0.41841	        -0.98164	                 0	      0.040019	             0	      0.094815	       0.10153	               0	
   154	         -0.70646	               0	         0.28899	         -1.0849	                 0	      0.037262	             0	       0.12748	       0.13128	               0	
   155	         -0.36512	               0	         0.34618	        -0.81047	                 0	    1.4901e-08	             0	    1.4901e-08	    1.4901e-08	               0	
   156	         -0.16843	               0	         0.49537	        -0.75366	                 0	      0.041207	             0	       0.10384	       0.12432	               0	
   157	          -0.5673	               0	      -0.0012646	         -0.7152	                 0	      0.023347	             0	      0.032793	      0.013691	               0	
   158	        -0.033281	               0	         0.73414	        -0.71759	                 0	      0.081948	             0	       0.19518	       0.21491	               0	
   159	         0.037389	               0	         0.50631	        -0.62196	                 0	      0.046473	             0	       0.13292	       0.16901	               0	
   160	          -0.1111	               0	         0.31499	        -0.27712	                 0	      0.091612	             0	       0.28703	       0.35089	               0	
   161	          -0.5617	               0	        0.024081	        -0.62831	                 0	       0.13265	             0	       0.39824	       0.46685	               0	
   162	         -0.43061	               0	         0.39325	        -0.87752	                 0	      0.071731	             0	       0.13509	        0.1708	               0	
   163	         -0.43677	               0	         0.32297	        -0.93323	                 0	      0.057441	             0	       0.10242	       0.12715	               0	
   164	         -0.40598	               0	         0.17313	        -0.72478	                 0	      0.014882	             0	     0.0037139	     0.0092444	               0	
   165	          0.18029	               0	         0.75583	        -0.55575	                 0	      0.068295	             0	      0.098811	       0.10042	               0	
   166	        -0.055698	               0	         0.50336	        -0.45928	                 0	        0.1141	             0	       0.21679	       0.24713	               0	
   167	         -0.96372	               0	         0.40231	           -1.28	                 0	      0.097345	             0	       0.27625	       0.28311	               0	
   168	           0.2299	               0	         0.64454	        -0.50622	                 0	      0.079284	             0	       0.13012	        0.1687	               0	
   169	        -0.060136	               0	        -0.17913	        0.039992	                 0	       0.17051	             0	      0.073067	         0.214	               0	
   170	          -0.1552	               0	         0.55315	        -0.66087	                 0	       0.15104	             0	        0.3092	       0.38463	               0	
   171	         -0.20812	               0	         0.67237	        -0.66059	                 0	       0.24103	             0	       0.71067	       0.98962	               0	
   172	        -0.095443	               0	         0.26659	        -0.30468	                 0	       0.18795	             0	       0.30335	       0.48186	               0	
   173	         -0.26975	               0	         0.61153	        -0.64039	                 0	       0.10732	             0	       0.20659	       0.23853	               0	
   174	         -0.57494	               0	         0.23237	        -0.74839	                 0	      0.017549	             0	      0.011475	      0.011328	               0	
   175	         -0.45459	               0	        0.012707	        -0.45007	                 0	       0.19144	             0	        0.4537	       0.58984	               0	
   176	          0.30678	               0	         0.68176	        -0.64035	                 0	      0.076061	             0	      0.094785	       0.14612	               0	
   177	          0.11671	               0	        0.022023	         0.14463	                 0	       0.35926	             0	       0.09717	        0.3954	               0	
   178	         0.039503	               0	          0.4372	        -0.33339	                 0	       0.11302	             0	        0.2079	       0.27981	               0	
   179	          0.12265	               0	         0.30625	        -0.11236	                 0	       0.25101	             0	       0.21317	       0.43005	               0	
   180	          0.20077	               0	        -0.36857	         0.54524	                 0	        0.2478	             0	      0.085265	       0.26031	               0	
   181	           0.1929	               0	       -0.037414	         0.21587	                 0	       0.25714	             0	      0.097713	       0.27934	               0	
   182	         0.043676	               0	         0.14967	          -0.259	                 0	       0.12991	             0	      0.091849	       0.18026	               0	
   183	        -0.014871	               0	         0.45144	        -0.65922	                 0	       0.10944	             0	       0.20461	       0.20375	               0	
   184	          0.18438	               0	         0.37891	        -0.35311	                 0	       0.11545	             0	       0.14648	       0.23439	               0	
   185	          0.84614	               0	         0.09449	         0.49084	                 0	       0.14987	             0	      0.076642	       0.18762	               0	
   186	           1.1111	               0	        0.032747	          1.1801	                 0	       0.33439	             0	      0.098412	       0.36215	               0	
   187	         -0.18013	               0	         0.48071	        -0.59369	                 0	       0.13152	             0	       0.13602	       0.25432	               0	
   188	          0.55093	               0	         0.26971	           0.287	                 0	       0.16822	             0	      0.085011	       0.17219	               0	
   189	          0.25166	               0	         0.13049	         0.14441	                 0	       0.26996	             0	       0.12823	       0.25469	               0	
   190	           0.8338	               0	        -0.21071	          1.0767	                 0	       0.47235	             0	         0.124	       0.45397	               0	
   191	         -0.78645	               0	          1.1825	          -1.818	                 0	       0.20708	             0	       0.14988	       0.12593	               0	
   192	           0.3671	               0	         0.64236	        -0.41316	                 0	      0.085304	             0	       0.12516	       0.17881	               0	
   193	          0.70819	               0	          0.7319	        -0.06167	                 0	       0.13425	             0	       0.14365	       0.23822	               0	
   194	          0.67397	               0	         0.66406	       -0.036604	                 0	        0.1619	             0	       0.14028	       0.18616	               0	
   195	          0.22774	               0	         0.72164	        -0.67039	                 0	       0.15235	             0	       0.12827	       0.17118	               0	
   196	        -0.028747	               0	         0.79639	        -0.65931	                 0	       0.10237	             0	       0.11459	       0.14765	               0	
   197	           0.5613	               0	         0.87606	        -0.50225	                 0	       0.15148	             0	       0.10823	       0.12471	               0	
   198	         0.080431	               0	         0.63063	        -0.60097	                 0	       0.15327	             0	       0.14917	       0.22243	               0	
   199	          0.10711	               0	         0.35122	        -0.42568	                 0	       0.16669	             0	       0.22353	       0.32073	               0	
   200	            1.641	               0	       -0.077236	          1.6313	                 0	       0.36984	             0	       0.18326	       0.32958	               0	
   201	          0.13015	               0	         0.33448	        -0.49478	                 0	       0.28518	             0	       0.17673	       0.27078	               0	
   202	          0.45009	               0	         0.71827	        -0.31674	                 0	       0.29893	             0	       0.19739	       0.22589	               0	
   203	          0.49534	               0	          0.4952	       -0.049298	                 0	       0.21356	             0	        0.1484	       0.19159	               0	
   204	          0.48634	               0	        -0.36349	         0.80919	                 0	       0.52757	             0	       0.25755	       0.41044	               0	
   205	          0.36455	               0	         0.12209	         0.24957	                 0	       0.35454	             0	       0.24552	       0.25634	               0	
   206	          0.50991	               0	         0.54919	       -0.068423	                 0	        0.1929	             0	       0.12495	        0.2036	               0	
   207	          0.15081	               0	         0.72945	        -0.57861	                 0	       0.23475	             0	       0.13985	       0.13714	               0	
   208	           0.3001	               0	         0.50414	        -0.37065	                 0	       0.18221	             0	       0.15377	       0.25285	               0	
   209	          0.14418	               0	         0.58495	        -0.42665	                 0	       0.19249	             0	       0.18426	       0.23217	               0	
   210	          0.57406	               0	         0.42707	        0.064374	                 0	       0.24865	             0	        0.1819	       0.24301	               0	
   211	            0.279	               0	         0.64239	        -0.36551	                 0	       0.28866	             0	        0.1933	       0.29775	               0	
   212	          0.24473	               0	         0.70497	        -0.44141	                 0	       0.20706	             0	       0.23777	       0.25113	               0	
   213	         -0.49132	               0	         0.57284	         -1.0169	                 0	      0.066577	             0	       0.22211	       0.23055	               0	
   214	         -0.29474	               0	        -0.14885	        -0.26029	                 0	      0.054968	             0	       0.12437	       0.14969	               0	
   215	          0.16956	               0	        -0.25514	         0.43195	                 0	       0.10442	             0	      0.086647	       0.16185	               0	
   216	          -1.3073	               0	         0.48179	         -1.5978	                 0	      0.088458	             0	       0.17463	       0.17598	               0	
   217	          -0.2738	               0	       -0.038341	       -0.082163	                 0	      0.063571	             0	      0.098158	       0.13766	               0	
   218	         -0.69428	               0	         0.20395	        -0.93179	                 0	       0.03977	             0	        0.1146	        0.1136	               0	
   219	         -0.44472	               0	        0.014129	        -0.55675	                 0	      0.045773	             0	       0.15619	       0.17477	               0	
   220	         -0.14632	               0	        -0.49848	         0.17776	                 0	      0.087383	             0	      0.078628	       0.13006	               0	
   221	         -0.73098	               0	         0.35832	         -1.1093	                 0	      0.040268	             0	       0.14887	       0.15813	               0	
   222	         -0.22363	               0	         0.65543	        -0.92729	                 0	      0.074951	             0	       0.34086	       0.36644	               0	
   223	          -1.3863	               0	          0.1949	          -1.431	                 0	      0.060536	             0	       0.14798	       0.14269	               0	
   224	          -0.2024	               0	         0.55132	        -0.72701	                 0	       0.08916	             0	       0.27947	       0.29546	               0	
   225	         -0.54185	               0	        -0.34832	        0.019656	                 0	        0.3542	             0	       0.62682	       0.93744	               0	
   226	          0.34237	               0	        -0.33808	         0.71437	                 0	       0.21472	             0	      0.091523	       0.26629	               0	
   227	        -0.071263	               0	         -1.0262	         0.77891	                 0	       0.20723	             0	      0.089383	       0.22277	               0	
   228	          0.06266	               0	         -0.4089	         0.17079	                 0	         0.123	             0	      0.073175	       0.15403	               0	
   229	          0.44612	               0	        -0.25742	         0.67841	                 0	       0.35619	             0	      0.062678	       0.37831	               0	
   230	           -1.523	               0	        -0.05899	         -1.3735	                 0	      0.056263	             0	        0.1046	       0.10917	               0	
   231	          0.02395	               0	        0.010866	         0.06345	                 0	       0.20713	             0	       0.15008	       0.33993	               0	
   232	          0.30876	               0	        -0.33364	         0.65364	                 0	       0.24827	             0	      0.085368	       0.27123	               0	
   233	         0.042669	               0	        -0.69067	          1.1272	                 0	       0.28848	             0	        0.1086	       0.31139	               0	
   234	          0.38764	               0	        -0.68992	           1.106	                 0	       0.37806	             0	       0.11404	        0.3776	               0	
   235	          0.57872	               0	        -0.82203	          1.3273	                 0	       0.28746	             0	      0.092015	       0.29732	               0	
   236	           0.7492	               0	         -1.7363	          2.2526	                 0	       0.21843	             0	       0.14465	       0.21578	               0	
   237	           1.0034	               0	        -0.71831	          1.4985	                 0	        0.3433	             0	       0.10682	       0.32685	               0	
   238	          0.44994	               0	        -0.69786	          1.2333	                 0	       0.37759	             0	       0.11838	       0.37114	               0	
   239	           -0.197	               0	         0.60548	        -0.81864	                 0	       0.23172	             0	       0.39707	       0.45992	               0	
   240	          0.53061	               0	        -0.75367	          1.3715	                 0	        0.2692	             0	       0.13602	       0.30599	               0	
   241	           1.0289	               0	        -0.47427	          1.3979	                 0	       0.50651	             0	      0.098316	       0.47392	               0	
   242	          0.78151	               0	         -0.5239	          1.3057	                 0	       0.58705	             0	       0.14494	       0.51209	               0	
   243	         -0.82472	               0	         0.11927	        -0.84872	                 0	       0.19371	             0	        0.3753	       0.49552	               0	
   244	          0.88741	               0	        -0.46725	          1.1312	                 0	       0.30243	             0	       0.12215	       0.30609	               0	
   245	         -0.14044	               0	        -0.14877	         0.12966	                 0	       0.66386	             0	       0.50552	         1.033	               0	
   246	         -0.25213	               0	         0.41462	        -0.62847	                 0	       0.21508	             0	       0.19704	       0.33011	               0	
   247	          0.63651	               0	        -0.65721	           1.279	                 0	       0.32563	             0	       0.16516	       0.31155	               0	
   248	         -0.04853	               0	       -0.085263	         0.12713	                 0	       0.45111	             0	       0.26644	       0.62866	               0	
   249	          0.73791	               0	         -1.3355	          2.0831	                 0	       0.79537	             0	       0.15058	       0.80681	               0	
   250	          0.15492	               0	       -0.038212	         0.24613	                 0	       0.40637	             0	       0.17541	         0.386	               0	
   251	         0.066299	               0	         0.45984	        -0.40578	                 0	       0.30089	             0	       0.15655	       0.30348	               0	
   252	          0.46476	               0	        -0.40309	         0.87467	                 0	       0.38931	             0	       0.17383	       0.39528	               0	
   253	          0.43525	               0	         -0.3019	         0.71358	                 0	       0.47858	             0	       0.23163	       0.50839	               0	
   254	          0.21215	               0	         -1.4259	          1.6817	                 0	       0.36237	             0	       0.22504	       0.40836	               0	
   255	          0.88096	               0	        -0.44014	          1.3926	                 0	       0.57961	             0	       0.27447	        0.5826	               0	
   256	          0.16595	               0	         0.27628	      -0.0018894	                 0	       0.36052	             0	       0.31984	       0.36732	               0	
   257	          0.83943	               0	        -0.46645	          1.2157	                 0	       0.51807	             0	       0.25983	       0.56915	               0	
   258	          0.55601	               0	        0.019036	         0.62148	                 0	       0.36466	             0	       0.20121	       0.30177	               0	
   259	          0.51145	               0	        -0.79786	           1.262	                 0	       0.56939	             0	        0.2694	       0.63504	               0	
   260	          -1.1693	               0	       -0.074556	         -1.2362	                 0	      0.035692	             0	       0.13419	       0.13297	               0	
   261	          -0.3393	               0	         -0.8514	         0.55232	                 0	      0.097303	             0	      0.092661	       0.12999	               0	
   262	          -0.4342	               0	        0.025593	         -0.3912	                 0	      0.047772	             0	       0.11673	       0.14607	               0	
   263	         -0.41784	               0	          0.8515	        -0.95914	                 0	      0.084084	             0	        0.1261	       0.11424	               0	
   264	         -0.95294	               0	        -0.32676	        -0.60876	                 0	      0.040995	             0	       0.16953	       0.15491	               0	
   265	         -0.67396	               0	         0.37907	         -1.0488	                 0	      0.046283	             0	       0.12331	       0.12703	               0	
   266	         -0.69763	               0	         0.43066	          -1.022	                 0	      0.040821	             0	       0.10631	       0.11582	               0	
   267	         -0.71971	               0	         0.34221	         -1.0149	                 0	      0.047528	             0	      0.097984	      0.092096	               0	
   268	          -1.0802	               0	        -0.73649	        -0.31892	                 0	      0.061314	             0	       0.15174	       0.14156	               0	
   269	          0.20021	               0	       -0.087292	         0.63343	                 0	        0.1175	             0	      0.086798	       0.17312	               0	
   270	           -0.539	               0	        -0.65113	        -0.29418	                 0	      0.045778	             0	      0.077222	      0.083997	               0	
   271	         -0.13516	               0	       -0.046852	       -0.067208	                 0	      0.049674	             0	      0.067341	      0.094575	               0	
   272	          -1.7487	               0	        -0.12333	         -1.6836	                 0	      0.052032	             0	       0.10913	      0.074207	               0	
   273	         -0.16125	               0	         0.62035	        -0.74823	                 0	      0.054917	             0	       0.16184	       0.17612	               0	
   274	         -0.68697	               0	         0.43354	          -1.097	                 0	      0.052067	             0	       0.22988	       0.23326	               0	
   275	          -0.6081	               0	         0.19676	        -0.90122	                 0	      0.037678	             0	       0.14387	       0.16361	               0	
   276	         -0.44058	               0	        -0.50504	          0.2634	                 0	      0.085589	             0	      0.064637	      0.098951	               0	
   277	         -0.24035	               0	        -0.33726	        0.036737	                 0	       0.13604	             0	      0.093467	        0.2004	               0	
   278	         -0.59874	               0	        -0.48314	       -0.035159	                 0	       0.18223	             0	       0.16265	       0.29339	               0	
   279	         -0.33325	               0	        -0.52472	        -0.11613	                 0	      0.078282	             0	      0.077499	       0.12002	               0	
   280	        -0.051207	               0	         0.13696	       -0.056788	                 0	       0.10875	             0	       0.10098	       0.20072	               0	
   281	        -0.098482	               0	        -0.23446	         0.27404	                 0	       0.19289	             0	      0.087174	       0.24674	               0	
   282	         -0.39891	               0	        -0.42852	        0.053016	                 0	       0.11406	             0	      0.099837	       0.17306	               0	
   283	         0.043517	               0	        -0.78865	          0.8357	                 0	       0.22615	             0	      0.071003	       0.24868	               0	
   284	           1.4635	               0	        -0.84804	          2.1831	                 0	       0.22021	             0	      0.069539	        0.2183	               0	
   285	         -0.69264	               0	        0.086466	        -0.78274	                 0	       0.07219	             0	       0.16479	       0.19081	               0	
   286	         -0.11751	               0	      -0.0090883	       -0.020336	                 0	       0.20569	             0	       0.13984	       0.31205	               0	
   287	         -0.28989	               0	         0.53587	        -0.76155	                 0	       0.08442	             0	       0.23862	       0.27848	               0	
   288	          0.11615	               0	         -1.5306	           1.288	                 0	       0.17908	             0	      0.097387	       0.18965	               0	
   289	          0.39364	               0	          -0.435	         0.78982	                 0	       0.34672	             0	      0.076576	       0.36688	               0	
   290	            1.119	               0	        -0.38397	          1.5812	                 0	       0.15661	             0	      0.080232	       0.17641	               0	
   291	          0.19845	               0	        0.021319	         0.38388	                 0	       0.16766	             0	      0.069651	       0.18486	               0	
   292	          -0.1305	               0	         0.36909	        -0.28715	                 0	       0.15767	             0	       0.29534	       0.44229	               0	
   293	          0.94241	               0	        -0.89782	          1.7757	                 0	       0.20226	             0	       0.11323	       0.21152	               0	
   294	            1.097	               0	        -0.80103	          1.8689	                 0	       0.14022	             0	       0.14173	       0.10538	               0	
   295	           1.3773	               0	        -0.25526	          1.7941	                 0	      0.083181	             0	      0.068272	      0.083505	               0	
   296	          0.68525	               0	        -0.37318	          1.2516	                 0	       0.33736	             0	      0.089431	       0.34385	               0	
   297	          0.71321	               0	        -0.74947	           1.411	                 0	       0.48026	             0	       0.12336	       0.50011	               0	
   298	            1.171	               0	        -0.74057	          1.8186	                 0	       0.38842	             0	       0.12492	       0.34716	               0	
   299	           1.6171	               0	        -0.26179	          1.9282	                 0	        0.2515	             0	       0.11235	       0.21853	               0	
   300	           1.1554	               0	        -0.81327	          1.8814	                 0	       0.47319	             0	       0.11798	       0.46307	               0	
   301	          0.88876	               0	        -0.63611	          1.6023	                 0	       0.38719	             0	       0.11792	       0.41974	               0	
   302	          0.35383	               0	        -0.93285	           0.779	                 0	       0.18259	             0	       0.10792	       0.18276	               0	
   303	           0.8292	               0	        -0.12774	          1.0916	                 0	       0.24051	             0	        0.1425	       0.25193	               0	
   304	           0.4934	               0	         -0.5897	         0.93052	                 0	       0.39138	             0	      0.090536	       0.38044	               0	
   305	          0.34439	               0	       -0.026543	         0.38206	                 0	       0.51847	             0	       0.20216	       0.62891	               0	
   306	          0.14352	               0	          0.6222	        -0.32052	                 0	       0.15713	             0	       0.17167	       0.29423	               0	
   307	          0.51021	               0	         -0.3886	          1.1624	                 0	       0.54812	             0	       0.19178	       0.54676	               0	
   308	          0.42808	               0	        -0.47493	         0.98661	                 0	       0.34143	             0	       0.19233	       0.33612	               0	
   309	           1.8419	               0	        -0.96228	          2.5985	                 0	       0.35916	             0	       0.18448	       0.39951	               0	
   310	         -0.14887	               0	         0.37605	        -0.41373	                 0	       0.24673	             0	       0.28321	       0.44387	               0	
   311	           1.1297	               0	        -0.43745	          1.6062	                 0	       0.40988	             0	       0.19537	       0.37999	               0	
   312	           1.5615	               0	          -1.015	          2.3674	                 0	       0.10304	             0	       0.19798	       0.15643	               0	
   313	        -0.046624	               0	        -0.33503	         0.33239	                 0	       0.58986	             0	       0.21708	       0.69022	               0	
   314	          0.52148	               0	        -0.76224	          1.0822	                 0	       0.44987	             0	       0.20341	       0.49091	               0	
   315	          0.98818	               0	        -0.89997	          1.8907	                 0	       0.52044	             0	       0.18406	       0.57251	               0	
   316	          0.35118	               0	        -0.25848	         0.76656	                 0	       0.41795	             0	       0.29639	       0.37921	               0	
   317	           1.6449	               0	         -1.2503	          2.6558	                 0	       0.32457	             0	       0.18148	       0.28721	               0	
   318	          0.18603	               0	         0.69632	        -0.49606	                 0	       0.13474	             0	       0.10879	       0.11177	               0	
   319	          0.48351	               0	         -1.4072	          1.5214	                 0	       0.30931	             0	       0.16624	       0.30191	               0	
   320	           1.2261	               0	         -1.3014	          2.2835	                 0	       0.17427	             0	       0.12535	        0.1653	               0	
   321	          0.67033	               0	         -1.5521	          2.0774	                 0	       0.21227	             0	       0.15144	       0.23261	               0	
   322	          0.62961	               0	         0.67303	       -0.067974	                 0	       0.11306	             0	        0.1503	       0.17582	               0	
   323	          0.58105	               0	        -0.72521	          1.2229	                 0	        0.3076	             0	       0.18209	        0.3116	               0	
   324	          -0.1273	               0	         0.73058	        -0.81896	                 0	       0.12755	             0	       0.11518	       0.14077	               0	
   325	          0.64862	               0	        -0.59722	          1.1754	                 0	       0.41164	             0	       0.31478	        0.3423	               0	
