    km_pop;   1.00000;       NaN;   0.04986;   0.74534;       NaN;   0.00000;       NaN;   0.00000;   0.00000;       NaN;   0.00000;   0.00000;   0.00000;   0.00000;   0.00000
    kp_pop;       NaN;       NaN;       NaN;       NaN;       NaN;       NaN;       NaN;       NaN;       NaN;       NaN;       NaN;       NaN;       NaN;       NaN;       NaN
    gp_pop;   0.04986;       NaN;   1.00000;  -0.58980;       NaN;   0.00000;       NaN;   0.00000;   0.00000;       NaN;   0.00000;   0.00000;   0.00000;   0.00000;   0.00000
    gm_pop;   0.74534;       NaN;  -0.58980;   1.00000;       NaN;   0.00000;       NaN;   0.00000;   0.00000;       NaN;   0.00000;   0.00000;   0.00000;   0.00000;   0.00000
  ltau_pop;       NaN;       NaN;       NaN;       NaN;       NaN;       NaN;       NaN;       NaN;       NaN;       NaN;       NaN;       NaN;       NaN;       NaN;       NaN
  omega_km;   0.00000;       NaN;   0.00000;   0.00000;       NaN;   1.00000;       NaN;   0.00099;   0.55353;       NaN;   0.03684;   0.50884;   0.41007;  -0.00218;  -0.00140
  omega_kp;       NaN;       NaN;       NaN;       NaN;       NaN;       NaN;       NaN;       NaN;       NaN;       NaN;       NaN;       NaN;       NaN;       NaN;       NaN
  omega_gp;   0.00000;       NaN;   0.00000;   0.00000;       NaN;  -0.00033;       NaN;   1.00000;   0.34039;       NaN;   0.02830;  -0.54105;  -0.43416;  -0.00049;  -0.00395
  omega_gm;   0.00000;       NaN;   0.00000;   0.00000;       NaN;   0.55503;       NaN;   0.34179;   1.00000;       NaN;  -0.66174;   0.49856;  -0.44743;  -0.00208;  -0.00326
omega_ltau;       NaN;       NaN;       NaN;       NaN;       NaN;       NaN;       NaN;       NaN;       NaN;       NaN;       NaN;       NaN;       NaN;       NaN;       NaN
corr_km_gp;   0.00000;       NaN;   0.00000;   0.00000;       NaN;   0.03415;       NaN;   0.02751;  -0.66366;       NaN;   1.00000;  -0.57437;   0.75864;   0.00095;   0.00078
corr_km_gm;   0.00000;       NaN;   0.00000;   0.00000;       NaN;   0.51146;       NaN;  -0.53983;   0.49993;       NaN;  -0.57346;   1.00000;   0.09196;  -0.00125;   0.00177
corr_gp_gm;   0.00000;       NaN;   0.00000;   0.00000;       NaN;   0.40891;       NaN;  -0.43421;  -0.44859;       NaN;   0.75923;   0.09099;   1.00000;   0.00023;   0.00217
         a;   0.00000;       NaN;   0.00000;   0.00000;       NaN;  -0.00218;       NaN;  -0.00050;  -0.00207;       NaN;   0.00094;  -0.00124;   0.00022;   1.00000;  -0.34543
         b;   0.00000;       NaN;   0.00000;   0.00000;       NaN;  -0.00140;       NaN;  -0.00396;  -0.00325;       NaN;   0.00077;   0.00178;   0.00217;  -0.34543;   1.00000
