    km_pop; 0.0013231251;-0.0000403437; 0.0012939553; 0.0000000000; 0.0000000000; 0.0000000000; 0.0000000000;-0.0000000000; 0.0000000000; 0.0000000000; 0.0000000000
    gp_pop;-0.0000403437; 0.0009389261;-0.0009339393; 0.0000000000; 0.0000000000; 0.0000000000; 0.0000000000;-0.0000000000; 0.0000000000; 0.0000000000; 0.0000000000
    gm_pop; 0.0012939553;-0.0009339393; 0.0022092121; 0.0000000000; 0.0000000000; 0.0000000000; 0.0000000000;-0.0000000000; 0.0000000000; 0.0000000000; 0.0000000000
  omega_km; 0.0000000000; 0.0000000000; 0.0000000000; 0.0006786769;-0.0000000018; 0.0005122318;-0.0000286646;-0.0000000121;-0.0000348662; 0.0003081033; 0.0003221763
  omega_gp; 0.0000000000; 0.0000000000; 0.0000000000;-0.0000000018; 0.0005137893; 0.0003242062;-0.0000124388;-0.0000000607;-0.0000372559;-0.0002488078;-0.0003688429
  omega_gm; 0.0000000000; 0.0000000000; 0.0000000000; 0.0005122318; 0.0003242062; 0.0011802941;-0.0000415076;-0.0000000538;-0.0013248559; 0.0003962831;-0.0005865203
         a; 0.0000000000; 0.0000000000; 0.0000000000;-0.0000286646;-0.0000124388;-0.0000415076; 0.3883583458;-0.0001162468; 0.0000251535;-0.0000105771; 0.0000079694
         b; 0.0000000000; 0.0000000000; 0.0000000000;-0.0000000121;-0.0000000607;-0.0000000538;-0.0001162468; 0.0000002474; 0.0000000051; 0.0000000313; 0.0000000421
corr_km_gp; 0.0000000000; 0.0000000000; 0.0000000000;-0.0000348662;-0.0000372559;-0.0013248559; 0.0000251535; 0.0000000051; 0.0032877269;-0.0008256631; 0.0015374216
corr_km_gm; 0.0000000000; 0.0000000000; 0.0000000000; 0.0003081033;-0.0002488078; 0.0003962831;-0.0000105771; 0.0000000313;-0.0008256631; 0.0005204879; 0.0000002683
corr_gp_gm; 0.0000000000; 0.0000000000; 0.0000000000; 0.0003221763;-0.0003688429;-0.0005865202; 0.0000079694; 0.0000000421; 0.0015374216; 0.0000002683; 0.0012064051
