    km_pop;   1.00000;       NaN;  -0.17269;   0.74373;       NaN;   0.00000;       NaN;   0.00000;   0.00000;       NaN;   0.00000;   0.00000;   0.00000;   0.00000;   0.00000
    kp_pop;       NaN;       NaN;       NaN;       NaN;       NaN;       NaN;       NaN;       NaN;       NaN;       NaN;       NaN;       NaN;       NaN;       NaN;       NaN
    gp_pop;  -0.17269;       NaN;   1.00000;  -0.76918;       NaN;   0.00000;       NaN;   0.00000;   0.00000;       NaN;   0.00000;   0.00000;   0.00000;   0.00000;   0.00000
    gm_pop;   0.74373;       NaN;  -0.76918;   1.00000;       NaN;   0.00000;       NaN;   0.00000;   0.00000;       NaN;   0.00000;   0.00000;   0.00000;   0.00000;   0.00000
  ltau_pop;       NaN;       NaN;       NaN;       NaN;       NaN;       NaN;       NaN;       NaN;       NaN;       NaN;       NaN;       NaN;       NaN;       NaN;       NaN
  omega_km;   0.00000;       NaN;   0.00000;   0.00000;       NaN;   1.00000;       NaN;   0.02981;   0.55315;       NaN;  -0.12186;   0.52409;   0.33059;  -0.00017;  -0.00011
  omega_kp;       NaN;       NaN;       NaN;       NaN;       NaN;       NaN;       NaN;       NaN;       NaN;       NaN;       NaN;       NaN;       NaN;       NaN;       NaN
  omega_gp;   0.00000;       NaN;   0.00000;   0.00000;       NaN;   0.02981;       NaN;   1.00000;   0.59158;       NaN;  -0.12144;  -0.31594;  -0.54596;  -0.00010;  -0.00045
  omega_gm;   0.00000;       NaN;   0.00000;   0.00000;       NaN;   0.55315;       NaN;   0.59158;   1.00000;       NaN;  -0.68943;   0.52137;  -0.54516;  -0.00028;  -0.00050
omega_ltau;       NaN;       NaN;       NaN;       NaN;       NaN;       NaN;       NaN;       NaN;       NaN;       NaN;       NaN;       NaN;       NaN;       NaN;       NaN
corr_km_gp;   0.00000;       NaN;   0.00000;   0.00000;       NaN;  -0.12186;       NaN;  -0.12144;  -0.68943;       NaN;   1.00000;  -0.76412;   0.73917;   0.00004;  -0.00007
corr_km_gm;   0.00000;       NaN;   0.00000;   0.00000;       NaN;   0.52409;       NaN;  -0.31594;   0.52137;       NaN;  -0.76412;   1.00000;  -0.13302;  -0.00003;   0.00049
corr_gp_gm;   0.00000;       NaN;   0.00000;   0.00000;       NaN;   0.33059;       NaN;  -0.54596;  -0.54516;       NaN;   0.73917;  -0.13302;   1.00000;  -0.00001;   0.00026
         a;   0.00000;       NaN;   0.00000;   0.00000;       NaN;  -0.00017;       NaN;  -0.00010;  -0.00028;       NaN;   0.00004;  -0.00003;  -0.00001;   1.00000;  -0.35917
         b;   0.00000;       NaN;   0.00000;   0.00000;       NaN;  -0.00011;       NaN;  -0.00045;  -0.00050;       NaN;  -0.00007;   0.00049;   0.00026;  -0.35917;   1.00000
