    km_pop; 0.0012559878;-0.0000444952; 0.0011813286; 0.0000000000; 0.0000000000; 0.0000000000; 0.0000000000;-0.0000000000; 0.0000000000; 0.0000000000; 0.0000000000
    gp_pop;-0.0000444952; 0.0009338453;-0.0009343972; 0.0000000000; 0.0000000000; 0.0000000000; 0.0000000000;-0.0000000000; 0.0000000000; 0.0000000000; 0.0000000000
    gm_pop; 0.0011813286;-0.0009343972; 0.0020628462; 0.0000000000; 0.0000000000; 0.0000000000; 0.0000000000;-0.0000000000; 0.0000000000; 0.0000000000; 0.0000000000
  omega_km; 0.0000000000; 0.0000000000; 0.0000000000; 0.0006466761; 0.0000001740; 0.0004551952;-0.0000327918;-0.0000000132;-0.0000404093; 0.0003216360; 0.0003034919
  omega_gp; 0.0000000000; 0.0000000000; 0.0000000000; 0.0000001740; 0.0005071826; 0.0003359149;-0.0000115482;-0.0000000558;-0.0000439599;-0.0002526386;-0.0003583338
  omega_gm; 0.0000000000; 0.0000000000; 0.0000000000; 0.0004551952; 0.0003359149; 0.0011060115;-0.0000464320;-0.0000000528;-0.0012864213; 0.0004116202;-0.0005497441
         a; 0.0000000000; 0.0000000000; 0.0000000000;-0.0000327918;-0.0000115482;-0.0000464320; 0.3854845120;-0.0001177670; 0.0000308913;-0.0000178514; 0.0000049269
         b; 0.0000000000; 0.0000000000; 0.0000000000;-0.0000000132;-0.0000000558;-0.0000000528;-0.0001177670; 0.0000002432; 0.0000000079; 0.0000000268; 0.0000000363
corr_km_gp; 0.0000000000; 0.0000000000; 0.0000000000;-0.0000404093;-0.0000439599;-0.0012864213; 0.0000308913; 0.0000000079; 0.0032736462;-0.0009367022; 0.0013997292
corr_km_gm; 0.0000000000; 0.0000000000; 0.0000000000; 0.0003216360;-0.0002526386; 0.0004116202;-0.0000178514; 0.0000000268;-0.0009367022; 0.0006202288; 0.0000011148
corr_gp_gm; 0.0000000000; 0.0000000000; 0.0000000000; 0.0003034919;-0.0003583338;-0.0005497441; 0.0000049269; 0.0000000363; 0.0013997292; 0.0000011148; 0.0010698058
