    km_pop; 0.0050137895;-0.0008965287; 0.0044776202; 0.0000000000; 0.0000000000; 0.0000000000; 0.0000000000;-0.0000000000; 0.0000000000; 0.0000000000; 0.0000000000
    gp_pop;-0.0008965287; 0.0053759031;-0.0047951651; 0.0000000000; 0.0000000000; 0.0000000000; 0.0000000000;-0.0000000000; 0.0000000000; 0.0000000000; 0.0000000000
    gm_pop; 0.0044776202;-0.0047951651; 0.0072293497; 0.0000000000; 0.0000000000; 0.0000000000; 0.0000000000;-0.0000000000; 0.0000000000; 0.0000000000; 0.0000000000
  omega_km; 0.0000000000; 0.0000000000; 0.0000000000; 0.0025129781; 0.0000777333; 0.0016737919;-0.0000032005;-0.0000000017;-0.0008418078; 0.0016627087; 0.0009658641
  omega_gp; 0.0000000000; 0.0000000000; 0.0000000000; 0.0000777333; 0.0027052102; 0.0018572967;-0.0000019493;-0.0000000074;-0.0008704453;-0.0010399878;-0.0016550065
  omega_gm; 0.0000000000; 0.0000000000; 0.0000000000; 0.0016737919; 0.0018572967; 0.0036436359;-0.0000063429;-0.0000000094;-0.0057349004; 0.0019917424;-0.0019178962
         a; 0.0000000000; 0.0000000000; 0.0000000000;-0.0000032005;-0.0000019493;-0.0000063429; 0.1388305677;-0.0000417714; 0.0000020038;-0.0000005898;-0.0000002478
         b; 0.0000000000; 0.0000000000; 0.0000000000;-0.0000000017;-0.0000000074;-0.0000000094;-0.0000417714; 0.0000000974;-0.0000000029; 0.0000000096; 0.0000000048
corr_km_gp; 0.0000000000; 0.0000000000; 0.0000000000;-0.0008418078;-0.0008704453;-0.0057349004; 0.0000020038;-0.0000000029; 0.0189905037;-0.0066642363; 0.0059367786
corr_km_gm; 0.0000000000; 0.0000000000; 0.0000000000; 0.0016627087;-0.0010399878; 0.0019917424;-0.0000005898; 0.0000000096;-0.0066642363; 0.0040053113;-0.0004906318
corr_gp_gm; 0.0000000000; 0.0000000000; 0.0000000000; 0.0009658641;-0.0016550065;-0.0019178962;-0.0000002478; 0.0000000048; 0.0059367786;-0.0004906318; 0.0033968168
