    km_pop;   1.00000;       NaN;   0.00891;   0.70946;       NaN;   0.00000;       NaN;   0.00000;   0.00000;       NaN;   0.00000;   0.00000;   0.00000;   0.00000;   0.00000
    kp_pop;       NaN;       NaN;       NaN;       NaN;       NaN;       NaN;       NaN;       NaN;       NaN;       NaN;       NaN;       NaN;       NaN;       NaN;       NaN
    gp_pop;   0.00891;       NaN;   1.00000;  -0.65259;       NaN;   0.00000;       NaN;   0.00000;   0.00000;       NaN;   0.00000;   0.00000;   0.00000;   0.00000;   0.00000
    gm_pop;   0.70946;       NaN;  -0.65259;   1.00000;       NaN;   0.00000;       NaN;   0.00000;   0.00000;       NaN;   0.00000;   0.00000;   0.00000;   0.00000;   0.00000
  ltau_pop;       NaN;       NaN;       NaN;       NaN;       NaN;       NaN;       NaN;       NaN;       NaN;       NaN;       NaN;       NaN;       NaN;       NaN;       NaN
  omega_km;   0.00000;       NaN;   0.00000;   0.00000;       NaN;   1.00000;       NaN;  -0.00153;   0.50231;       NaN;   0.00633;   0.49202;   0.39668;  -0.00267;  -0.00135
  omega_kp;       NaN;       NaN;       NaN;       NaN;       NaN;       NaN;       NaN;       NaN;       NaN;       NaN;       NaN;       NaN;       NaN;       NaN;       NaN
  omega_gp;   0.00000;       NaN;   0.00000;   0.00000;       NaN;  -0.00154;       NaN;   1.00000;   0.42041;       NaN;  -0.00149;  -0.46729;  -0.47671;  -0.00067;  -0.00455
  omega_gm;   0.00000;       NaN;   0.00000;   0.00000;       NaN;   0.50231;       NaN;   0.42042;   1.00000;       NaN;  -0.66863;   0.48392;  -0.48821;  -0.00245;  -0.00348
omega_ltau;       NaN;       NaN;       NaN;       NaN;       NaN;       NaN;       NaN;       NaN;       NaN;       NaN;       NaN;       NaN;       NaN;       NaN;       NaN
corr_km_gp;   0.00000;       NaN;   0.00000;   0.00000;       NaN;   0.00633;       NaN;  -0.00149;  -0.66863;       NaN;   1.00000;  -0.63971;   0.72199;   0.00105;   0.00063
corr_km_gm;   0.00000;       NaN;   0.00000;   0.00000;       NaN;   0.49203;       NaN;  -0.46729;   0.48392;       NaN;  -0.63971;   1.00000;   0.05950;  -0.00156;   0.00178
corr_gp_gm;   0.00000;       NaN;   0.00000;   0.00000;       NaN;   0.39668;       NaN;  -0.47671;  -0.48821;       NaN;   0.72199;   0.05950;   1.00000;   0.00010;   0.00233
         a;   0.00000;       NaN;   0.00000;   0.00000;       NaN;  -0.00267;       NaN;  -0.00067;  -0.00245;       NaN;   0.00105;  -0.00156;   0.00010;   1.00000;  -0.36920
         b;   0.00000;       NaN;   0.00000;   0.00000;       NaN;  -0.00135;       NaN;  -0.00455;  -0.00348;       NaN;   0.00063;   0.00178;   0.00233;  -0.36920;   1.00000
