    km_pop;   1.00000;       NaN;  -0.00649;   0.75653;       NaN;   0.00000;       NaN;   0.00000;   0.00000;       NaN;   0.00000;   0.00000;   0.00000;   0.00000;   0.00000
    kp_pop;       NaN;       NaN;       NaN;       NaN;       NaN;       NaN;       NaN;       NaN;       NaN;       NaN;       NaN;       NaN;       NaN;       NaN;       NaN
    gp_pop;  -0.00649;       NaN;   1.00000;  -0.62648;       NaN;   0.00000;       NaN;   0.00000;   0.00000;       NaN;   0.00000;   0.00000;   0.00000;   0.00000;   0.00000
    gm_pop;   0.75653;       NaN;  -0.62648;   1.00000;       NaN;   0.00000;       NaN;   0.00000;   0.00000;       NaN;   0.00000;   0.00000;   0.00000;   0.00000;   0.00000
  ltau_pop;       NaN;       NaN;       NaN;       NaN;       NaN;       NaN;       NaN;       NaN;       NaN;       NaN;       NaN;       NaN;       NaN;       NaN;       NaN
  omega_km;   0.00000;       NaN;   0.00000;   0.00000;       NaN;   1.00000;       NaN;  -0.00091;   0.57204;       NaN;  -0.00559;   0.52336;   0.37519;  -0.00166;  -0.00082
  omega_kp;       NaN;       NaN;       NaN;       NaN;       NaN;       NaN;       NaN;       NaN;       NaN;       NaN;       NaN;       NaN;       NaN;       NaN;       NaN
  omega_gp;   0.00000;       NaN;   0.00000;   0.00000;       NaN;  -0.00091;       NaN;   1.00000;   0.38817;       NaN;  -0.01126;  -0.50476;  -0.45484;  -0.00093;  -0.00554
  omega_gm;   0.00000;       NaN;   0.00000;   0.00000;       NaN;   0.57204;       NaN;   0.38817;   1.00000;       NaN;  -0.67191;   0.50812;  -0.47552;  -0.00210;  -0.00325
omega_ltau;       NaN;       NaN;       NaN;       NaN;       NaN;       NaN;       NaN;       NaN;       NaN;       NaN;       NaN;       NaN;       NaN;       NaN;       NaN
corr_km_gp;   0.00000;       NaN;   0.00000;   0.00000;       NaN;  -0.00559;       NaN;  -0.01126;  -0.67191;       NaN;   1.00000;  -0.60792;   0.77095;   0.00090;   0.00046
corr_km_gm;   0.00000;       NaN;   0.00000;   0.00000;       NaN;   0.52336;       NaN;  -0.50476;   0.50812;       NaN;  -0.60792;   1.00000;   0.03183;  -0.00085;   0.00264
corr_gp_gm;   0.00000;       NaN;   0.00000;   0.00000;       NaN;   0.37519;       NaN;  -0.45484;  -0.47552;       NaN;   0.77095;   0.03183;   1.00000;   0.00052;   0.00267
         a;   0.00000;       NaN;   0.00000;   0.00000;       NaN;  -0.00166;       NaN;  -0.00093;  -0.00210;       NaN;   0.00090;  -0.00085;   0.00052;   1.00000;  -0.38343
         b;   0.00000;       NaN;   0.00000;   0.00000;       NaN;  -0.00082;       NaN;  -0.00554;  -0.00325;       NaN;   0.00046;   0.00264;   0.00267;  -0.38343;   1.00000
