    km_pop;   1.00000;       NaN;  -0.06158;   0.73639;       NaN;   0.00000;       NaN;   0.00000;   0.00000;       NaN;   0.00000;   0.00000;   0.00000;   0.00000;   0.00000
    kp_pop;       NaN;       NaN;       NaN;       NaN;       NaN;       NaN;       NaN;       NaN;       NaN;       NaN;       NaN;       NaN;       NaN;       NaN;       NaN
    gp_pop;  -0.06158;       NaN;   1.00000;  -0.66787;       NaN;   0.00000;       NaN;   0.00000;   0.00000;       NaN;   0.00000;   0.00000;   0.00000;   0.00000;   0.00000
    gm_pop;   0.73639;       NaN;  -0.66787;   1.00000;       NaN;   0.00000;       NaN;   0.00000;   0.00000;       NaN;   0.00000;   0.00000;   0.00000;   0.00000;   0.00000
  ltau_pop;       NaN;       NaN;       NaN;       NaN;       NaN;       NaN;       NaN;       NaN;       NaN;       NaN;       NaN;       NaN;       NaN;       NaN;       NaN
  omega_km;   0.00000;       NaN;   0.00000;   0.00000;       NaN;   1.00000;       NaN;   0.00374;   0.54242;       NaN;  -0.04286;   0.51601;   0.34463;  -0.00007;  -0.00008
  omega_kp;       NaN;       NaN;       NaN;       NaN;       NaN;       NaN;       NaN;       NaN;       NaN;       NaN;       NaN;       NaN;       NaN;       NaN;       NaN
  omega_gp;   0.00000;       NaN;   0.00000;   0.00000;       NaN;   0.00374;       NaN;   1.00000;   0.44554;       NaN;  -0.04264;  -0.39447;  -0.47714;  -0.00024;  -0.00102
  omega_gm;   0.00000;       NaN;   0.00000;   0.00000;       NaN;   0.54242;       NaN;   0.44554;   1.00000;       NaN;  -0.65464;   0.51050;  -0.47788;  -0.00037;  -0.00090
omega_ltau;       NaN;       NaN;       NaN;       NaN;       NaN;       NaN;       NaN;       NaN;       NaN;       NaN;       NaN;       NaN;       NaN;       NaN;       NaN
corr_km_gp;   0.00000;       NaN;   0.00000;   0.00000;       NaN;  -0.04286;       NaN;  -0.04264;  -0.65464;       NaN;   1.00000;  -0.66025;   0.73444;   0.00005;  -0.00012
corr_km_gm;   0.00000;       NaN;   0.00000;   0.00000;       NaN;   0.51601;       NaN;  -0.39447;   0.51050;       NaN;  -0.66025;   1.00000;   0.00967;   0.00018;   0.00109
corr_gp_gm;   0.00000;       NaN;   0.00000;   0.00000;       NaN;   0.34463;       NaN;  -0.47714;  -0.47788;       NaN;   0.73444;   0.00967;   1.00000;   0.00020;   0.00072
         a;   0.00000;       NaN;   0.00000;   0.00000;       NaN;  -0.00007;       NaN;  -0.00024;  -0.00037;       NaN;   0.00005;   0.00018;   0.00020;   1.00000;  -0.36948
         b;   0.00000;       NaN;   0.00000;   0.00000;       NaN;  -0.00008;       NaN;  -0.00102;  -0.00090;       NaN;  -0.00012;   0.00109;   0.00072;  -0.36948;   1.00000
