    km_pop; 0.0013624111;-0.0001069177; 0.0013545916; 0.0000000000; 0.0000000000; 0.0000000000; 0.0000000000;-0.0000000000; 0.0000000000; 0.0000000000; 0.0000000000
    gp_pop;-0.0001069177; 0.0008996866;-0.0009935634; 0.0000000000; 0.0000000000; 0.0000000000; 0.0000000000;-0.0000000000; 0.0000000000; 0.0000000000; 0.0000000000
    gm_pop; 0.0013545916;-0.0009935634; 0.0023318766; 0.0000000000; 0.0000000000; 0.0000000000; 0.0000000000;-0.0000000000; 0.0000000000; 0.0000000000; 0.0000000000
  omega_km; 0.0000000000; 0.0000000000; 0.0000000000; 0.0007250159; 0.0000030490; 0.0005571726;-0.0000295330;-0.0000000558;-0.0001002223; 0.0003238027; 0.0002676346
  omega_gp; 0.0000000000; 0.0000000000; 0.0000000000; 0.0000030474; 0.0005175058; 0.0003835614;-0.0000144810;-0.0000001074;-0.0000845142;-0.0002163054;-0.0003553047
  omega_gm; 0.0000000000; 0.0000000000; 0.0000000000; 0.0005571689; 0.0003835628; 0.0012871469;-0.0000442253;-0.0000001096;-0.0014374327; 0.0004313289;-0.0006072424
         a; 0.0000000000; 0.0000000000; 0.0000000000;-0.0000295329;-0.0000144810;-0.0000442254; 0.4441080588;-0.0001320019; 0.0000303114;-0.0000121604; 0.0000100208
         b; 0.0000000000; 0.0000000000; 0.0000000000;-0.0000000558;-0.0000001074;-0.0000001096;-0.0001320019; 0.0000002597;-0.0000000239; 0.0000000357; 0.0000000297
corr_km_gp; 0.0000000000; 0.0000000000; 0.0000000000;-0.0001002164;-0.0000845147;-0.0014374289; 0.0000303112;-0.0000000239; 0.0036289451;-0.0009615718; 0.0015344692
corr_km_gm; 0.0000000000; 0.0000000000; 0.0000000000; 0.0003238019;-0.0002163046; 0.0004313302;-0.0000121604; 0.0000000357;-0.0009615746; 0.0005482176;-0.0000633121
corr_gp_gm; 0.0000000000; 0.0000000000; 0.0000000000; 0.0002676381;-0.0003553042;-0.0006072382; 0.0000100206; 0.0000000297; 0.0015344661;-0.0000633100; 0.0010649038
