    km_pop; 0.0014127213;-0.0000839947; 0.0013988242; 0.0000000000; 0.0000000000; 0.0000000000; 0.0000000000;-0.0000000000; 0.0000000000; 0.0000000000; 0.0000000000
    gp_pop;-0.0000839947; 0.0010334599;-0.0010994803; 0.0000000000; 0.0000000000; 0.0000000000; 0.0000000000;-0.0000000000; 0.0000000000; 0.0000000000; 0.0000000000
    gm_pop; 0.0013988242;-0.0010994803; 0.0024818527; 0.0000000000; 0.0000000000; 0.0000000000; 0.0000000000;-0.0000000000; 0.0000000000; 0.0000000000; 0.0000000000
  omega_km; 0.0000000000; 0.0000000000; 0.0000000000; 0.0007727098; 0.0000015085; 0.0006163962;-0.0000468071;-0.0000002925;-0.0001379265; 0.0003760646; 0.0003276737
  omega_gp; 0.0000000000; 0.0000000000; 0.0000000000; 0.0000015085; 0.0007104262; 0.0004896794;-0.0000201510;-0.0000008502;-0.0001657220;-0.0003307332;-0.0005934614
  omega_gm; 0.0000000000; 0.0000000000; 0.0000000000; 0.0006163962; 0.0004896794; 0.0015981694;-0.0000900973;-0.0000009210;-0.0019923028; 0.0004828396;-0.0010198436
         a; 0.0000000000; 0.0000000000; 0.0000000000;-0.0000468071;-0.0000201510;-0.0000900973; 0.2256757504;-0.0000877897; 0.0001005612;-0.0000328929; 0.0000417567
         b; 0.0000000000; 0.0000000000; 0.0000000000;-0.0000002925;-0.0000008502;-0.0000009210;-0.0000877897; 0.0000022752; 0.0000004812; 0.0000001554; 0.0000005770
corr_km_gp; 0.0000000000; 0.0000000000; 0.0000000000;-0.0001379265;-0.0001657220;-0.0019923028; 0.0001005612; 0.0000004812; 0.0048360468;-0.0011236982; 0.0023909710
corr_km_gm; 0.0000000000; 0.0000000000; 0.0000000000; 0.0003760646;-0.0003307332; 0.0004828396;-0.0000328929; 0.0000001554;-0.0011236982; 0.0006712529;-0.0000328408
corr_gp_gm; 0.0000000000; 0.0000000000; 0.0000000000; 0.0003276737;-0.0005934614;-0.0010198436; 0.0000417567; 0.0000005770; 0.0023909710;-0.0000328408; 0.0018623090
