    km_pop;   1.00000;       NaN;  -0.13449;   0.72829;       NaN;   0.00000;       NaN;   0.00000;   0.00000;       NaN;   0.00000;   0.00000;   0.00000;   0.00000;   0.00000
    kp_pop;       NaN;       NaN;       NaN;       NaN;       NaN;       NaN;       NaN;       NaN;       NaN;       NaN;       NaN;       NaN;       NaN;       NaN;       NaN
    gp_pop;  -0.13449;       NaN;   1.00000;  -0.75079;       NaN;   0.00000;       NaN;   0.00000;   0.00000;       NaN;   0.00000;   0.00000;   0.00000;   0.00000;   0.00000
    gm_pop;   0.72829;       NaN;  -0.75079;   1.00000;       NaN;   0.00000;       NaN;   0.00000;   0.00000;       NaN;   0.00000;   0.00000;   0.00000;   0.00000;   0.00000
  ltau_pop;       NaN;       NaN;       NaN;       NaN;       NaN;       NaN;       NaN;       NaN;       NaN;       NaN;       NaN;       NaN;       NaN;       NaN;       NaN
  omega_km;   0.00000;       NaN;   0.00000;   0.00000;       NaN;   1.00000;       NaN;   0.00752;   0.50414;       NaN;  -0.12281;   0.51565;   0.20267;  -0.00529;  -0.02276
  omega_kp;       NaN;       NaN;       NaN;       NaN;       NaN;       NaN;       NaN;       NaN;       NaN;       NaN;       NaN;       NaN;       NaN;       NaN;       NaN
  omega_gp;   0.00000;       NaN;   0.00000;   0.00000;       NaN;   0.00752;       NaN;   1.00000;   0.54355;       NaN;  -0.15799;  -0.41439;  -0.56965;  -0.00118;  -0.02926
  omega_gm;   0.00000;       NaN;   0.00000;   0.00000;       NaN;   0.50414;       NaN;   0.54355;   1.00000;       NaN;  -0.75840;   0.45105;  -0.69079;  -0.00547;  -0.02768
omega_ltau;       NaN;       NaN;       NaN;       NaN;       NaN;       NaN;       NaN;       NaN;       NaN;       NaN;       NaN;       NaN;       NaN;       NaN;       NaN
corr_km_gp;   0.00000;       NaN;   0.00000;   0.00000;       NaN;  -0.12281;       NaN;  -0.15799;  -0.75840;       NaN;   1.00000;  -0.67084;   0.80952;   0.00370;   0.00476
corr_km_gm;   0.00000;       NaN;   0.00000;   0.00000;       NaN;   0.51565;       NaN;  -0.41439;   0.45105;       NaN;  -0.67084;   1.00000;  -0.11258;  -0.00427;   0.00039
corr_gp_gm;   0.00000;       NaN;   0.00000;   0.00000;       NaN;   0.20267;       NaN;  -0.56965;  -0.69079;       NaN;   0.80952;  -0.11258;   1.00000;   0.00186;   0.00598
         a;   0.00000;       NaN;   0.00000;   0.00000;       NaN;  -0.00529;       NaN;  -0.00118;  -0.00547;       NaN;   0.00370;  -0.00427;   0.00186;   1.00000;  -0.05092
         b;   0.00000;       NaN;   0.00000;   0.00000;       NaN;  -0.02276;       NaN;  -0.02926;  -0.02768;       NaN;   0.00476;   0.00039;   0.00598;  -0.05092;   1.00000
