    Kss1--Tec1[c], r133: Kss1_ppi_Tec1[c]
    r56: Hog1_ppi_Sko1[n], Hog1--Sko1[n]
    Mlp1--Rlm1[c], r13: Mlp1_ppi_Rlm1[c]
    Mid2[CyT]--Zeo1, r10: Mid2[CyT]_ppi_Zeo1
    Mkk1--Pkc1, r11: Mkk1_ppi_Pkc1
    Pkc1[HR1]--Rho1, r18: Pkc1[HR1]_ppi_Rho1
    Rlm1--Smp1, r23: Rlm1_ppi_Smp1
    Pbs2[KD]--Ssk2[KD], r66: Pbs2[KD]_ppi_Ssk2[KD]
    Kss1--Msg5[n], r159: Kss1_ppi_Msg5[n]
    r121: Fus3_ppi_Ste5[MAPK], Fus3--Ste5[MAPK]
    Fus3--Tec1[n], r125: Fus3_ppi_Tec1[n]
    r180: Gpa1[BD:Rec]_g:ppi_Ste3[CyT], Gpa1[BD:Rec]--Ste3[CyT]
    Dig1[Dsite]--Kss1[CD/7m], r106: Dig1[Dsite]_ppi_Kss1[CD/7m]
    r60: Nbp2[SH3]_ppi_Ste20[PR], Nbp2[SH3]--Ste20[PR]
    r22: Rlm1[c]_ppi_Slt2, Rlm1[c]--Slt2
    Rho1--Ste4, r21: Rho1_ppi_Ste4
    r111: Far1[n/BD:Fus3]_ppi_Fus3[CD], Far1[n/BD:Fus3]--Fus3[CD]
    r103: Cdc24_ppi_Ste5[c], Cdc24--Ste5[c]
    r181: Kss1_g:ppi_Ste5[MAPK], Kss1--Ste5[MAPK]
    r75: Sho1[CyT]_ppi_Ste50[m], Sho1[CyT]--Ste50[m]
    r79: Sln1[RR]_ppi_Ypd1, Sln1[RR]--Ypd1
    Ste5--Ste20, r146: Ste5_ppi_Ste20
    Hog1--Smp1, r57: Hog1_ppi_Smp1
    r109: Dig2[Dsite]_ppi_Kss1[CD/7m], Dig2[Dsite]--Kss1[CD/7m]
    r108: Dig2[Dsite]_ppi_Fus3[CD/7m], Dig2[Dsite]--Fus3[CD/7m]
    Dig1[Dsite]--Fus3[CD/7m], r105: Dig1[Dsite]_ppi_Fus3[CD/7m]
    Ste2[TMD]--Ste2[TMD], r171: Ste2[TMD]_ppi_Ste2[TMD]
    r179: Ste3[CyT]_g:ppi_Sst2[n/DEP], Ste3[CyT]--Sst2[n/DEP]
    Hog1[CD]--Rck2[c], r50: Hog1[CD]_ppi_Rck2[c]
    r52: Hog1_ppi_Sic1, Hog1--Sic1
