Rv0795
Rv0796
Rv0833
Rv1067c
Rv1369c
Rv1370c
Rv1525
Rv1756c
Rv1757c
Rv1763
Rv1764
Rv2105
Rv2106
Rv2167c
Rv2168c
Rv2278
Rv2279
Rv2354
Rv2355
Rv2479c
Rv2480c
Rv2645
Rv2646
Rv2647
Rv2648
Rv2649
Rv2650c
Rv2651c
Rv2652c
Rv2653c
Rv2654c
Rv2655c
Rv2656c
Rv2657c
Rv2658c
Rv2659c
Rv3018A
Rv3019c
Rv3020c
Rv3021c
Rv3184
Rv3185
Rv3186
Rv3187
Rv3325
Rv3326
Rv3380c
Rv3381c
Rv3474
Rv3475
