scl,C05778
r1p,C00620
uGgla,C04702
lald__L,C00424;C05999
4ampm,C04556
ppcoa,C00100
frdp,C00448
sucorn,C03415
ocdcea,C00712
dttOX,C01119
4abut,C00334
3c2hmp,C04411
ahdt,C04895
urea,C00086
dhpt,C00921
trdrd,C00342
udpgal,C00052
cyan,C00177;C01326
udpgalfur,C03733
fad,C00016
fald,C00067
gua,C00242
tre,C01083
2c25dho,C01278
5aizc,C04751
focytc,C00924
dmlz,C04332
adfdOX,C00667
5caiz,C15667
cmp,C00055
alpro,C01242
3c3hmp,C02504
3mop,C00671;C03465;C06008
ddca,C02679
26dap__M,C00680
agdpcbi,C06510
xu5p__D,C00231
2dr1p,C00672
mcbts,C12216
prbamp,C02741
dhnpt,C04874
fdxrd,C00138
co1dam,C06505
glc__D,C00031
acg5sa,C01250
pre8,C06408
dgtp,C00286
dtbt,C01909
mi4p__D,C03546
no2,C00088
fpram,C04640
uama,C01212
ctp,C00063
5fthf,C03479
k,C00238
stcoa,C00412
db4p,C15556
dcdp,C00705
glx,C00048
gly,C00037
uamr,C01050
pre2,C02463
akg,C00026
arab__D,C00216
dttp,C00459
aps,C00224
dcyt,C00881
ppp9,C02191
applp,C04122;C04126
pser__L,C01005
rbl__L,C00310;C00508
ocdca,C01530
pydx,C00250
glucys,C00669
ca2,C00076
dcamp,C03794
acgam6p,C00357
dudp,C01346
sucbz,C02730
1pyr5c,C03912;C04322
msa,C00222;C12069
adcobdam,C06506
gdpfuc,C00325
decdp,C17432
acgam,C00140
man1p,C00636
2mecdp,C11453
4pasp,C03082
copre6,C11542
pre6b,C06319
malt,C00208
dmpp,C00235
xylu__D,C00310;C00508
pro__L,C00148
fe2,C14818
fe3,C14819
trnaglu,C01641
pre5,C06416
pre4,C06407
phom,C01102
3mob,C00141
phthr,C06055
o2s,C00704
pmtcoa,C00154
gcald,C00266
dgsn,C00330
fmettrna,C03294
actp,C00227
cgly,C01419
gdpmann,C00096
pppi,C00536
mal__L,C00149
g1p,C00103
4hbz,C00156
ptcys,C04079
datp,C00131
ficytc,C00923
succ,C00042
rbl__D,C00309;C08354
4ppan,C03492
man,C00159
gln__L,C00064
2cpr5p,C01302
4hba,C17467
enter,C05821
4mop,C00233
forcoa,C00798
man6p,C00275
ametam,C01137
uaaGgla,C05893
itp,C00081
no3,C00244
h2o2,C00027
gtp,C00044
imp,C00130
dpcoa,C00882
octa,C06423
pram,C03090
pran,C04302
5aprbu,C04454
nadh,C00004
rib__D,C00121
5aop,C00430
din,C05512
arach,C06425
4per,C03393
2mahmp,C04752
uaccg,C04631
nadp,C00006
dtdprmn,C03319
alatrna,C00886
malACP,C01209
mi1p__D,C01177
thymd,C00214
citr__L,C00327
eig3p,C04666
fgam,C04376
hom__L,C00263
glu5sa,C01165
iasp,C05840
skm,C00493
5prdmbz,C04778
mppp9,C03516
sl2a6o,C04462;C05537
cytd,C00475;C02961
2dglcn,C02782
sucsal,C00232
uAgla,C04702
pheme,C00032
4hthr,C06056
apoACP,C03688
xyl__D,C00181
2dhp,C00966
6hmhptpp,C04807
orn,C00077;C01602
acorn,C00437
pydam,C00534
uaaGgtla,C05894
pacald,C00601
4mhetz,C04294
sdhlam,C01169
acgam1p,C04256;C04501
prfp,C04896
atp,C00002
adfdRD,C00662
hgbyr,C06399
ttdca,C06424
gdptp,C04494
ppal,C00479
glyc__R,C00258
4mpetz,C04327
selcys,C05688
fmn,C00061
3c4mop,C04236
orot,C00295
arab__L,C00259
peamn,C05332
glyb,C00719
glyc,C00116
dad_2,C00559
methf,C00445
indpyr,C00331
2obut,C00109
aspsa,C00441
2dda7p,C04691
4abz,C00568
udp,C00015
hxan,C00262
dhor__S,C00337
ru5p__D,C00199
dnad,C00857
ru5p__L,C01101
thym,C00178
25aics,C04823
adocbi,C06508
uAgl,C04700
adocbl,C00194
co2dam,C06504
sucglu,C05931
dann,C01037
tres,C20985
histd,C00860
dtt,C00265
hpglu,C04144
5mthf,C00440
bhb,C01089
hco3,C00288;C01353
glu1sa,C03741
fprica,C04734
cpppg3,C03263
cpppg1,C05768
seln,C01528
sucgsa,C05932
dhlam,C00579
2ippm,C02631
phe__L,C00079
unaga,C01289
4ppcys,C04352
adhlam,C01136
5oxpro,C01879
ptrc,C00134
mlthf,C00143
achms,C01077
pyr,C00022
ahcys,C00021
uamag,C00692
dscl,C02463
4adcho,C11355
dtdpglu,C00842
rhcys,C03539
ura,C00106
udcpp,C00348
camp,C00575
uri,C00299;C16745
h2s,C00283
h2o,C00001;C01328
tartr__L,C00898
f6p,C00085
8aonn,C01092
2p4c2me,C11436
10fthf,C00234
dgmp,C00362
mg2,C00305
cdp,C00112
thfglu,C09332
ichor,C00885
ser__L,C00065
q8,C17569
ser__D,C00740
dcmp,C00239
copre8,C11545
prpp,C00119
copre5,C11541
copre4,C11540
tyr__L,C00082
xmp,C00655
prlp,C04916
copre3,C11539
copre2,C11538
hdca,C00249
sl26da,C04421
uppg1,C05766
uppg3,C01051
25drapp,C01304
fadh2,C01352
23dhdp,C03340
leu__L,C00123
cobya,C05773
udpg,C00029
4r5au,C04732
h,C00080
mhpglu,C04489
cobalt2,C00175;C19171
quln,C03722
3dhq,C00944
crn,C00318
oxa,C00209
dump,C00365
thmmp,C01081
alac__S,C06010
btn,C00120
co2,C00011
hdcea,C08362
2pglyc,C00988
glyclt,C00160
pphn,C00254
nadph,C00005
hisp,C01100
acg5p,C04133
asn__L,C00152
dctp,C00458
tsul,C00320;C05529
uacgam,C00043
gdpddman,C01222
glcn,C00257
2pg,C00631
glu5p,C03287
sbzcoa,C03160
amet,C00019
pyam5p,C00647
35cgmp,C00942
decda_tb,C20370
decdpr_tb,C20352
octdp,C04146
coa,C00010
s,C00087
lys__L,C00047
s7p,C05382;C20956
ohpb,C06054
lpro,C02051
dhna,C03657
co,C00237
cl,C00698;C01327
dutp,C00460
acald,C00084
sheme,C00748
anth,C00108
dtmp,C00364
utp,C00075
e4p,C00279;C03109
mmcoa__R,C01213
hcys__L,C00155
23dhmb,C04272
grdp,C00341
mi3p__D,C04006
damp,C00360
orot5p,C01103
dtdp,C00363
dhap,C00111
xan,C00385
gam6p,C00352
pi,C00009
3psme,C01269
gar,C03838
pydx5p,C00018
trdox,C00343
gal,C00124
pnto__R,C00864
lpam,C00248
gmp,C00144
ncam,C00153
ile__L,C00407
argsuc,C03406
air,C03373
lcts,C00243
gthox,C00127
fum,C00122
ala__L,C00041
ala__D,C00133
glu__D,C00217
2mop,C00349
codhpre6,C11543
glu__L,C00025
pap,C00054
4h2opntn,C03589
3dhsk,C02637
glycogen,C00182
dhf,C00415
5odhf2a,C03586
dhlpro,C02972
glyc3p,C00093
pac,C00548;C07086;C15583
aicar,C04677
cyst__L,C02291
4ahmmp,C01279
sucarg,C03296
nicrnt,C01185
3php,C03232
maltpt,C06218
acglu,C00624
nad,C00003
rdmbzi,C05775
no,C00533
thm,C00378
gal1p,C00446;C03384
thf,C00101
pan4p,C01134
dadp,C00206
gsn,C00387
gdp,C00035
oxalcoa,C00313
tre6p,C00689
6pgc,C00345
pre6a,C06320
6pgl,C01236
cys__L,C00097
g3p,C00118;C00661
spmd,C00315
ptth,C00831
ugmda,C04882
adp,C00008
trnaala,C01635
thr__L,C00188
imacp,C01267
ade,C00147
adn,C00212
ipdp,C00129
3ddgc,C03926
id3acald,C00637
icit,C00311
13dpg,C00236
amp,C00020
3pg,C00197;C00597
4c2me,C11435
phpyr,C00166;C02763
cu2,C00070
met__L,C00073
amob,C04425
trp__L,C00078
mndn,C05377
acser,C00979
acac,C00164
g3pe,C01233
pre3b,C06406
pre3a,C05772
alaala,C00993
2ahbut,C00659;C06006
indole,C00463
26dap_LL,C00666
ump,C00105
for,C00058
ribflv,C00255
pep,C00074
uaGgla,C04851
3ig3p,C03506
fol,C00504
skm5p,C03175
2shchc,C05817
o2,C00007
pant__R,C00522
5mta,C00170
pydxn,C00314
thmpp,C00068
23dhba,C04030
mmcoa__S,C00683;C02557
dca,C01571
5mtr,C03089
hgbam,C06503
tcynt,C01755
suchms,C01118
nh4oh,C01358
val__L,C00183
chol,C00114
cbl1,C00853
idp,C00104
chor,C00251
gam1p,C03783;C06156
5apru,C01268
accoa,C00024
meoh,C00132
adpglc,C00498
seramp,C05820
ppa,C00163
h2,C00282
ppi,C00013
asp__L,C00049
tdcoa,C02593
malthp,C06216
ACP,C00145;C00229;C00812;C01336;C04298;C11482;C16736
occoa,C01944
r5p,C03736
dtdp4d6dm,C00688
dtdp4d6dg,C11907
malcoa,C00083
2me4p,C11434
ugmd,C04877;C20886
appl,C05771
lac__L,C00186
succoa,C00091
dmbzid,C03114
etha,C00189
so3,C00094;C11481
hmbil,C01024
so4,C00059
dgdp,C00361
pmcoa,C01063
metsox_S__L,C02989;C15998;C15999
aacoa,C00332
uGgl,C05892
arg__L,C00062
prbatp,C02739
mettrna,C02430
fdp,C00354
fc1p,C01099
dhpmp,C05925
ala_B,C00099
cit,C00158
inost,C00137;C06151;C06152;C19891
uagmda,C05897
pdx5p,C00627
ac,C00033
salc,C00805
ad,C06244
duri,C00526
cbi,C05774
his__L,C00135
ins,C00294
cbp,C00169
5dglcn,C01062
23dhmp,C04104;C06007
udpglcur,C00167
thdp,C03972
nac,C00253
dxyl5p,C11437
oaa,C00036;C03981
dxyl,C06257
betald,C00576
h2mb4p,C11811
uaagmda,C05898
2dr5p,C00673
adcobhex,C06507
adocbip,C06509
btamp,C05921
gluala,C03738
pppg9,C01079
ppbng,C00931
6hmhpt,C01300
paps,C00053
agm,C00179
xtsn,C01762
cbasp,C00438
na1,C01330
glutrna,C02987
g6p,C00092
