,N0004,N0052,N0054,N0072,N0091,N0136,N0145,N0153,N0155,N0157,N1063,N1176,N1177,N1202,N1216,N1272,N1274,N1283
C05986,0,1,0,0,1,0,0,1,0,0,0,0,0,0,0,0,0,0
C00207;C00479,0,0,0,1,1,0,1,1,1,1,0,1,0,0,0,0,1,0
C06735,0,1,0,0,0,0,1,0,0,0,0,0,0,0,0,0,1,0
C06735,0,0,0,0,0,0,1,0,0,0,0,0,0,0,0,0,1,0
C00033;C00266,0,0,0,1,0,0,0,0,1,1,1,0,1,0,1,0,0,1
C00288,0,1,0,0,0,0,1,0,0,0,1,0,1,0,1,1,0,0
C01659,0,0,0,0,1,0,0,1,0,0,0,0,0,0,0,0,0,1
C00511;C00546,0,1,0,0,0,0,1,1,0,0,1,0,1,1,1,0,0,0
C01412,1,1,0,1,0,1,1,0,1,1,1,1,0,1,1,0,1,1
C15809,0,0,0,0,1,0,0,1,0,0,0,0,0,1,0,0,0,0
C01888;C03134;C05665,0,1,1,1,0,0,0,0,0,0,0,0,1,0,0,0,1,0
C00048,0,0,0,0,0,0,1,1,0,0,0,0,0,1,1,0,0,0
C18091,0,0,0,0,1,0,0,0,0,0,0,0,0,0,0,1,0,0
C00163;C00969,1,1,1,1,1,1,1,1,1,1,1,1,1,1,1,1,1,1
C00037,0,1,0,0,0,1,0,0,0,1,1,0,0,1,0,0,0,1
C00160,1,1,1,1,0,1,1,1,1,1,1,1,1,1,1,1,1,1
C00583;C02457,0,0,0,0,0,0,1,0,0,1,1,0,0,0,0,0,0,0
C02659,1,1,0,1,0,1,1,1,1,0,0,0,0,0,0,0,0,1
C00741,1,1,1,1,1,1,1,1,1,1,1,1,1,1,1,1,1,0
C02218,0,1,1,0,0,0,1,1,0,0,0,1,0,1,1,0,0,0
C00555,0,0,0,0,0,0,0,1,0,0,0,0,0,0,0,0,0,0
C00022;C00222,0,1,0,0,0,0,1,1,0,0,0,0,0,0,0,0,0,0
C00041;C00099;C00133;C00213;C01401,1,1,1,1,1,1,1,1,1,1,0,1,1,1,1,1,1,1
C00184;C00186;C00256;C00577;C01013,0,1,0,1,1,0,1,1,1,0,1,1,1,0,0,1,0,0
C00146,0,1,0,1,0,0,1,1,1,1,1,0,0,1,1,0,1,0
C11145,0,1,1,1,1,1,1,0,1,1,1,1,0,0,1,0,1,1
C01234;C17234,1,0,1,0,0,0,0,1,0,0,0,0,0,0,0,0,0,0
C00109;C00164;C00232;C06002,0,1,1,0,1,1,1,0,1,1,1,0,1,1,1,0,0,1
C00334;C03284,0,0,0,0,0,0,0,0,0,0,0,0,0,0,0,0,0,0
C00168;C00383;C01146,1,0,0,0,0,0,1,1,1,1,1,0,1,1,1,1,1,0
C00065,0,1,1,0,0,1,0,0,0,0,0,0,0,0,0,0,0,0
C00258,0,0,0,0,0,0,0,0,0,0,0,0,0,0,0,0,0,0
C00090;C00530,0,1,0,1,1,1,1,0,1,1,0,1,0,1,1,0,1,1
C05130,0,1,0,0,0,1,0,0,0,0,1,1,0,1,0,0,0,1
C03056,0,0,1,1,0,0,0,0,1,1,1,0,0,0,0,0,0,1
C03912,1,1,1,0,1,1,1,1,1,1,1,1,1,1,1,1,1,1
C00596;C07091,1,1,1,0,1,1,1,1,1,1,1,1,1,1,1,1,1,1
C00148,1,1,1,1,1,1,1,1,1,1,1,1,1,1,1,1,1,1
C00122;C01384,1,1,1,1,0,1,1,1,1,0,1,1,0,1,1,1,1,1
C00141;C03273,1,1,1,1,1,1,1,1,1,1,1,1,1,1,1,1,1,1
C00441,0,0,1,1,1,1,1,0,0,1,1,0,1,1,0,1,1,0
C00183;C00719,1,1,1,1,1,1,1,1,1,1,1,1,1,1,1,1,1,1
C00042;C02170,1,1,1,1,1,1,1,1,1,1,1,1,1,1,1,1,1,1
C00188;C00263;C05519,1,1,1,1,1,1,1,1,1,1,1,1,1,1,1,1,1,1
C00601;C06758;C07209;C07214,1,1,1,1,1,1,1,1,1,1,0,1,1,1,0,0,1,1
C00097,0,1,0,0,0,0,0,0,0,0,0,0,1,1,0,0,0,0
C09815,1,0,1,0,1,0,1,0,1,0,0,0,0,1,1,0,0,1
C00180;C00633;C03067,0,0,0,0,0,0,0,0,0,0,0,0,0,0,0,0,0,0
C00253;C06813,1,1,1,1,1,1,1,1,1,1,1,1,1,1,1,1,1,1
C03351;C06730,0,0,0,0,0,0,0,0,0,0,1,1,0,0,0,0,0,0
C05827,0,0,0,0,0,0,0,0,0,0,1,1,0,0,0,0,0,0
C02814,0,0,0,0,0,0,1,0,0,0,0,0,0,1,0,0,0,1
C03458,0,0,0,1,0,1,1,1,1,1,1,1,0,1,1,1,1,1
C20240,1,1,0,1,1,1,1,1,1,1,0,1,1,1,1,1,1,1
C00906;C05715,0,1,1,1,1,0,1,1,1,1,1,1,1,0,1,0,1,1
C09822,0,1,1,1,1,0,1,1,1,0,0,1,0,1,0,0,1,0
C04281,0,0,0,0,0,0,0,0,0,0,0,0,0,0,0,0,0,0
C05936,0,0,0,0,0,0,0,0,0,0,0,0,0,0,0,0,0,0
C00433;C00490;C02226,1,1,0,1,1,1,1,0,1,0,1,1,1,1,1,1,1,0
C00233;C00671;C06102;C12314,1,1,1,1,1,1,1,1,1,1,1,1,1,1,1,1,1,1
C00430;C01157;C01165;C03741,1,1,1,1,1,1,1,1,1,1,1,1,1,1,1,1,1,1
C00123;C00407,1,1,1,1,1,1,1,1,1,1,1,1,1,1,1,1,1,1
C00436,1,1,1,1,1,1,1,1,1,1,1,1,1,1,1,1,1,1
C00489;C00900;C03589;C04181;C06010,1,1,1,1,1,1,1,1,1,1,1,1,1,1,1,1,1,1
C00152;C01043;C02642,1,1,1,1,1,1,1,1,1,0,1,1,1,1,1,1,1,1
C06103,1,1,1,1,1,1,1,1,1,1,1,1,1,1,1,1,1,1
C00077,1,1,1,1,1,1,1,1,1,1,1,1,1,1,1,1,1,1
C00049,0,1,0,0,1,0,0,0,0,0,0,0,1,1,1,0,1,0
C00149;C00497,1,1,1,1,1,1,1,1,1,1,1,1,1,1,1,1,1,1
C01801;C04039;C04272,1,1,1,1,1,1,1,1,1,1,1,1,1,1,1,1,1,1
C00108;C00568,1,1,1,1,1,1,1,1,1,1,1,1,1,1,1,1,1,1
C07054,1,1,1,1,1,1,1,1,1,1,1,1,1,1,1,1,1,1
C00860,1,1,1,1,0,0,1,1,1,1,1,1,0,1,1,0,1,1
C02480;C03586;C14610,0,0,1,1,0,0,1,0,1,0,1,0,0,0,0,0,1,1
C02946;C04076,1,1,1,1,1,1,1,1,1,1,1,1,1,1,1,0,1,1
C00026,1,1,1,0,1,1,1,1,1,1,1,0,1,1,1,1,1,1
C00966;C06006;C06104;C14463,1,1,1,1,1,1,1,1,1,1,1,1,1,1,1,1,1,1
C00064;C00819;C05100,1,1,1,1,1,1,1,1,1,1,1,1,0,1,1,1,1,1
C00047,1,1,1,1,1,1,1,1,1,1,1,1,1,1,1,1,1,1
C00025;C00217;C00302;C00979;C05938,0,0,0,0,0,0,0,0,0,0,0,0,0,0,0,0,0,0
C02612;C06032,1,1,1,1,1,1,1,1,1,1,1,1,1,1,1,1,1,1
C00522;C06007,1,1,1,1,1,1,1,1,1,1,1,1,1,1,1,1,0,1
C00073,0,1,0,0,0,1,0,0,1,1,0,0,0,0,1,0,0,1
C02646;C05629,1,1,1,1,0,0,0,1,1,1,0,0,0,1,0,0,1,1
C02576;C11383,1,1,0,1,0,1,1,0,1,0,1,0,0,0,1,0,1,0
C00242,1,1,1,1,1,1,1,1,1,1,1,1,1,1,1,1,1,1
C00385,1,1,1,1,1,0,1,1,1,1,1,1,1,1,1,1,1,1
C04043,1,1,0,1,1,1,1,1,1,1,1,1,1,1,1,1,1,1
C01962,0,0,0,0,0,0,0,0,0,0,0,0,0,0,0,0,0,0
C00606,0,0,0,1,0,0,0,0,0,1,0,0,1,0,0,0,1,0
C16283,1,1,0,0,0,1,0,0,0,0,0,1,0,0,0,0,0,0
C00632,0,1,1,1,1,1,1,0,1,0,1,1,1,1,1,0,1,1
C02876,0,1,1,1,1,1,1,1,1,1,1,0,1,1,1,1,1,1
C09848;C11384,1,0,1,0,0,0,0,0,0,0,0,1,1,0,1,0,0,0
C00135,1,1,1,1,1,1,1,1,1,1,1,1,1,1,1,1,1,1
C04112;C06321,1,1,1,1,1,1,1,1,1,1,1,1,1,1,1,0,1,1
C09849;C11386,1,0,0,1,0,0,0,0,0,0,0,1,0,0,0,1,0,0
C02222,1,1,1,0,1,1,1,1,1,0,1,1,1,1,1,1,1,1
C02631,1,1,1,1,1,1,1,1,0,1,1,1,1,1,1,1,1,1
C16474;C16475;C16476;C16477,1,1,0,1,1,0,1,0,1,1,0,1,0,0,0,0,0,1
C00322;C00846;C04287;C06891;C16159,1,1,1,1,1,1,1,1,1,1,1,1,1,1,1,1,1,1
C00993;C06442;C19929,1,1,1,1,1,1,1,1,1,1,1,1,1,1,1,1,1,1
C00956;C01077,1,1,1,1,1,1,1,1,1,1,1,1,1,1,1,1,1,1
C19729,1,0,1,0,0,1,1,0,1,0,1,1,0,0,0,0,0,1
C00079;C02265,1,1,1,1,1,1,1,1,1,1,1,1,1,1,1,1,1,1
C00250;C12323,1,1,1,1,1,1,1,1,1,1,1,1,1,1,1,1,1,1
C05587,0,1,0,1,1,1,1,1,1,1,1,1,1,1,1,0,1,1
C00074,1,1,1,1,1,1,1,1,1,1,1,1,1,1,1,1,1,1
C00544;C05577,0,0,1,1,1,1,1,0,1,1,1,1,1,0,1,0,1,0
C16285,0,0,0,0,0,0,0,0,0,0,0,0,0,0,0,0,0,0
C00314;C00547,0,0,0,0,0,0,0,0,0,0,1,0,0,0,0,0,0,0
C00111;C00118,1,0,0,0,1,0,0,0,0,0,0,1,0,0,1,0,0,0
C07276;C16462;C19082,1,1,0,0,1,0,0,1,0,0,1,1,1,1,1,0,0,0
C03972,1,1,1,1,0,1,1,1,1,1,1,1,1,1,1,1,1,1
C00093,1,0,1,1,1,1,1,0,1,1,0,1,1,1,1,1,0,1
C02637;C18306,0,1,0,1,1,1,1,1,1,1,1,1,1,1,1,1,1,1
C01250,0,1,1,1,0,1,1,0,1,1,1,0,0,1,1,0,0,1
C00417,1,1,1,1,1,1,1,1,1,0,1,1,1,1,1,1,1,0
C00493;C04236;C18307,1,1,1,1,1,1,1,1,1,1,1,1,1,1,1,1,1,1
C00437,1,1,1,1,1,1,1,1,1,1,1,1,1,1,1,1,1,1
C00062,0,1,1,1,1,1,1,1,1,1,1,1,1,1,1,1,1,1
C00327,1,1,1,1,1,1,1,1,1,1,1,1,1,1,1,1,0,1
C02670;C04349;C06033,1,1,1,1,1,1,1,1,1,0,1,1,1,1,1,1,1,1
C02504;C04411,1,1,1,1,1,1,1,1,1,1,1,1,1,1,1,1,1,1
C01586,1,1,1,1,1,1,1,1,1,1,1,1,1,1,1,1,1,1
C00031;C00095;C00124;C00137;C00159;C00221;C00267;C00984;C02336;C19891,0,1,0,1,0,0,1,1,1,1,1,0,1,1,1,0,0,0
C00082,1,1,1,1,1,1,1,1,1,1,1,1,1,1,1,1,1,1
C00392;C00794,1,1,1,1,1,1,1,1,1,1,1,1,1,1,1,1,1,1
C00788;C05589,1,0,1,0,0,1,0,0,1,0,1,1,1,1,1,1,1,1
C15556,0,1,1,1,0,0,1,0,0,0,1,0,0,0,0,0,0,0
C01005,0,0,0,0,0,0,0,0,0,0,0,0,0,0,0,0,0,0
C00197;C00631,0,0,0,0,0,0,0,0,0,0,0,0,0,0,0,0,0,0
C20258,1,1,1,1,1,1,1,1,1,1,1,1,1,1,1,1,1,1
C01092,0,1,0,1,0,1,1,1,1,1,0,0,1,1,0,0,1,0
C04225,1,1,0,0,0,0,1,0,0,0,0,1,0,1,1,0,0,0
C14800,0,1,0,0,0,0,1,0,1,0,1,0,0,1,0,0,0,0
C00624,1,1,1,1,1,1,1,1,1,1,1,1,1,1,1,1,1,1
C00944;C05601;C06201,0,0,0,0,0,0,0,0,0,0,0,0,0,0,0,0,0,0
C00666;C00680,1,1,1,1,1,1,1,1,1,1,1,1,1,1,1,1,1,1
C05635;C16596,1,1,1,1,1,1,1,0,1,1,1,1,1,1,1,1,1,1
C00158;C00311;C00679;C02780;C03921,0,0,0,0,0,0,0,0,0,0,0,0,0,0,0,0,0,0
C00905;C01062;C15673,0,0,0,0,0,0,0,0,0,0,0,0,0,0,0,0,0,0
C11429;C11431;C11432,1,0,0,0,0,0,0,1,0,0,1,0,0,1,0,0,0,0
C16586,1,0,1,0,1,0,1,1,1,1,0,0,1,1,1,1,0,1
C00257;C00514;C00770;C00800;C00880,1,1,1,1,1,1,1,1,1,1,1,1,1,1,1,1,1,1
C05335,0,1,0,0,1,0,1,1,1,1,1,0,0,1,0,0,0,1
C16362,1,1,1,0,1,1,1,1,1,1,0,1,1,1,1,1,1,1
C05824,0,0,0,0,0,1,0,0,0,0,0,0,0,1,0,0,0,0
C05364,1,1,1,1,1,0,1,0,1,1,1,1,0,0,0,1,1,1
C00078,1,1,1,1,1,1,1,1,1,1,1,1,1,1,1,1,1,1
C18305;C18310,1,0,1,0,0,1,0,0,0,0,0,0,0,0,0,1,0,0
C02225;C04593,1,1,1,1,1,1,1,1,1,1,1,1,1,1,1,1,1,1
C14801,0,0,0,1,0,0,1,0,1,0,0,0,0,1,0,0,0,0
C00818,0,0,0,0,1,0,0,0,0,0,0,0,0,0,0,0,0,0
C12624,0,0,0,0,0,0,0,0,0,0,0,0,0,0,0,0,0,0
C03082,1,1,1,1,1,1,1,1,1,1,1,1,1,1,1,1,1,1
C06054,0,0,0,0,0,0,0,1,0,0,0,0,0,0,0,0,1,0
C06055,1,1,1,1,1,1,1,1,1,1,0,1,0,1,1,0,1,1
C01233,1,1,1,1,1,1,1,1,1,1,1,1,1,1,1,1,1,1
C11434,0,0,0,0,0,0,0,0,0,0,1,0,0,0,0,0,0,0
C15532,1,1,1,1,1,1,1,1,1,1,1,1,1,1,1,1,1,1
C04556,0,0,0,0,0,0,0,0,0,0,1,0,0,0,0,0,0,0
C01118,1,0,0,0,1,0,0,1,1,0,1,1,1,1,1,0,0,1
C00864,1,1,1,1,1,1,1,1,1,1,1,1,1,1,1,1,1,1
C00140;C00645;C01132,0,1,1,0,1,1,1,0,1,0,1,0,1,1,1,1,1,1
C00542;C02291,0,1,1,1,1,0,1,0,1,1,1,1,1,1,1,0,1,1
C12835,1,0,1,0,1,0,1,0,1,0,1,0,0,0,1,0,1,1
C00251;C00254;C00885,1,0,1,1,1,1,1,1,1,1,1,1,1,1,1,1,1,1
C00931,1,1,1,1,1,1,1,1,1,1,0,1,1,1,1,1,1,1
C00826,1,1,1,1,1,1,1,1,1,1,1,1,1,1,1,1,1,1
C00881,1,0,1,1,1,1,1,1,1,1,1,1,1,1,1,1,1,1
C00526,0,0,0,0,0,0,0,0,1,0,0,0,0,1,0,0,0,0
C00117;C00199;C00231;C00620;C01101;C06441,1,0,1,0,0,0,0,1,1,0,0,0,0,1,1,0,0,1
C20463,0,1,1,1,1,0,1,0,1,0,1,1,1,1,1,0,1,0
C00491,0,0,0,1,1,0,1,1,0,0,0,0,0,0,0,0,1,0
C05817,0,0,0,0,0,0,0,0,0,0,0,0,0,0,0,0,0,0
C01131,0,1,1,0,1,0,1,0,1,0,1,1,0,1,1,1,0,0
C00299,1,1,1,1,1,1,1,1,1,1,1,1,1,1,1,1,1,1
C00018,0,1,0,1,0,0,1,1,0,1,0,0,0,0,0,0,1,1
C00249,0,1,0,0,0,0,0,0,1,0,0,0,0,0,0,0,0,0
C00352;C06156;C12213;C12214,0,1,1,1,1,1,1,1,1,1,1,1,1,1,1,1,1,1
C00085;C00092;C00103;C00275;C00446;C00636;C00668;C01094;C01097;C01172;C01177;C02962;C03267;C03546;C04006;C05345;C18096,1,1,1,0,1,1,1,1,1,1,1,1,1,1,1,1,1,1
C03539,0,0,0,0,0,0,0,0,0,0,0,0,0,0,0,0,0,0
C00212;C00330,0,0,0,0,0,0,0,0,0,0,0,0,0,0,0,0,0,0
C00294,0,0,0,0,0,0,0,0,0,0,0,0,0,0,0,0,0,0
C06186,0,0,0,0,0,0,1,0,0,0,1,0,0,0,0,0,0,0
C16551,0,0,0,0,1,0,1,0,0,1,0,0,0,0,0,0,0,0
C05775,0,1,1,1,0,0,1,1,1,0,1,1,1,1,1,1,0,1
C01595,0,1,0,1,0,0,1,0,1,0,0,0,0,0,0,0,0,0
C00376,1,1,0,1,0,1,1,0,1,1,1,1,0,0,0,1,0,1
C04462,0,0,0,0,0,0,1,1,0,0,0,0,0,0,0,0,0,0
C02713,0,0,0,0,0,0,0,0,1,0,0,0,1,1,1,1,0,1
C00357;C04257;C04501,1,1,1,1,1,1,1,1,1,1,1,1,1,1,1,1,1,1
C05139,0,0,0,1,1,1,0,0,1,1,0,0,0,1,1,1,0,0
C05695,1,1,1,1,0,1,1,1,0,1,1,1,0,1,0,0,1,1
C04640,0,1,0,1,0,0,1,1,0,1,0,0,0,1,0,0,1,0
C00410,0,0,0,1,0,0,0,0,0,0,0,0,0,1,1,0,0,1
C04793,0,1,0,1,0,0,1,0,0,0,1,0,0,0,0,0,1,1
C04742;C04805,0,1,0,0,0,0,1,0,1,1,1,1,1,0,1,1,1,0
C00055,1,1,1,1,1,1,1,1,1,1,1,1,1,1,1,1,1,1
C05839,1,1,0,1,0,1,1,1,1,1,1,0,0,1,1,0,1,1
C16519,0,0,0,0,0,0,0,0,0,0,1,0,0,1,0,0,0,0
C00575,0,1,1,0,0,1,1,0,1,0,1,1,1,1,1,1,0,1
C05356;C05966,1,1,0,1,1,1,1,1,1,1,1,1,1,1,1,1,0,1
C00354;C03693;C03785;C05378,0,0,0,1,0,0,1,1,0,0,0,0,0,0,0,0,1,0
C00089;C00185;C00208;C01083;C01235;C05400;C05402,1,1,1,1,1,1,1,1,1,1,1,1,1,1,1,1,1,1
C05399,1,1,1,1,0,0,1,1,1,1,1,1,0,1,1,0,1,1
C00942,1,1,1,1,1,1,1,0,1,1,0,0,1,1,1,1,1,1
C19588,0,1,0,1,0,0,1,1,1,0,1,0,1,1,1,1,1,0
C00020;C00362,1,1,1,1,1,1,1,1,1,1,1,1,1,1,1,1,1,1
C05483,0,0,0,1,0,1,1,0,0,0,0,0,1,0,0,0,0,0
C01304,0,0,0,0,0,0,1,1,0,1,1,0,0,1,1,0,1,1
C04807,1,1,1,1,0,1,1,1,1,1,0,0,0,1,1,0,1,1
C04454,0,1,0,1,0,0,1,1,1,1,0,0,0,0,1,0,1,0
C00735,0,1,0,1,0,0,1,0,1,0,0,0,0,1,1,0,0,0
C00144;C18239,1,1,1,1,1,1,1,1,1,1,1,1,1,1,1,1,1,1
C19154,1,1,1,1,1,1,1,1,1,1,1,1,1,1,1,1,1,1
C00655,1,1,1,0,0,0,1,0,1,1,0,0,0,0,1,0,1,1
C05470;C05489,0,1,0,0,1,0,0,1,0,1,0,0,0,1,1,0,0,0
C05472;C05481,0,0,0,0,0,0,0,0,0,0,0,0,0,0,0,0,0,0
C16698,0,1,1,1,1,1,1,1,1,1,1,1,1,1,1,1,1,1
C00255,0,1,1,1,0,0,1,1,1,1,0,1,1,0,0,0,1,0
C00448;C16826,0,0,0,0,0,0,0,0,1,0,0,0,1,1,0,0,0,0
C01346,0,0,0,0,1,0,1,0,1,1,0,0,0,0,0,0,0,0
C02528;C04483,0,0,1,0,0,1,0,1,0,1,1,1,0,1,0,0,1,0
C00363,0,0,1,1,0,0,1,1,1,0,0,0,1,1,1,0,1,1
C00695,0,0,0,0,0,0,0,0,0,0,0,0,0,0,0,0,0,0
C00689;C02995;C20237,1,1,1,1,1,1,1,0,1,1,0,1,1,1,1,1,1,1
C00008;C00054;C00361,1,1,1,1,1,1,1,1,1,1,1,1,1,1,1,1,1,1
C04554,0,0,0,0,0,0,0,0,1,0,1,1,0,0,0,1,1,0
C13309,0,1,0,0,0,1,0,0,1,0,1,1,1,0,0,0,0,0
C00035,1,1,1,1,1,1,1,1,1,1,1,1,1,1,1,1,1,1
C05691,0,1,1,1,1,1,1,1,1,1,0,0,1,1,1,0,1,1
C05464;C05466,1,0,0,1,0,0,0,0,1,0,0,1,0,1,0,0,0,0
C02059,1,1,0,1,0,0,0,1,1,0,0,0,1,0,0,0,1,0
C00460,0,0,0,0,0,0,0,0,0,0,0,0,0,0,0,0,0,0
C06717,1,1,1,1,1,1,1,1,1,1,0,1,0,1,1,1,1,1
C05951,0,1,1,0,0,1,0,1,1,0,0,1,0,1,0,0,1,1
C00492;C05404,1,1,1,1,1,0,1,0,1,1,1,0,0,1,0,0,0,0
C00002;C00286,0,0,0,0,0,0,1,0,0,0,0,0,0,0,0,0,0,0
C05122,0,0,0,0,0,0,0,0,1,0,1,0,0,0,0,0,1,0
C18237,0,0,0,0,0,0,1,1,0,0,1,0,0,0,0,0,0,0
C00700,0,1,0,0,0,0,0,0,0,1,0,0,0,0,0,0,0,0
C00688;C11907,0,0,0,0,0,0,0,0,0,0,0,0,0,1,0,1,0,0
C03187;C03319,0,0,1,0,1,0,0,0,1,1,0,1,1,0,0,0,0,0
C00029;C00052;C03733,0,1,1,0,0,0,1,0,1,1,0,0,1,1,0,0,1,1
C00498,0,0,0,0,0,0,0,0,0,0,0,0,0,0,1,0,0,1
C11436,0,1,0,1,0,0,1,1,0,1,0,0,0,0,0,0,1,0
C01228,0,1,1,0,0,1,1,1,1,0,0,1,1,1,1,1,0,1
C00043,0,1,0,1,0,0,1,1,1,1,0,1,0,1,0,0,1,1
C00127,0,0,0,0,0,0,0,0,1,0,0,0,1,1,0,0,0,0
C00004,1,0,0,0,0,0,1,0,0,0,1,0,0,1,0,0,0,0
C01613,0,0,1,0,0,0,1,0,1,1,1,1,0,1,0,0,0,0
C01217,1,0,0,1,0,0,0,0,0,0,1,0,0,0,0,0,0,0
C04377,0,0,0,0,0,0,1,0,0,0,0,0,0,0,0,0,0,0
C15672,0,0,0,0,0,0,1,0,0,0,0,0,0,0,0,0,0,0
C02463,0,0,0,0,0,0,0,0,0,0,0,0,0,0,0,0,0,0
C16468,0,0,0,1,0,0,0,0,0,0,0,0,0,0,0,0,0,0
C05276,0,0,0,0,0,0,0,0,0,0,0,0,0,0,0,0,0,0
C01944,0,0,0,0,0,0,0,0,0,0,0,0,1,0,0,0,0,0
C06319,0,0,0,0,0,0,0,1,0,0,0,0,0,0,0,0,0,0
C05267,0,0,0,0,0,0,0,0,1,0,0,0,0,0,0,0,0,0
C05266,0,0,0,1,0,0,0,0,0,1,0,0,0,0,0,0,0,1
C20750,0,0,0,0,0,0,0,0,0,0,0,0,0,0,0,0,0,0
C00748,0,0,0,0,0,0,0,0,0,0,0,0,0,0,0,0,0,0
C06416,0,0,0,0,0,0,0,0,0,0,1,0,1,0,0,0,0,0
C11539,0,0,0,0,0,0,0,1,0,0,0,0,0,0,0,0,0,0
C11540,0,0,0,0,0,0,0,0,0,0,1,0,0,0,0,0,0,0
C16339,0,0,0,0,0,0,0,0,0,0,1,0,0,0,0,0,0,0
C05263;C16242,0,0,0,0,0,0,0,0,0,0,0,0,0,0,0,0,0,0
C16242,0,0,0,0,1,0,0,1,0,0,0,0,0,0,0,0,0,0
C04675,0,0,0,0,0,0,0,0,0,0,0,0,0,0,0,1,0,1
