,growth_rate_mean,growth_rate_lb,growth_rate_ub,lineage
N0004,0.0212394289320916,0.0165513142164274,0.0259275436477559,3
N0052,0.0136406890427429,0.00935969616824345,0.0179216819172423,2
N0054,0.0166317044855371,0.0120230468568286,0.0212403621142456,3
N0072,0.0191765221150773,0.0147957533030302,0.0235572909271243,1
N0091,0.0195441327086288,0.0163627988221535,0.0227254665951041,6
N0136,0.0217951390889827,0.0175125057527163,0.0260777724252490,4
N0145,0.0183179218511080,0.0130947813808556,0.0235410623213604,2
N0153,0.0196065345408781,0.0151113875219920,0.0241016815597643,1
N0155,0.0189760435321397,0.0132042400478602,0.0247478470164193,2
N0157,0.0186956042953728,0.0125031614242094,0.0248880471665362,1
N1063,0.0284696284125810,0.0222092353182947,0.0347300215068673,5
N1176,0.0250926122062286,0.0210370816591961,0.0291481427532610,5
N1177,0.0226257257284973,0.0184927976303457,0.0267586538266489,6
N1202,0.0198856593237371,0.0147462261759953,0.0250250924714789,6
N1216,0.0254296676317142,0.0195323893713924,0.0313269458920359,4
N1272,0.0218796293613191,0.0161016472345798,0.0276576114880584,5
N1274,0.0155927926788896,0.0112525623464236,0.0199330230113556,3
N1283,0.0272958829119289,0.0222228826026494,0.0323688832212085,4
